manifoldcf-dev mailing list archives

Site index · List index
Message view « Date » · « Thread »
Top « Date » · « Thread »
From Apache Jenkins Server <jenk...@builds.apache.org>
Subject Build failed in Jenkins: ManifoldCF-mvn #595
Date Fri, 23 Jun 2017 01:25:59 GMT
See <https://builds.apache.org/job/ManifoldCF-mvn/595/display/redirect?page=changes>

Changes:

[kwright] More name stuffing work

[kwright] Update CHANGES.txt to match reality.

------------------------------------------
[...truncated 80.62 KB...]
[INFO] Compiling 2 source files to <https://builds.apache.org/job/ManifoldCF-mvn/ws/framework/combined-service/target/classes>
[INFO] 
[INFO] --- maven-resources-plugin:2.5:testResources (default-testResources) @ mcf-combined-service
---
[debug] execute contextualize
[INFO] Using 'UTF-8' encoding to copy filtered resources.
[INFO] skip non existing resourceDirectory <https://builds.apache.org/job/ManifoldCF-mvn/ws/framework/combined-service/src/test/resources>
[INFO] Copying 3 resources
[INFO] 
[INFO] --- maven-compiler-plugin:2.3.2:testCompile (default-testCompile) @ mcf-combined-service
---
[INFO] No sources to compile
[INFO] 
[INFO] --- maven-surefire-plugin:2.17:test (default-test) @ mcf-combined-service ---
[INFO] Tests are skipped.
[INFO] 
[INFO] --- maven-war-plugin:2.3:war (default-war) @ mcf-combined-service ---
[INFO] Packaging webapp
[INFO] Assembling webapp [mcf-combined-service] in [<https://builds.apache.org/job/ManifoldCF-mvn/ws/framework/combined-service/target/mcf-combined-service-2.8-SNAPSHOT]>
[INFO] Processing war project
[INFO] Copying webapp resources [<https://builds.apache.org/job/ManifoldCF-mvn/ws/framework/combined-service/src/main/webapp]>
[INFO] Processing overlay [ id org.apache.manifoldcf:mcf-crawler-ui]
[INFO] Processing overlay [ id org.apache.manifoldcf:mcf-crawler-ui]
[INFO] Webapp assembled in [1540 msecs]
[INFO] Building war: <https://builds.apache.org/job/ManifoldCF-mvn/ws/framework/combined-service/target/mcf-combined-service-2.8-SNAPSHOT.war>
[INFO] 
[INFO] --- maven-site-plugin:3.4:attach-descriptor (attach-descriptor) @ mcf-combined-service
---
[INFO] 
[INFO] >>> maven-source-plugin:2.4:jar (attach-sources) @ mcf-combined-service >>>
[INFO] 
[INFO] <<< maven-source-plugin:2.4:jar (attach-sources) @ mcf-combined-service <<<
[INFO] 
[INFO] --- maven-source-plugin:2.4:jar (attach-sources) @ mcf-combined-service ---
[INFO] Building jar: <https://builds.apache.org/job/ManifoldCF-mvn/ws/framework/combined-service/target/mcf-combined-service-2.8-SNAPSHOT-sources.jar>
[INFO] 
[INFO] --- maven-install-plugin:2.5.2:install (default-install) @ mcf-combined-service ---
[INFO] Installing <https://builds.apache.org/job/ManifoldCF-mvn/ws/framework/combined-service/target/mcf-combined-service-2.8-SNAPSHOT.war>
to /home/jenkins/.m2/repository/org/apache/manifoldcf/mcf-combined-service/2.8-SNAPSHOT/mcf-combined-service-2.8-SNAPSHOT.war
[INFO] Installing <https://builds.apache.org/job/ManifoldCF-mvn/ws/framework/combined-service/pom.xml>
to /home/jenkins/.m2/repository/org/apache/manifoldcf/mcf-combined-service/2.8-SNAPSHOT/mcf-combined-service-2.8-SNAPSHOT.pom
[INFO] Installing <https://builds.apache.org/job/ManifoldCF-mvn/ws/framework/combined-service/target/mcf-combined-service-2.8-SNAPSHOT-sources.jar>
to /home/jenkins/.m2/repository/org/apache/manifoldcf/mcf-combined-service/2.8-SNAPSHOT/mcf-combined-service-2.8-SNAPSHOT-sources.jar
[INFO]                                                                         
[INFO] ------------------------------------------------------------------------
[INFO] Building ManifoldCF - Test materials 2.8-SNAPSHOT
[INFO] ------------------------------------------------------------------------
[INFO] 
[INFO] --- maven-clean-plugin:2.4.1:clean (default-clean) @ mcf-test-materials ---
[INFO] Deleting <https://builds.apache.org/job/ManifoldCF-mvn/ws/test-materials/target>
[INFO] 
[INFO] --- maven-remote-resources-plugin:1.5:process (default) @ mcf-test-materials ---
[INFO] 
[INFO] --- maven-site-plugin:3.4:attach-descriptor (attach-descriptor) @ mcf-test-materials
---
[INFO] 
[INFO] >>> maven-source-plugin:2.4:jar (attach-sources) @ mcf-test-materials >>>
[INFO] 
[INFO] <<< maven-source-plugin:2.4:jar (attach-sources) @ mcf-test-materials <<<
[INFO] 
[INFO] --- maven-source-plugin:2.4:jar (attach-sources) @ mcf-test-materials ---
[INFO] 
[INFO] --- maven-install-plugin:2.5.2:install (default-install) @ mcf-test-materials ---
[INFO] Installing <https://builds.apache.org/job/ManifoldCF-mvn/ws/test-materials/pom.xml>
to /home/jenkins/.m2/repository/org/apache/manifoldcf/mcf-test-materials/2.8-SNAPSHOT/mcf-test-materials-2.8-SNAPSHOT.pom
[INFO]                                                                         
[INFO] ------------------------------------------------------------------------
[INFO] Building ManifoldCF - Test Materials - Alfresco WAR 2.8-SNAPSHOT
[INFO] ------------------------------------------------------------------------
[INFO] 
[INFO] --- maven-clean-plugin:2.4.1:clean (default-clean) @ alfresco-4-war ---
[INFO] Deleting <https://builds.apache.org/job/ManifoldCF-mvn/ws/test-materials/alfresco-4-war/target>
[INFO] 
[INFO] --- maven-remote-resources-plugin:1.5:process (default) @ alfresco-4-war ---
[INFO] 
[INFO] --- maven-resources-plugin:2.5:resources (default-resources) @ alfresco-4-war ---
[debug] execute contextualize
[INFO] Using 'UTF-8' encoding to copy filtered resources.
[INFO] Copying 1 resource
[INFO] Copying 3 resources
[INFO] 
[INFO] --- maven-compiler-plugin:2.3.2:compile (default-compile) @ alfresco-4-war ---
[INFO] No sources to compile
[INFO] 
[INFO] --- maven-resources-plugin:2.5:testResources (default-testResources) @ alfresco-4-war
---
[debug] execute contextualize
[INFO] Using 'UTF-8' encoding to copy filtered resources.
[INFO] skip non existing resourceDirectory <https://builds.apache.org/job/ManifoldCF-mvn/ws/test-materials/alfresco-4-war/src/test/resources>
[INFO] Copying 3 resources
[INFO] 
[INFO] --- maven-compiler-plugin:2.3.2:testCompile (default-testCompile) @ alfresco-4-war
---
[INFO] No sources to compile
[INFO] 
[INFO] --- maven-surefire-plugin:2.17:test (default-test) @ alfresco-4-war ---
[INFO] Tests are skipped.
[INFO] 
[INFO] --- maven-war-plugin:2.3:war (default-war) @ alfresco-4-war ---
[INFO] Packaging webapp
[INFO] Assembling webapp [alfresco-4-war] in [<https://builds.apache.org/job/ManifoldCF-mvn/ws/test-materials/alfresco-4-war/target/alfresco]>
[INFO] Processing war project
[INFO] Copying webapp resources [<https://builds.apache.org/job/ManifoldCF-mvn/ws/test-materials/alfresco-4-war/src/main/webapp]>
[INFO] Processing overlay [ id org.alfresco:alfresco]
[INFO] Webapp assembled in [27306 msecs]
[INFO] Building war: <https://builds.apache.org/job/ManifoldCF-mvn/ws/test-materials/alfresco-4-war/target/alfresco.war>
[INFO] 
[INFO] --- maven-site-plugin:3.4:attach-descriptor (attach-descriptor) @ alfresco-4-war ---
[INFO] 
[INFO] >>> maven-source-plugin:2.4:jar (attach-sources) @ alfresco-4-war >>>
[INFO] 
[INFO] <<< maven-source-plugin:2.4:jar (attach-sources) @ alfresco-4-war <<<
[INFO] 
[INFO] --- maven-source-plugin:2.4:jar (attach-sources) @ alfresco-4-war ---
[INFO] Building jar: <https://builds.apache.org/job/ManifoldCF-mvn/ws/test-materials/alfresco-4-war/target/alfresco-sources.jar>
[INFO] 
[INFO] --- maven-install-plugin:2.5.2:install (default-install) @ alfresco-4-war ---
[INFO] Installing <https://builds.apache.org/job/ManifoldCF-mvn/ws/test-materials/alfresco-4-war/target/alfresco.war>
to /home/jenkins/.m2/repository/org/apache/manifoldcf/alfresco-4-war/2.8-SNAPSHOT/alfresco-4-war-2.8-SNAPSHOT.war
[INFO] Installing <https://builds.apache.org/job/ManifoldCF-mvn/ws/test-materials/alfresco-4-war/pom.xml>
to /home/jenkins/.m2/repository/org/apache/manifoldcf/alfresco-4-war/2.8-SNAPSHOT/alfresco-4-war-2.8-SNAPSHOT.pom
[INFO] Installing <https://builds.apache.org/job/ManifoldCF-mvn/ws/test-materials/alfresco-4-war/target/alfresco-sources.jar>
to /home/jenkins/.m2/repository/org/apache/manifoldcf/alfresco-4-war/2.8-SNAPSHOT/alfresco-4-war-2.8-SNAPSHOT-sources.jar
[INFO]                                                                         
[INFO] ------------------------------------------------------------------------
[INFO] Building ManifoldCF - Connectors 2.8-SNAPSHOT
[INFO] ------------------------------------------------------------------------
[INFO] 
[INFO] --- maven-clean-plugin:2.4.1:clean (default-clean) @ mcf-connectors ---
[INFO] Deleting <https://builds.apache.org/job/ManifoldCF-mvn/ws/connectors/target>
[INFO] 
[INFO] --- maven-remote-resources-plugin:1.5:process (default) @ mcf-connectors ---
[INFO] 
[INFO] --- maven-site-plugin:3.4:attach-descriptor (attach-descriptor) @ mcf-connectors ---
[INFO] 
[INFO] >>> maven-source-plugin:2.4:jar (attach-sources) @ mcf-connectors >>>
[INFO] 
[INFO] <<< maven-source-plugin:2.4:jar (attach-sources) @ mcf-connectors <<<
[INFO] 
[INFO] --- maven-source-plugin:2.4:jar (attach-sources) @ mcf-connectors ---
[INFO] 
[INFO] --- maven-install-plugin:2.5.2:install (default-install) @ mcf-connectors ---
[INFO] Installing <https://builds.apache.org/job/ManifoldCF-mvn/ws/connectors/pom.xml>
to /home/jenkins/.m2/repository/org/apache/manifoldcf/mcf-connectors/2.8-SNAPSHOT/mcf-connectors-2.8-SNAPSHOT.pom
[INFO]                                                                         
[INFO] ------------------------------------------------------------------------
[INFO] Building ManifoldCF - Connectors - Active Directory 2.8-SNAPSHOT
[INFO] ------------------------------------------------------------------------
[INFO] 
[INFO] --- maven-clean-plugin:2.4.1:clean (default-clean) @ mcf-activedirectory-connector
---
[INFO] Deleting <https://builds.apache.org/job/ManifoldCF-mvn/ws/connectors/activedirectory/target>
[INFO] 
[INFO] --- maven-remote-resources-plugin:1.5:process (default) @ mcf-activedirectory-connector
---
[INFO] 
[INFO] --- maven-dependency-plugin:2.8:copy (copy-war) @ mcf-activedirectory-connector ---
[INFO] Configured Artifact: org.apache.manifoldcf:mcf-api-service:2.8-SNAPSHOT:war
[INFO] Configured Artifact: org.apache.manifoldcf:mcf-authority-service:2.8-SNAPSHOT:war
[INFO] Configured Artifact: org.apache.manifoldcf:mcf-crawler-ui:2.8-SNAPSHOT:war
[INFO] Copying mcf-api-service-2.8-SNAPSHOT.war to <https://builds.apache.org/job/ManifoldCF-mvn/ws/connectors/activedirectory/target/dependency/mcf-api-service.war>
[INFO] Copying mcf-authority-service-2.8-SNAPSHOT.war to <https://builds.apache.org/job/ManifoldCF-mvn/ws/connectors/activedirectory/target/dependency/mcf-authority-service.war>
[INFO] Copying mcf-crawler-ui-2.8-SNAPSHOT.war to <https://builds.apache.org/job/ManifoldCF-mvn/ws/connectors/activedirectory/target/dependency/mcf-crawler-ui.war>
[INFO] 
[INFO] --- maven-resources-plugin:2.5:resources (default-resources) @ mcf-activedirectory-connector
---
[debug] execute contextualize
[INFO] Using 'UTF-8' encoding to copy filtered resources.
[INFO] Copying 4 resources
[INFO] Copying 4 resources
[INFO] Copying 3 resources
[INFO] 
[INFO] --- maven-compiler-plugin:2.3.2:compile (default-compile) @ mcf-activedirectory-connector
---
[INFO] Compiling 3 source files to <https://builds.apache.org/job/ManifoldCF-mvn/ws/connectors/activedirectory/target/classes>
[INFO] -------------------------------------------------------------
[ERROR] COMPILATION ERROR : 
[INFO] -------------------------------------------------------------
[ERROR] Failure executing javac,  but could not parse the error:
Aborted

[INFO] 1 error
[INFO] -------------------------------------------------------------
[INFO] ------------------------------------------------------------------------
[INFO] Reactor Summary:
[INFO] 
[INFO] ManifoldCF ........................................ SUCCESS [  4.403 s]
[INFO] ManifoldCF - Framework ............................ SUCCESS [  0.055 s]
[INFO] ManifoldCF - Framework - Less Compiler ............ SUCCESS [  2.689 s]
[INFO] ManifoldCF - Framework - Core ..................... SUCCESS [  9.835 s]
[INFO] ManifoldCF - Connector-Common ..................... SUCCESS [  4.790 s]
[INFO] ManifoldCF - Framework - UI Core .................. SUCCESS [  1.639 s]
[INFO] ManifoldCF - Framework - Agents ................... SUCCESS [  3.168 s]
[INFO] ManifoldCF - Framework - Pull Agent ............... SUCCESS [  8.246 s]
[INFO] ManifoldCF - Framework - Authority Servlet ........ SUCCESS [  1.155 s]
[INFO] ManifoldCF - Framework - API Servlet .............. SUCCESS [  1.078 s]
[INFO] ManifoldCF - Framework - Authority Service ........ SUCCESS [  2.984 s]
[INFO] ManifoldCF - Framework - API Service .............. SUCCESS [  2.613 s]
[INFO] ManifoldCF - Framework - Crawler UI ............... SUCCESS [  6.037 s]
[INFO] ManifoldCF - Framework - Script Engine ............ SUCCESS [  3.205 s]
[INFO] ManifoldCF - Framework - Combined Service ......... SUCCESS [  3.896 s]
[INFO] ManifoldCF - Test materials ....................... SUCCESS [  0.036 s]
[INFO] ManifoldCF - Test Materials - Alfresco WAR ........ SUCCESS [ 34.683 s]
[INFO] ManifoldCF - Connectors ........................... SUCCESS [  0.582 s]
[INFO] ManifoldCF - Connectors - Active Directory ........ FAILURE [  3.073 s]
[INFO] ManifoldCF - Connectors - Alfresco Webscript ...... SKIPPED
[INFO] ManifoldCF - Connectors - Filesystem .............. SKIPPED
[INFO] ManifoldCF - Connectors - MetaCarta GTS ........... SKIPPED
[INFO] ManifoldCF - Connectors - HDFS .................... SKIPPED
[INFO] ManifoldCF - Connectors - jCIFS ................... SKIPPED
[INFO] ManifoldCF - Connectors - JDBC .................... SKIPPED
[INFO] ManifoldCF - Connectors - GridFS .................. SKIPPED
[INFO] ManifoldCF - Connectors - LDAP .................... SKIPPED
[INFO] ManifoldCF - Connectors - Null Authority .......... SKIPPED
[INFO] ManifoldCF - Connectors - Null Output ............. SKIPPED
[INFO] ManifoldCF - Connectors - Null Transformation ..... SKIPPED
[INFO] ManifoldCF - Connectors - RSS ..................... SKIPPED
[INFO] ManifoldCF - Connectors - SharePoint .............. SKIPPED
[INFO] ManifoldCF - Connectors - Solr .................... SKIPPED
[INFO] ManifoldCF - Connectors - Web ..................... SKIPPED
[INFO] ManifoldCF - Connectors - CMIS .................... SKIPPED
[INFO] ManifoldCF - Connectors - OpenSearchServer ........ SKIPPED
[INFO] ManifoldCF - Connectors - Wiki .................... SKIPPED
[INFO] ManifoldCF - Connectors - Alfresco ................ SKIPPED
[INFO] ManifoldCF - Connectors - ElasticSearch ........... SKIPPED
[INFO] ManifoldCF - Connectors - Dropbox ................. SKIPPED
[INFO] ManifoldCF - Connectors - GoogleDrive ............. SKIPPED
[INFO] ManifoldCF - Connectors - Jira .................... SKIPPED
[INFO] ManifoldCF - Connectors - Generic ................. SKIPPED
[INFO] ManifoldCF - Connectors - Regexp Mapper ........... SKIPPED
[INFO] ManifoldCF - Connectors - Email ................... SKIPPED
[INFO] ManifoldCF - Connectors - Amazon CloudSearch Output  SKIPPED
[INFO] ManifoldCF - Connectors - Forced metadata ......... SKIPPED
[INFO] ManifoldCF - Connectors - Tika Transformer ........ SKIPPED
[INFO] ManifoldCF - Connectors - Tika Service Transformer  SKIPPED
[INFO] ManifoldCF - Connectors - Document Filter ......... SKIPPED
[INFO] ManifoldCF - Connectors - SearchBlox .............. SKIPPED
[INFO] ManifoldCF - Connectors - Confluence Connector .... SKIPPED
[INFO] ManifoldCF - Connectors - Amazon S3 ............... SKIPPED
[INFO] ManifoldCF - Connectors - Kafka ................... SKIPPED
[INFO] ManifoldCF - Connectors - OpenNlp Extractor ....... SKIPPED
[INFO] ManifoldCF - Connectors - Nuxeo Connector ......... SKIPPED
[INFO] ManifoldCF - Connectors - Content Limiter ......... SKIPPED
[INFO] ManifoldCF - Framework - Jetty Runner ............. SKIPPED
[INFO] ------------------------------------------------------------------------
[INFO] BUILD FAILURE
[INFO] ------------------------------------------------------------------------
[INFO] Total time: 01:34 min
[INFO] Finished at: 2017-06-23T01:25:57+00:00
[INFO] Final Memory: 89M/1540M
[INFO] ------------------------------------------------------------------------
[ERROR] Failed to execute goal org.apache.maven.plugins:maven-compiler-plugin:2.3.2:compile
(default-compile) on project mcf-activedirectory-connector: Compilation failure
[ERROR] Failure executing javac,  but could not parse the error:
[ERROR] Aborted
[ERROR] -> [Help 1]
[ERROR] 
[ERROR] To see the full stack trace of the errors, re-run Maven with the -e switch.
[ERROR] Re-run Maven using the -X switch to enable full debug logging.
[ERROR] 
[ERROR] For more information about the errors and possible solutions, please read the following
articles:
[ERROR] [Help 1] http://cwiki.apache.org/confluence/display/MAVEN/MojoFailureException
[ERROR] 
[ERROR] After correcting the problems, you can resume the build with the command
[ERROR]   mvn <goals> -rf :mcf-activedirectory-connector
Build step 'Invoke top-level Maven targets' marked build as failure
[locks-and-latches] Releasing all the locks
[locks-and-latches] All the locks released

Mime
View raw message