manifoldcf-dev mailing list archives

Site index · List index
Message view « Date » · « Thread »
Top « Date » · « Thread »
From Apache Jenkins Server <jenk...@builds.apache.org>
Subject Build failed in Jenkins: ManifoldCF-mvn #586
Date Sat, 13 May 2017 01:27:22 GMT
See <https://builds.apache.org/job/ManifoldCF-mvn/586/display/redirect?page=changes>

Changes:

[Kishore] Update CHANGES.txt

[Kishore] Fix for CONNECTORS-1426
New UI doesn't handle connector javascript form checking properly

[kwright] Fix for CONNECTORS-1425

------------------------------------------
[...truncated 413.64 KB...]
[INFO] Copying 3 resources
[INFO] 
[INFO] --- maven-compiler-plugin:2.3.2:compile (default-compile) @ mcf-forcedmetadata-connector
---
[INFO] Compiling 6 source files to <https://builds.apache.org/job/ManifoldCF-mvn/ws/connectors/forcedmetadata/target/classes>
[INFO] 
[INFO] --- native2ascii-maven-plugin:1.0-beta-1:native2ascii (native2ascii-utf8) @ mcf-forcedmetadata-connector
---
[INFO] Includes: [**/*.properties]
[INFO] Excludes: []
[INFO] Processing <https://builds.apache.org/job/ManifoldCF-mvn/ws/connectors/forcedmetadata/target/classes/org/apache/manifoldcf/agents/transformation/forcedmetadata/common_zh_CN.properties>
[INFO] Processing <https://builds.apache.org/job/ManifoldCF-mvn/ws/connectors/forcedmetadata/target/classes/org/apache/manifoldcf/agents/transformation/forcedmetadata/common_ja_JP.properties>
[INFO] Processing <https://builds.apache.org/job/ManifoldCF-mvn/ws/connectors/forcedmetadata/target/classes/org/apache/manifoldcf/agents/transformation/forcedmetadata/common_es_ES.properties>
[INFO] Processing <https://builds.apache.org/job/ManifoldCF-mvn/ws/connectors/forcedmetadata/target/classes/org/apache/manifoldcf/agents/transformation/forcedmetadata/common_en_US.properties>
[INFO] 
[INFO] --- maven-resources-plugin:2.5:testResources (default-testResources) @ mcf-forcedmetadata-connector
---
[debug] execute contextualize
[INFO] Using 'UTF-8' encoding to copy filtered resources.
[INFO] skip non existing resourceDirectory <https://builds.apache.org/job/ManifoldCF-mvn/ws/connectors/forcedmetadata/connector/src/test/resources>
[INFO] Copying 3 resources
[INFO] 
[INFO] --- maven-compiler-plugin:2.3.2:testCompile (default-testCompile) @ mcf-forcedmetadata-connector
---
[INFO] Compiling 1 source file to <https://builds.apache.org/job/ManifoldCF-mvn/ws/connectors/forcedmetadata/target/test-classes>
[INFO] 
[INFO] --- maven-surefire-plugin:2.17:test (default-test) @ mcf-forcedmetadata-connector ---
[INFO] Tests are skipped.
[INFO] 
[INFO] --- maven-jar-plugin:2.3.1:jar (default-jar) @ mcf-forcedmetadata-connector ---
[INFO] Building jar: <https://builds.apache.org/job/ManifoldCF-mvn/ws/connectors/forcedmetadata/target/mcf-forcedmetadata-connector-2.8-SNAPSHOT.jar>
[INFO] 
[INFO] --- maven-site-plugin:3.4:attach-descriptor (attach-descriptor) @ mcf-forcedmetadata-connector
---
[INFO] 
[INFO] >>> maven-source-plugin:2.4:jar (attach-sources) @ mcf-forcedmetadata-connector
>>>
[INFO] 
[INFO] <<< maven-source-plugin:2.4:jar (attach-sources) @ mcf-forcedmetadata-connector
<<<
[INFO] 
[INFO] --- maven-source-plugin:2.4:jar (attach-sources) @ mcf-forcedmetadata-connector ---
[INFO] Building jar: <https://builds.apache.org/job/ManifoldCF-mvn/ws/connectors/forcedmetadata/target/mcf-forcedmetadata-connector-2.8-SNAPSHOT-sources.jar>
[INFO] 
[INFO] --- maven-failsafe-plugin:2.18.1:integration-test (integration-test) @ mcf-forcedmetadata-connector
---
[INFO] Tests are skipped.
[INFO] 
[INFO] --- maven-failsafe-plugin:2.18.1:verify (verify) @ mcf-forcedmetadata-connector ---
[INFO] Tests are skipped.
[INFO] 
[INFO] --- maven-install-plugin:2.5.2:install (default-install) @ mcf-forcedmetadata-connector
---
[INFO] Installing <https://builds.apache.org/job/ManifoldCF-mvn/ws/connectors/forcedmetadata/target/mcf-forcedmetadata-connector-2.8-SNAPSHOT.jar>
to /home/jenkins/.m2/repository/org/apache/manifoldcf/mcf-forcedmetadata-connector/2.8-SNAPSHOT/mcf-forcedmetadata-connector-2.8-SNAPSHOT.jar
[INFO] Installing <https://builds.apache.org/job/ManifoldCF-mvn/ws/connectors/forcedmetadata/pom.xml>
to /home/jenkins/.m2/repository/org/apache/manifoldcf/mcf-forcedmetadata-connector/2.8-SNAPSHOT/mcf-forcedmetadata-connector-2.8-SNAPSHOT.pom
[INFO] Installing <https://builds.apache.org/job/ManifoldCF-mvn/ws/connectors/forcedmetadata/target/mcf-forcedmetadata-connector-2.8-SNAPSHOT-sources.jar>
to /home/jenkins/.m2/repository/org/apache/manifoldcf/mcf-forcedmetadata-connector/2.8-SNAPSHOT/mcf-forcedmetadata-connector-2.8-SNAPSHOT-sources.jar
[INFO]                                                                         
[INFO] ------------------------------------------------------------------------
[INFO] Building ManifoldCF - Connectors - Tika Transformer 2.8-SNAPSHOT
[INFO] ------------------------------------------------------------------------
[INFO] 
[INFO] --- maven-clean-plugin:2.4.1:clean (default-clean) @ mcf-tika-connector ---
[INFO] Deleting <https://builds.apache.org/job/ManifoldCF-mvn/ws/connectors/tika/target>
[INFO] 
[INFO] --- maven-remote-resources-plugin:1.5:process (default) @ mcf-tika-connector ---
[INFO] 
[INFO] --- maven-dependency-plugin:2.8:copy (copy-war) @ mcf-tika-connector ---
[INFO] Configured Artifact: org.apache.manifoldcf:mcf-api-service:2.8-SNAPSHOT:war
[INFO] Configured Artifact: org.apache.manifoldcf:mcf-authority-service:2.8-SNAPSHOT:war
[INFO] Configured Artifact: org.apache.manifoldcf:mcf-crawler-ui:2.8-SNAPSHOT:war
[INFO] Copying mcf-api-service-2.8-SNAPSHOT.war to <https://builds.apache.org/job/ManifoldCF-mvn/ws/connectors/tika/target/dependency/mcf-api-service.war>
[INFO] Copying mcf-authority-service-2.8-SNAPSHOT.war to <https://builds.apache.org/job/ManifoldCF-mvn/ws/connectors/tika/target/dependency/mcf-authority-service.war>
[INFO] Copying mcf-crawler-ui-2.8-SNAPSHOT.war to <https://builds.apache.org/job/ManifoldCF-mvn/ws/connectors/tika/target/dependency/mcf-crawler-ui.war>
[INFO] 
[INFO] --- maven-resources-plugin:2.5:resources (default-resources) @ mcf-tika-connector ---
[debug] execute contextualize
[INFO] Using 'UTF-8' encoding to copy filtered resources.
[INFO] Copying 4 resources
[INFO] Copying 5 resources
[INFO] Copying 3 resources
[INFO] 
[INFO] --- maven-compiler-plugin:2.3.2:compile (default-compile) @ mcf-tika-connector ---
[INFO] Compiling 4 source files to <https://builds.apache.org/job/ManifoldCF-mvn/ws/connectors/tika/target/classes>
[INFO] 
[INFO] --- native2ascii-maven-plugin:1.0-beta-1:native2ascii (native2ascii-utf8) @ mcf-tika-connector
---
[INFO] Includes: [**/*.properties]
[INFO] Excludes: []
[INFO] Processing <https://builds.apache.org/job/ManifoldCF-mvn/ws/connectors/tika/target/classes/org/apache/manifoldcf/agents/transformation/tika/common_zh_CN.properties>
[INFO] Processing <https://builds.apache.org/job/ManifoldCF-mvn/ws/connectors/tika/target/classes/org/apache/manifoldcf/agents/transformation/tika/common_ja_JP.properties>
[INFO] Processing <https://builds.apache.org/job/ManifoldCF-mvn/ws/connectors/tika/target/classes/org/apache/manifoldcf/agents/transformation/tika/common_es_ES.properties>
[INFO] Processing <https://builds.apache.org/job/ManifoldCF-mvn/ws/connectors/tika/target/classes/org/apache/manifoldcf/agents/transformation/tika/common_en_US.properties>
[INFO] 
[INFO] --- maven-resources-plugin:2.5:testResources (default-testResources) @ mcf-tika-connector
---
[debug] execute contextualize
[INFO] Using 'UTF-8' encoding to copy filtered resources.
[INFO] Copying 3 resources
[INFO] Copying 3 resources
[INFO] 
[INFO] --- maven-compiler-plugin:2.3.2:testCompile (default-testCompile) @ mcf-tika-connector
---
[INFO] Compiling 1 source file to <https://builds.apache.org/job/ManifoldCF-mvn/ws/connectors/tika/target/test-classes>
[INFO] 
[INFO] --- maven-surefire-plugin:2.17:test (default-test) @ mcf-tika-connector ---
[INFO] Tests are skipped.
[INFO] 
[INFO] --- maven-jar-plugin:2.3.1:jar (default-jar) @ mcf-tika-connector ---
[INFO] Building jar: <https://builds.apache.org/job/ManifoldCF-mvn/ws/connectors/tika/target/mcf-tika-connector-2.8-SNAPSHOT.jar>
[INFO] 
[INFO] --- maven-site-plugin:3.4:attach-descriptor (attach-descriptor) @ mcf-tika-connector
---
[INFO] 
[INFO] >>> maven-source-plugin:2.4:jar (attach-sources) @ mcf-tika-connector >>>
[INFO] 
[INFO] <<< maven-source-plugin:2.4:jar (attach-sources) @ mcf-tika-connector <<<
[INFO] 
[INFO] --- maven-source-plugin:2.4:jar (attach-sources) @ mcf-tika-connector ---
[INFO] Building jar: <https://builds.apache.org/job/ManifoldCF-mvn/ws/connectors/tika/target/mcf-tika-connector-2.8-SNAPSHOT-sources.jar>
[INFO] 
[INFO] --- maven-failsafe-plugin:2.18.1:integration-test (integration-test) @ mcf-tika-connector
---
[INFO] Tests are skipped.
[INFO] 
[INFO] --- maven-failsafe-plugin:2.18.1:verify (verify) @ mcf-tika-connector ---
[INFO] Tests are skipped.
[INFO] 
[INFO] --- maven-install-plugin:2.5.2:install (default-install) @ mcf-tika-connector ---
[INFO] Installing <https://builds.apache.org/job/ManifoldCF-mvn/ws/connectors/tika/target/mcf-tika-connector-2.8-SNAPSHOT.jar>
to /home/jenkins/.m2/repository/org/apache/manifoldcf/mcf-tika-connector/2.8-SNAPSHOT/mcf-tika-connector-2.8-SNAPSHOT.jar
[INFO] Installing <https://builds.apache.org/job/ManifoldCF-mvn/ws/connectors/tika/pom.xml>
to /home/jenkins/.m2/repository/org/apache/manifoldcf/mcf-tika-connector/2.8-SNAPSHOT/mcf-tika-connector-2.8-SNAPSHOT.pom
[INFO] Installing <https://builds.apache.org/job/ManifoldCF-mvn/ws/connectors/tika/target/mcf-tika-connector-2.8-SNAPSHOT-sources.jar>
to /home/jenkins/.m2/repository/org/apache/manifoldcf/mcf-tika-connector/2.8-SNAPSHOT/mcf-tika-connector-2.8-SNAPSHOT-sources.jar
[INFO]                                                                         
[INFO] ------------------------------------------------------------------------
[INFO] Building ManifoldCF - Connectors - Tika Service Transformer 2.8-SNAPSHOT
[INFO] ------------------------------------------------------------------------
[INFO] 
[INFO] --- maven-clean-plugin:2.4.1:clean (default-clean) @ mcf-tika-service-connector ---
[INFO] 
[INFO] --- maven-remote-resources-plugin:1.5:process (default) @ mcf-tika-service-connector
---
[INFO] 
[INFO] --- maven-dependency-plugin:2.8:copy (copy-war) @ mcf-tika-service-connector ---
[INFO] Configured Artifact: org.apache.manifoldcf:mcf-api-service:2.8-SNAPSHOT:war
[INFO] Configured Artifact: org.apache.manifoldcf:mcf-authority-service:2.8-SNAPSHOT:war
[INFO] Configured Artifact: org.apache.manifoldcf:mcf-crawler-ui:2.8-SNAPSHOT:war
[INFO] Copying mcf-api-service-2.8-SNAPSHOT.war to <https://builds.apache.org/job/ManifoldCF-mvn/ws/connectors/tikaservice/target/dependency/mcf-api-service.war>
[INFO] Copying mcf-authority-service-2.8-SNAPSHOT.war to <https://builds.apache.org/job/ManifoldCF-mvn/ws/connectors/tikaservice/target/dependency/mcf-authority-service.war>
[INFO] Copying mcf-crawler-ui-2.8-SNAPSHOT.war to <https://builds.apache.org/job/ManifoldCF-mvn/ws/connectors/tikaservice/target/dependency/mcf-crawler-ui.war>
[INFO] 
[INFO] --- maven-resources-plugin:2.5:resources (default-resources) @ mcf-tika-service-connector
---
[debug] execute contextualize
[INFO] Using 'UTF-8' encoding to copy filtered resources.
[INFO] Copying 4 resources
[INFO] Copying 6 resources
[INFO] Copying 3 resources
[INFO] 
[INFO] --- maven-compiler-plugin:2.3.2:compile (default-compile) @ mcf-tika-service-connector
---
[INFO] Compiling 3 source files to <https://builds.apache.org/job/ManifoldCF-mvn/ws/connectors/tikaservice/target/classes>
[INFO] 
[INFO] --- native2ascii-maven-plugin:1.0-beta-1:native2ascii (native2ascii-utf8) @ mcf-tika-service-connector
---
[INFO] Includes: [**/*.properties]
[INFO] Excludes: []
[INFO] Processing <https://builds.apache.org/job/ManifoldCF-mvn/ws/connectors/tikaservice/target/classes/org/apache/manifoldcf/agents/transformation/tikaservice/common_zh_CN.properties>
[INFO] Processing <https://builds.apache.org/job/ManifoldCF-mvn/ws/connectors/tikaservice/target/classes/org/apache/manifoldcf/agents/transformation/tikaservice/common_ja_JP.properties>
[INFO] Processing <https://builds.apache.org/job/ManifoldCF-mvn/ws/connectors/tikaservice/target/classes/org/apache/manifoldcf/agents/transformation/tikaservice/common_es_ES.properties>
[INFO] Processing <https://builds.apache.org/job/ManifoldCF-mvn/ws/connectors/tikaservice/target/classes/org/apache/manifoldcf/agents/transformation/tikaservice/common_en_US.properties>
[INFO] 
[INFO] --- maven-resources-plugin:2.5:testResources (default-testResources) @ mcf-tika-service-connector
---
[debug] execute contextualize
[INFO] Using 'UTF-8' encoding to copy filtered resources.
[INFO] Copying 3 resources
[INFO] Copying 3 resources
[INFO] 
[INFO] --- maven-compiler-plugin:2.3.2:testCompile (default-testCompile) @ mcf-tika-service-connector
---
[INFO] Compiling 1 source file to <https://builds.apache.org/job/ManifoldCF-mvn/ws/connectors/tikaservice/target/test-classes>
[INFO] -------------------------------------------------------------
[ERROR] COMPILATION ERROR : 
[INFO] -------------------------------------------------------------
[ERROR] <https://builds.apache.org/job/ManifoldCF-mvn/ws/connectors/tikaservice/connector/src/test/java/org/apache/manifoldcf/agents/transformation/tika/tests/TikaParserTest.java>:[26,55]
error: cannot find symbol
[INFO] 1 error
[INFO] -------------------------------------------------------------
[INFO] ------------------------------------------------------------------------
[INFO] Reactor Summary:
[INFO] 
[INFO] ManifoldCF ........................................ SUCCESS [  4.077 s]
[INFO] ManifoldCF - Framework ............................ SUCCESS [  0.037 s]
[INFO] ManifoldCF - Framework - Less Compiler ............ SUCCESS [  2.943 s]
[INFO] ManifoldCF - Framework - Core ..................... SUCCESS [  7.486 s]
[INFO] ManifoldCF - Connector-Common ..................... SUCCESS [  3.309 s]
[INFO] ManifoldCF - Framework - UI Core .................. SUCCESS [  1.695 s]
[INFO] ManifoldCF - Framework - Agents ................... SUCCESS [  2.963 s]
[INFO] ManifoldCF - Framework - Pull Agent ............... SUCCESS [  6.584 s]
[INFO] ManifoldCF - Framework - Authority Servlet ........ SUCCESS [  0.992 s]
[INFO] ManifoldCF - Framework - API Servlet .............. SUCCESS [  1.008 s]
[INFO] ManifoldCF - Framework - Authority Service ........ SUCCESS [  2.685 s]
[INFO] ManifoldCF - Framework - API Service .............. SUCCESS [  2.200 s]
[INFO] ManifoldCF - Framework - Crawler UI ............... SUCCESS [  5.577 s]
[INFO] ManifoldCF - Framework - Script Engine ............ SUCCESS [  2.844 s]
[INFO] ManifoldCF - Framework - Combined Service ......... SUCCESS [  2.656 s]
[INFO] ManifoldCF - Test materials ....................... SUCCESS [  0.040 s]
[INFO] ManifoldCF - Test Materials - Alfresco WAR ........ SUCCESS [ 26.958 s]
[INFO] ManifoldCF - Connectors ........................... SUCCESS [  0.079 s]
[INFO] ManifoldCF - Connectors - Active Directory ........ SUCCESS [  3.366 s]
[INFO] ManifoldCF - Connectors - Alfresco Webscript ...... SUCCESS [  7.008 s]
[INFO] ManifoldCF - Connectors - Filesystem .............. SUCCESS [  2.837 s]
[INFO] ManifoldCF - Connectors - MetaCarta GTS ........... SUCCESS [  2.514 s]
[INFO] ManifoldCF - Connectors - HDFS .................... SUCCESS [  4.160 s]
[INFO] ManifoldCF - Connectors - jCIFS ................... SUCCESS [  3.018 s]
[INFO] ManifoldCF - Connectors - JDBC .................... SUCCESS [  2.611 s]
[INFO] ManifoldCF - Connectors - GridFS .................. SUCCESS [  2.313 s]
[INFO] ManifoldCF - Connectors - LDAP .................... SUCCESS [  2.225 s]
[INFO] ManifoldCF - Connectors - Null Authority .......... SUCCESS [  1.819 s]
[INFO] ManifoldCF - Connectors - Null Output ............. SUCCESS [  1.105 s]
[INFO] ManifoldCF - Connectors - Null Transformation ..... SUCCESS [  0.977 s]
[INFO] ManifoldCF - Connectors - RSS ..................... SUCCESS [  3.384 s]
[INFO] ManifoldCF - Connectors - SharePoint .............. SUCCESS [  6.905 s]
[INFO] ManifoldCF - Connectors - Solr .................... SUCCESS [  3.037 s]
[INFO] ManifoldCF - Connectors - Web ..................... SUCCESS [  3.797 s]
[INFO] ManifoldCF - Connectors - CMIS .................... SUCCESS [  2.832 s]
[INFO] ManifoldCF - Connectors - OpenSearchServer ........ SUCCESS [  2.193 s]
[INFO] ManifoldCF - Connectors - Wiki .................... SUCCESS [  2.816 s]
[INFO] ManifoldCF - Connectors - Alfresco ................ SUCCESS [  3.755 s]
[INFO] ManifoldCF - Connectors - ElasticSearch ........... SUCCESS [  4.064 s]
[INFO] ManifoldCF - Connectors - Dropbox ................. SUCCESS [  1.445 s]
[INFO] ManifoldCF - Connectors - GoogleDrive ............. SUCCESS [  1.665 s]
[INFO] ManifoldCF - Connectors - Jira .................... SUCCESS [  1.911 s]
[INFO] ManifoldCF - Connectors - Generic ................. SUCCESS [  1.837 s]
[INFO] ManifoldCF - Connectors - Regexp Mapper ........... SUCCESS [  1.169 s]
[INFO] ManifoldCF - Connectors - Email ................... SUCCESS [  1.720 s]
[INFO] ManifoldCF - Connectors - Amazon CloudSearch Output  SUCCESS [  1.450 s]
[INFO] ManifoldCF - Connectors - Forced metadata ......... SUCCESS [  2.089 s]
[INFO] ManifoldCF - Connectors - Tika Transformer ........ SUCCESS [  4.675 s]
[INFO] ManifoldCF - Connectors - Tika Service Transformer  FAILURE [  2.580 s]
[INFO] ManifoldCF - Connectors - Document Filter ......... SKIPPED
[INFO] ManifoldCF - Connectors - SearchBlox .............. SKIPPED
[INFO] ManifoldCF - Connectors - Confluence Connector .... SKIPPED
[INFO] ManifoldCF - Connectors - Amazon S3 ............... SKIPPED
[INFO] ManifoldCF - Connectors - Kafka ................... SKIPPED
[INFO] ManifoldCF - Connectors - OpenNlp Extractor ....... SKIPPED
[INFO] ManifoldCF - Connectors - Nuxeo Connector ......... SKIPPED
[INFO] ManifoldCF - Connectors - Content Limiter ......... SKIPPED
[INFO] ManifoldCF - Framework - Jetty Runner ............. SKIPPED
[INFO] ------------------------------------------------------------------------
[INFO] BUILD FAILURE
[INFO] ------------------------------------------------------------------------
[INFO] Total time: 02:42 min
[INFO] Finished at: 2017-05-13T01:27:09+00:00
[INFO] Final Memory: 129M/1568M
[INFO] ------------------------------------------------------------------------
[ERROR] Failed to execute goal org.apache.maven.plugins:maven-compiler-plugin:2.3.2:testCompile
(default-testCompile) on project mcf-tika-service-connector: Compilation failure
[ERROR] <https://builds.apache.org/job/ManifoldCF-mvn/ws/connectors/tikaservice/connector/src/test/java/org/apache/manifoldcf/agents/transformation/tika/tests/TikaParserTest.java>:[26,55]
error: cannot find symbol
[ERROR] -> [Help 1]
[ERROR] 
[ERROR] To see the full stack trace of the errors, re-run Maven with the -e switch.
[ERROR] Re-run Maven using the -X switch to enable full debug logging.
[ERROR] 
[ERROR] For more information about the errors and possible solutions, please read the following
articles:
[ERROR] [Help 1] http://cwiki.apache.org/confluence/display/MAVEN/MojoFailureException
[ERROR] 
[ERROR] After correcting the problems, you can resume the build with the command
[ERROR]   mvn <goals> -rf :mcf-tika-service-connector
Build step 'Invoke top-level Maven targets' marked build as failure
[locks-and-latches] Releasing all the locks
[locks-and-latches] All the locks released

Mime
View raw message