manifoldcf-dev mailing list archives

Site index · List index
Message view « Date » · « Thread »
Top « Date » · « Thread »
From Apache Jenkins Server <jenk...@builds.apache.org>
Subject Build failed in Jenkins: ManifoldCF-ant #522
Date Thu, 09 Feb 2017 01:39:02 GMT
See <https://builds.apache.org/job/ManifoldCF-ant/522/changes>

Changes:

[kwright] Fix for CONNECTORS-1372.

------------------------------------------
[...truncated 5105 lines...]
compile-pull-agent-tests:

jar-pull-agent-tests:

compile-script-engine-tests:

jar-script-engine-tests:

jar-tests:

test-lib:

build:

deliver-framework:
     [copy] Copying 4 files to <https://builds.apache.org/job/ManifoldCF-ant/ws/dist/web-proprietary>
     [copy] Copying 3 files to <https://builds.apache.org/job/ManifoldCF-ant/ws/dist/lib-proprietary>
     [copy] Copying 7 files to <https://builds.apache.org/job/ManifoldCF-ant/ws/dist/multiprocess-file-example>
     [copy] Copying 7 files to <https://builds.apache.org/job/ManifoldCF-ant/ws/dist/multiprocess-file-example-proprietary>
     [copy] Copying 9 files to <https://builds.apache.org/job/ManifoldCF-ant/ws/dist/multiprocess-zk-example>
     [copy] Copying 9 files to <https://builds.apache.org/job/ManifoldCF-ant/ws/dist/multiprocess-zk-example-proprietary>
     [copy] Copying 5 files to <https://builds.apache.org/job/ManifoldCF-ant/ws/dist/example>
     [copy] Copying 6 files to <https://builds.apache.org/job/ManifoldCF-ant/ws/dist/example-proprietary>
     [copy] Copying 2 files to <https://builds.apache.org/job/ManifoldCF-ant/ws/dist/script-engine>
     [copy] Copying 2 files to <https://builds.apache.org/job/ManifoldCF-ant/ws/dist/obfuscation-utility>
     [copy] Copying 2 files to <https://builds.apache.org/job/ManifoldCF-ant/ws/dist>

download-connectors-dependencies:

download-dependencies:

download-dependencies:

setup-maven-url:

download-via-maven:
      [get] Getting: https://repo1.maven.org/maven2/com/github/maoo/indexer/alfresco-indexer-webscripts-war/0.8.1/alfresco-indexer-webscripts-war-0.8.1.war
      [get] To: <https://builds.apache.org/job/ManifoldCF-ant/ws/connectors/alfresco-webscript/test-materials-proprietary/alfresco-indexer-webscripts-war-0.8.1.war>

download-alfresco-ws-client:
      [get] Getting: https://artifacts.alfresco.com/nexus/service/local/repositories/releases/content/org/alfresco/alfresco-web-service-client/4.2.c/alfresco-web-service-client-4.2.c.jar
      [get] To: <https://builds.apache.org/job/ManifoldCF-ant/ws/connectors/alfresco/lib-proprietary/alfresco-web-service-client-4.2.c.jar>

download-dependencies:

download-dependencies:

download-dependencies:

download-dependencies:

setup-maven-url:

download-via-maven:
      [get] Getting: https://repo1.maven.org/maven2/org/apache/chemistry/opencmis/chemistry-opencmis-server-inmemory/0.13.0/chemistry-opencmis-server-inmemory-0.13.0.war
      [get] To: <https://builds.apache.org/job/ManifoldCF-ant/ws/connectors/cmis/test-materials/chemistry-opencmis-server-inmemory-0.13.0.war>

download-dependencies:

download-dependencies:

download-dependencies:

download-dependencies:

download-dependencies:
    [mkdir] Created dir: <https://builds.apache.org/job/ManifoldCF-ant/ws/connectors/elasticsearch/build/download>
      [get] Getting: http://download.elasticsearch.org/elasticsearch/elasticsearch/elasticsearch-1.0.1.tar.gz
      [get] To: <https://builds.apache.org/job/ManifoldCF-ant/ws/connectors/elasticsearch/build/download/elasticsearch.tar.gz>
   [gunzip] Expanding <https://builds.apache.org/job/ManifoldCF-ant/ws/connectors/elasticsearch/build/download/elasticsearch.tar.gz>
to <https://builds.apache.org/job/ManifoldCF-ant/ws/connectors/elasticsearch/build/download/elasticsearch.tar>
    [untar] Expanding: <https://builds.apache.org/job/ManifoldCF-ant/ws/connectors/elasticsearch/build/download/elasticsearch.tar>
into <https://builds.apache.org/job/ManifoldCF-ant/ws/connectors/elasticsearch/test-materials>
      [get] Getting: https://github.com/elasticsearch/elasticsearch-mapper-attachments/archive/v2.0.0.RC1.zip
      [get] To: <https://builds.apache.org/job/ManifoldCF-ant/ws/connectors/elasticsearch/test-materials/elasticsearch-1.0.1/plugins/mapper-attachments.zip>
      [get] https://github.com/elasticsearch/elasticsearch-mapper-attachments/archive/v2.0.0.RC1.zip
permanently moved to https://github.com/elastic/elasticsearch-mapper-attachments/archive/v2.0.0.RC1.zip
      [get] https://github.com/elastic/elasticsearch-mapper-attachments/archive/v2.0.0.RC1.zip
moved to https://codeload.github.com/elastic/elasticsearch-mapper-attachments/zip/v2.0.0.RC1
    [unzip] Expanding: <https://builds.apache.org/job/ManifoldCF-ant/ws/connectors/elasticsearch/test-materials/elasticsearch-1.0.1/plugins/mapper-attachments.zip>
into <https://builds.apache.org/job/ManifoldCF-ant/ws/connectors/elasticsearch/test-materials/elasticsearch-1.0.1/plugins/mapper-attachments>

download-dependencies:

download-dependencies:

download-dependencies:

download-dependencies:

download-dependencies:

download-dependencies:

download-dependencies:

download-dependencies:

download-dependencies:

download-jcifs:

setup-maven-url:

download-via-maven:
      [get] Getting: https://repo1.maven.org/maven2/jcifs/jcifs/1.3.17/jcifs-1.3.17.jar
      [get] To: <https://builds.apache.org/job/ManifoldCF-ant/ws/connectors/jcifs/lib-proprietary/jcifs-1.3.17.jar>

download-dependencies:

download-dependencies:

download-dependencies:

download-dependencies:

setup-maven-url:

download-via-maven:
      [get] Getting: https://repo1.maven.org/maven2/org/apache/kafka/kafka_2.11/0.8.2.1/kafka_2.11-0.8.2.1.jar
      [get] To: <https://builds.apache.org/job/ManifoldCF-ant/ws/connectors/kafka/test-materials/kafka_2.11-0.8.2.1.jar>

setup-maven-url:

download-via-maven:
      [get] Getting: https://repo1.maven.org/maven2/org/apache/commons/commons-lang3/3.4/commons-lang3-3.4.jar
      [get] To: <https://builds.apache.org/job/ManifoldCF-ant/ws/connectors/kafka/test-materials/commons-lang3-3.4.jar>

setup-maven-url:

download-via-maven:
      [get] Getting: https://repo1.maven.org/maven2/com/yammer/metrics/metrics-core/2.2.0/metrics-core-2.2.0.jar
      [get] To: <https://builds.apache.org/job/ManifoldCF-ant/ws/connectors/kafka/test-materials/metrics-core-2.2.0.jar>

setup-maven-url:

download-via-maven:
      [get] Getting: https://repo1.maven.org/maven2/org/scala-lang/scala-library/2.11.0/scala-library-2.11.0.jar
      [get] To: <https://builds.apache.org/job/ManifoldCF-ant/ws/connectors/kafka/test-materials/scala-library-2.11.0.jar>

setup-maven-url:

download-via-maven:
      [get] Getting: https://repo1.maven.org/maven2/net/sf/jopt-simple/jopt-simple/3.2/jopt-simple-3.2.jar
      [get] To: <https://builds.apache.org/job/ManifoldCF-ant/ws/connectors/kafka/test-materials/jopt-simple-3.2.jar>

setup-maven-url:

download-via-maven:
      [get] Getting: https://repo1.maven.org/maven2/org/scala-lang/modules/scala-xml_2.11/1.0.4/scala-xml_2.11-1.0.4.jar
      [get] To: <https://builds.apache.org/job/ManifoldCF-ant/ws/connectors/kafka/test-materials/scala-xml_2.11-1.0.4.jar>

setup-maven-url:

download-via-maven:
      [get] Getting: https://repo1.maven.org/maven2/org/scala-lang/modules/scala-parser-combinators_2.11/1.0.4/scala-parser-combinators_2.11-1.0.4.jar
      [get] To: <https://builds.apache.org/job/ManifoldCF-ant/ws/connectors/kafka/test-materials/scala-parser-combinators_2.11-1.0.4.jar>

setup-maven-url:

download-via-maven:
      [get] Getting: https://repo1.maven.org/maven2/com/101tec/zkclient/0.6/zkclient-0.6.jar
      [get] To: <https://builds.apache.org/job/ManifoldCF-ant/ws/connectors/kafka/test-materials/zkclient-0.6.jar>

download-dependencies:

download-dependencies:

download-dependencies:

download-dependencies:

download-dependencies:

download-dependencies:

download-dependencies:

download-dependencies:

download-dependencies:

download-dependencies:

download-dependencies:

download-dependencies:

download-dependencies:

download-dependencies:

download-dependencies:

download-dependencies:

download-dependencies:

make-deps:

calculate-dejavu-condition-before:

download-dejavu-fonts:
    [mkdir] Created dir: <https://builds.apache.org/job/ManifoldCF-ant/ws/site/fonts>
      [get] Getting: http://heanet.dl.sourceforge.net/project/dejavu/dejavu/2.33/dejavu-fonts-ttf-2.33.zip
      [get] To: <https://builds.apache.org/job/ManifoldCF-ant/ws/site/fonts/dejavu-fonts-ttf-2.33.zip>
      [get] http://heanet.dl.sourceforge.net/project/dejavu/dejavu/2.33/dejavu-fonts-ttf-2.33.zip
moved to http://downloads.sourceforge.net/project/dejavu/dejavu/2.33/dejavu-fonts-ttf-2.33.zip?download&failedmirror=heanet.dl.sourceforge.net
      [get] http://downloads.sourceforge.net/project/dejavu/dejavu/2.33/dejavu-fonts-ttf-2.33.zip?download&failedmirror=heanet.dl.sourceforge.net
moved to https://svwh.dl.sourceforge.net/project/dejavu/dejavu/2.33/dejavu-fonts-ttf-2.33.zip
      [get] Error getting http://heanet.dl.sourceforge.net/project/dejavu/dejavu/2.33/dejavu-fonts-ttf-2.33.zip
to <https://builds.apache.org/job/ManifoldCF-ant/ws/site/fonts/dejavu-fonts-ttf-2.33.zip>

BUILD FAILED
<https://builds.apache.org/job/ManifoldCF-ant/ws/build.xml>:2504: The following error
occurred while executing this line:
<https://builds.apache.org/job/ManifoldCF-ant/ws/site/build.xml>:266: javax.net.ssl.SSLHandshakeException:
sun.security.validator.ValidatorException: PKIX path building failed: sun.security.provider.certpath.SunCertPathBuilderException:
unable to find valid certification path to requested target
	at sun.security.ssl.Alerts.getSSLException(Alerts.java:192)
	at sun.security.ssl.SSLSocketImpl.fatal(SSLSocketImpl.java:1904)
	at sun.security.ssl.Handshaker.fatalSE(Handshaker.java:279)
	at sun.security.ssl.Handshaker.fatalSE(Handshaker.java:273)
	at sun.security.ssl.ClientHandshaker.serverCertificate(ClientHandshaker.java:1446)
	at sun.security.ssl.ClientHandshaker.processMessage(ClientHandshaker.java:209)
	at sun.security.ssl.Handshaker.processLoop(Handshaker.java:913)
	at sun.security.ssl.Handshaker.process_record(Handshaker.java:849)
	at sun.security.ssl.SSLSocketImpl.readRecord(SSLSocketImpl.java:1023)
	at sun.security.ssl.SSLSocketImpl.performInitialHandshake(SSLSocketImpl.java:1332)
	at sun.security.ssl.SSLSocketImpl.startHandshake(SSLSocketImpl.java:1359)
	at sun.security.ssl.SSLSocketImpl.startHandshake(SSLSocketImpl.java:1343)
	at sun.net.www.protocol.https.HttpsClient.afterConnect(HttpsClient.java:559)
	at sun.net.www.protocol.https.AbstractDelegateHttpsURLConnection.connect(AbstractDelegateHttpsURLConnection.java:185)
	at sun.net.www.protocol.https.HttpsURLConnectionImpl.connect(HttpsURLConnectionImpl.java:153)
	at org.apache.tools.ant.taskdefs.Get$GetThread.openConnection(Get.java:690)
	at org.apache.tools.ant.taskdefs.Get$GetThread.openConnection(Get.java:715)
	at org.apache.tools.ant.taskdefs.Get$GetThread.openConnection(Get.java:715)
	at org.apache.tools.ant.taskdefs.Get$GetThread.get(Get.java:606)
	at org.apache.tools.ant.taskdefs.Get$GetThread.run(Get.java:596)
Caused by: sun.security.validator.ValidatorException: PKIX path building failed: sun.security.provider.certpath.SunCertPathBuilderException:
unable to find valid certification path to requested target
	at sun.security.validator.PKIXValidator.doBuild(PKIXValidator.java:385)
	at sun.security.validator.PKIXValidator.engineValidate(PKIXValidator.java:292)
	at sun.security.validator.Validator.validate(Validator.java:260)
	at sun.security.ssl.X509TrustManagerImpl.validate(X509TrustManagerImpl.java:326)
	at sun.security.ssl.X509TrustManagerImpl.checkTrusted(X509TrustManagerImpl.java:231)
	at sun.security.ssl.X509TrustManagerImpl.checkServerTrusted(X509TrustManagerImpl.java:126)
	at sun.security.ssl.ClientHandshaker.serverCertificate(ClientHandshaker.java:1428)
	... 15 more
Caused by: sun.security.provider.certpath.SunCertPathBuilderException: unable to find valid
certification path to requested target
	at sun.security.provider.certpath.SunCertPathBuilder.engineBuild(SunCertPathBuilder.java:196)
	at java.security.cert.CertPathBuilder.build(CertPathBuilder.java:268)
	at sun.security.validator.PKIXValidator.doBuild(PKIXValidator.java:380)
	... 21 more

Total time: 1 minute 19 seconds
Build step 'Invoke Ant' marked build as failure
[locks-and-latches] Releasing all the locks
[locks-and-latches] All the locks released
Archiving artifacts
Publishing Javadoc

Mime
View raw message