manifoldcf-dev mailing list archives

Site index · List index
Message view « Date » · « Thread »
Top « Date » · « Thread »
From Apache Jenkins Server <jenk...@builds.apache.org>
Subject Build failed in Jenkins: ManifoldCF-mvn-1x #99
Date Sat, 15 Aug 2015 02:41:12 GMT
See <https://builds.apache.org/job/ManifoldCF-mvn-1x/99/changes>

Changes:

[kwright] Fix confluence deprecated method invocations

[kwright] Pull up more logging changes from trunk.  Part of CONNECTORS-1227.

[kwright] Improve scheduling debug logging

[kwright] Fix build error

[kwright] Pull up more changes for CONNECTORS-1226

------------------------------------------
[...truncated 3323 lines...]
[INFO] Copying mcf-crawler-ui-1.10-SNAPSHOT.war to <https://builds.apache.org/job/ManifoldCF-mvn-1x/ws/connectors/documentfilter/target/dependency/mcf-crawler-ui.war>
[INFO] 
[INFO] --- maven-resources-plugin:2.5:resources (default-resources) @ mcf-documentfilter-connector
---
[debug] execute contextualize
[INFO] Using 'UTF-8' encoding to copy filtered resources.
[INFO] Copying 3 resources
[INFO] Copying 3 resources
[INFO] Copying 3 resources
[INFO] 
[INFO] --- maven-compiler-plugin:2.3.2:compile (default-compile) @ mcf-documentfilter-connector
---
[INFO] Compiling 3 source files to <https://builds.apache.org/job/ManifoldCF-mvn-1x/ws/connectors/documentfilter/target/classes>
[INFO] 
[INFO] --- native2ascii-maven-plugin:1.0-beta-1:native2ascii (native2ascii-utf8) @ mcf-documentfilter-connector
---
[INFO] Includes: [**/*.properties]
[INFO] Excludes: []
[INFO] Processing <https://builds.apache.org/job/ManifoldCF-mvn-1x/ws/connectors/documentfilter/target/classes/org/apache/manifoldcf/agents/transformation/documentfilter/common_en_US.properties>
[INFO] Processing <https://builds.apache.org/job/ManifoldCF-mvn-1x/ws/connectors/documentfilter/target/classes/org/apache/manifoldcf/agents/transformation/documentfilter/common_ja_JP.properties>
[INFO] Processing <https://builds.apache.org/job/ManifoldCF-mvn-1x/ws/connectors/documentfilter/target/classes/org/apache/manifoldcf/agents/transformation/documentfilter/common_zh_CN.properties>
[INFO] 
[INFO] --- maven-resources-plugin:2.5:testResources (default-testResources) @ mcf-documentfilter-connector
---
[debug] execute contextualize
[INFO] Using 'UTF-8' encoding to copy filtered resources.
[INFO] skip non existing resourceDirectory <https://builds.apache.org/job/ManifoldCF-mvn-1x/ws/connectors/documentfilter/connector/src/test/resources>
[INFO] Copying 3 resources
[INFO] 
[INFO] --- maven-compiler-plugin:2.3.2:testCompile (default-testCompile) @ mcf-documentfilter-connector
---
[INFO] No sources to compile
[INFO] 
[INFO] --- maven-surefire-plugin:2.17:test (default-test) @ mcf-documentfilter-connector ---
[INFO] Tests are skipped.
[INFO] 
[INFO] --- maven-jar-plugin:2.3.1:jar (default-jar) @ mcf-documentfilter-connector ---
[INFO] Building jar: <https://builds.apache.org/job/ManifoldCF-mvn-1x/ws/connectors/documentfilter/target/mcf-documentfilter-connector-1.10-SNAPSHOT.jar>
[INFO] 
[INFO] --- maven-site-plugin:3.4:attach-descriptor (attach-descriptor) @ mcf-documentfilter-connector
---
[INFO] 
[INFO] >>> maven-source-plugin:2.4:jar (attach-sources) @ mcf-documentfilter-connector
>>>
[INFO] 
[INFO] <<< maven-source-plugin:2.4:jar (attach-sources) @ mcf-documentfilter-connector
<<<
[INFO] 
[INFO] --- maven-source-plugin:2.4:jar (attach-sources) @ mcf-documentfilter-connector ---
[INFO] Building jar: <https://builds.apache.org/job/ManifoldCF-mvn-1x/ws/connectors/documentfilter/target/mcf-documentfilter-connector-1.10-SNAPSHOT-sources.jar>
[INFO] 
[INFO] --- maven-failsafe-plugin:2.12.3:integration-test (integration-test) @ mcf-documentfilter-connector
---
[INFO] Tests are skipped.
[INFO] 
[INFO] --- maven-failsafe-plugin:2.12.3:verify (verify) @ mcf-documentfilter-connector ---
[INFO] Tests are skipped.
[INFO] 
[INFO] --- maven-install-plugin:2.5.2:install (default-install) @ mcf-documentfilter-connector
---
[INFO] Installing <https://builds.apache.org/job/ManifoldCF-mvn-1x/ws/connectors/documentfilter/target/mcf-documentfilter-connector-1.10-SNAPSHOT.jar>
to /home/jenkins/.m2/repository/org/apache/manifoldcf/mcf-documentfilter-connector/1.10-SNAPSHOT/mcf-documentfilter-connector-1.10-SNAPSHOT.jar
[INFO] Installing <https://builds.apache.org/job/ManifoldCF-mvn-1x/ws/connectors/documentfilter/pom.xml>
to /home/jenkins/.m2/repository/org/apache/manifoldcf/mcf-documentfilter-connector/1.10-SNAPSHOT/mcf-documentfilter-connector-1.10-SNAPSHOT.pom
[INFO] Installing <https://builds.apache.org/job/ManifoldCF-mvn-1x/ws/connectors/documentfilter/target/mcf-documentfilter-connector-1.10-SNAPSHOT-sources.jar>
to /home/jenkins/.m2/repository/org/apache/manifoldcf/mcf-documentfilter-connector/1.10-SNAPSHOT/mcf-documentfilter-connector-1.10-SNAPSHOT-sources.jar
[INFO]                                                                         
[INFO] ------------------------------------------------------------------------
[INFO] Building ManifoldCF - Connectors - SearchBlox 1.10-SNAPSHOT
[INFO] ------------------------------------------------------------------------
[INFO] 
[INFO] --- maven-clean-plugin:2.4.1:clean (default-clean) @ mcf-searchblox-connector ---
[INFO] Deleting <https://builds.apache.org/job/ManifoldCF-mvn-1x/ws/connectors/searchblox/target>
[INFO] 
[INFO] --- maven-remote-resources-plugin:1.5:process (default) @ mcf-searchblox-connector
---
[INFO] 
[INFO] --- maven-dependency-plugin:2.8:copy (copy-war) @ mcf-searchblox-connector ---
[INFO] Configured Artifact: org.apache.manifoldcf:mcf-api-service:1.10-SNAPSHOT:war
[INFO] Configured Artifact: org.apache.manifoldcf:mcf-authority-service:1.10-SNAPSHOT:war
[INFO] Configured Artifact: org.apache.manifoldcf:mcf-crawler-ui:1.10-SNAPSHOT:war
[INFO] Copying mcf-api-service-1.10-SNAPSHOT.war to <https://builds.apache.org/job/ManifoldCF-mvn-1x/ws/connectors/searchblox/target/dependency/mcf-api-service.war>
[INFO] Copying mcf-authority-service-1.10-SNAPSHOT.war to <https://builds.apache.org/job/ManifoldCF-mvn-1x/ws/connectors/searchblox/target/dependency/mcf-authority-service.war>
[INFO] Copying mcf-crawler-ui-1.10-SNAPSHOT.war to <https://builds.apache.org/job/ManifoldCF-mvn-1x/ws/connectors/searchblox/target/dependency/mcf-crawler-ui.war>
[INFO] 
[INFO] --- maven-resources-plugin:2.5:resources (default-resources) @ mcf-searchblox-connector
---
[debug] execute contextualize
[INFO] Using 'UTF-8' encoding to copy filtered resources.
[INFO] Copying 1 resource
[INFO] Copying 6 resources
[INFO] Copying 3 resources
[INFO] 
[INFO] --- maven-compiler-plugin:2.3.2:compile (default-compile) @ mcf-searchblox-connector
---
[INFO] Compiling 6 source files to <https://builds.apache.org/job/ManifoldCF-mvn-1x/ws/connectors/searchblox/target/classes>
[INFO] 
[INFO] --- native2ascii-maven-plugin:1.0-beta-1:native2ascii (native2ascii-utf8) @ mcf-searchblox-connector
---
[INFO] Includes: [**/*.properties]
[INFO] Excludes: []
[INFO] Processing <https://builds.apache.org/job/ManifoldCF-mvn-1x/ws/connectors/searchblox/target/classes/org/apache/manifoldcf/agents/output/searchblox/common_en_US.properties>
[INFO] 
[INFO] --- maven-resources-plugin:2.5:testResources (default-testResources) @ mcf-searchblox-connector
---
[debug] execute contextualize
[INFO] Using 'UTF-8' encoding to copy filtered resources.
[INFO] skip non existing resourceDirectory <https://builds.apache.org/job/ManifoldCF-mvn-1x/ws/connectors/searchblox/connector/src/test/resources>
[INFO] Copying 3 resources
[INFO] 
[INFO] --- maven-compiler-plugin:2.3.2:testCompile (default-testCompile) @ mcf-searchblox-connector
---
[INFO] Compiling 1 source file to <https://builds.apache.org/job/ManifoldCF-mvn-1x/ws/connectors/searchblox/target/test-classes>
[INFO] 
[INFO] --- maven-surefire-plugin:2.17:test (default-test) @ mcf-searchblox-connector ---
[INFO] Tests are skipped.
[INFO] 
[INFO] --- maven-jar-plugin:2.3.1:jar (default-jar) @ mcf-searchblox-connector ---
[INFO] Building jar: <https://builds.apache.org/job/ManifoldCF-mvn-1x/ws/connectors/searchblox/target/mcf-searchblox-connector-1.10-SNAPSHOT.jar>
[INFO] 
[INFO] --- maven-site-plugin:3.4:attach-descriptor (attach-descriptor) @ mcf-searchblox-connector
---
[INFO] 
[INFO] >>> maven-source-plugin:2.4:jar (attach-sources) @ mcf-searchblox-connector
>>>
[INFO] 
[INFO] <<< maven-source-plugin:2.4:jar (attach-sources) @ mcf-searchblox-connector
<<<
[INFO] 
[INFO] --- maven-source-plugin:2.4:jar (attach-sources) @ mcf-searchblox-connector ---
[INFO] Building jar: <https://builds.apache.org/job/ManifoldCF-mvn-1x/ws/connectors/searchblox/target/mcf-searchblox-connector-1.10-SNAPSHOT-sources.jar>
[INFO] 
[INFO] --- maven-assembly-plugin:2.4.1:single (make-assembly) @ mcf-searchblox-connector ---
[INFO] Building jar: <https://builds.apache.org/job/ManifoldCF-mvn-1x/ws/connectors/searchblox/target/mcf-searchblox-connector.jar>
[WARNING] Configuration options: 'appendAssemblyId' is set to false, and 'classifier' is missing.
Instead of attaching the assembly file: <https://builds.apache.org/job/ManifoldCF-mvn-1x/ws/connectors/searchblox/target/mcf-searchblox-connector.jar,>
it will become the file for main project artifact.
NOTE: If multiple descriptors or descriptor-formats are provided for this project, the value
of this file will be non-deterministic!
[WARNING] Replacing pre-existing project main-artifact file: <https://builds.apache.org/job/ManifoldCF-mvn-1x/ws/connectors/searchblox/target/mcf-searchblox-connector-1.10-SNAPSHOT.jar>
with assembly file: <https://builds.apache.org/job/ManifoldCF-mvn-1x/ws/connectors/searchblox/target/mcf-searchblox-connector.jar>
[INFO] 
[INFO] --- maven-failsafe-plugin:2.12.3:integration-test (integration-test) @ mcf-searchblox-connector
---
[INFO] Tests are skipped.
[INFO] 
[INFO] --- maven-failsafe-plugin:2.12.3:verify (verify) @ mcf-searchblox-connector ---
[INFO] Tests are skipped.
[INFO] 
[INFO] --- maven-install-plugin:2.5.2:install (default-install) @ mcf-searchblox-connector
---
[INFO] Installing <https://builds.apache.org/job/ManifoldCF-mvn-1x/ws/connectors/searchblox/target/mcf-searchblox-connector.jar>
to /home/jenkins/.m2/repository/org/apache/manifoldcf/mcf-searchblox-connector/1.10-SNAPSHOT/mcf-searchblox-connector-1.10-SNAPSHOT.jar
[INFO] Installing <https://builds.apache.org/job/ManifoldCF-mvn-1x/ws/connectors/searchblox/pom.xml>
to /home/jenkins/.m2/repository/org/apache/manifoldcf/mcf-searchblox-connector/1.10-SNAPSHOT/mcf-searchblox-connector-1.10-SNAPSHOT.pom
[INFO] Installing <https://builds.apache.org/job/ManifoldCF-mvn-1x/ws/connectors/searchblox/target/mcf-searchblox-connector-1.10-SNAPSHOT-sources.jar>
to /home/jenkins/.m2/repository/org/apache/manifoldcf/mcf-searchblox-connector/1.10-SNAPSHOT/mcf-searchblox-connector-1.10-SNAPSHOT-sources.jar
[INFO]                                                                         
[INFO] ------------------------------------------------------------------------
[INFO] Building ManifoldCF - Connectors - Confluence Connector 2.2-SNAPSHOT
[INFO] ------------------------------------------------------------------------
[INFO] 
[INFO] --- maven-clean-plugin:2.4.1:clean (default-clean) @ mcf-confluence-connector ---
[INFO] Deleting <https://builds.apache.org/job/ManifoldCF-mvn-1x/ws/connectors/confluence/target>
[INFO] 
[INFO] --- maven-remote-resources-plugin:1.5:process (default) @ mcf-confluence-connector
---
[INFO] 
[INFO] --- maven-dependency-plugin:2.8:copy (copy-war) @ mcf-confluence-connector ---
[INFO] Configured Artifact: org.apache.manifoldcf:mcf-api-service:2.2-SNAPSHOT:war
[INFO] Configured Artifact: org.apache.manifoldcf:mcf-authority-service:2.2-SNAPSHOT:war
[INFO] Configured Artifact: org.apache.manifoldcf:mcf-crawler-ui:2.2-SNAPSHOT:war
[INFO] Copying mcf-api-service-2.2-SNAPSHOT.war to <https://builds.apache.org/job/ManifoldCF-mvn-1x/ws/connectors/confluence/target/dependency/mcf-api-service.war>
[INFO] Copying mcf-authority-service-2.2-SNAPSHOT.war to <https://builds.apache.org/job/ManifoldCF-mvn-1x/ws/connectors/confluence/target/dependency/mcf-authority-service.war>
[INFO] Copying mcf-crawler-ui-2.2-SNAPSHOT.war to <https://builds.apache.org/job/ManifoldCF-mvn-1x/ws/connectors/confluence/target/dependency/mcf-crawler-ui.war>
[INFO] 
[INFO] --- maven-resources-plugin:2.5:resources (default-resources) @ mcf-confluence-connector
---
[debug] execute contextualize
[INFO] Using 'UTF-8' encoding to copy filtered resources.
[INFO] Copying 2 resources
[INFO] Copying 10 resources
[INFO] Copying 3 resources
[INFO] 
[INFO] --- maven-compiler-plugin:2.3.2:compile (default-compile) @ mcf-confluence-connector
---
[INFO] Compiling 21 source files to <https://builds.apache.org/job/ManifoldCF-mvn-1x/ws/connectors/confluence/target/classes>
[INFO] -------------------------------------------------------------
[ERROR] COMPILATION ERROR : 
[INFO] -------------------------------------------------------------
[ERROR] <https://builds.apache.org/job/ManifoldCF-mvn-1x/ws/connectors/confluence/connector/src/main/java/org/apache/manifoldcf/crawler/connectors/confluence/client/ConfluenceClient.java>:[30,40]
error: cannot find symbol
[ERROR]  package org.apache.manifoldcf.core.common
<https://builds.apache.org/job/ManifoldCF-mvn-1x/ws/connectors/confluence/connector/src/main/java/org/apache/manifoldcf/crawler/connectors/confluence/client/ConfluenceClient.java>:[31,44]
error: cannot find symbol
[ERROR]  package org.apache.manifoldcf.core.interfaces
<https://builds.apache.org/job/ManifoldCF-mvn-1x/ws/connectors/confluence/connector/src/main/java/org/apache/manifoldcf/crawler/connectors/confluence/client/ConfluenceClient.java>:[123,57]
error: cannot find symbol
[ERROR]  class ConfluenceClient
<https://builds.apache.org/job/ManifoldCF-mvn-1x/ws/connectors/confluence/connector/src/main/java/org/apache/manifoldcf/crawler/connectors/confluence/client/ConfluenceClient.java>:[124,79]
error: cannot find symbol
[INFO] 4 errors 
[INFO] -------------------------------------------------------------
[INFO] ------------------------------------------------------------------------
[INFO] Reactor Summary:
[INFO] 
[INFO] ManifoldCF ........................................ SUCCESS [  3.073 s]
[INFO] ManifoldCF - Framework ............................ SUCCESS [  0.142 s]
[INFO] ManifoldCF - Framework - Core ..................... SUCCESS [ 11.726 s]
[INFO] ManifoldCF - Connector-Common ..................... SUCCESS [  2.770 s]
[INFO] ManifoldCF - Framework - UI Core .................. SUCCESS [  2.355 s]
[INFO] ManifoldCF - Framework - Agents ................... SUCCESS [  4.458 s]
[INFO] ManifoldCF - Framework - Pull Agent ............... SUCCESS [  7.501 s]
[INFO] ManifoldCF - Framework - Authority Servlet ........ SUCCESS [  1.288 s]
[INFO] ManifoldCF - Framework - API Servlet .............. SUCCESS [  1.565 s]
[INFO] ManifoldCF - Framework - Authority Service ........ SUCCESS [  4.729 s]
[INFO] ManifoldCF - Framework - API Service .............. SUCCESS [  3.509 s]
[INFO] ManifoldCF - Framework - Crawler UI ............... SUCCESS [  3.466 s]
[INFO] ManifoldCF - Framework - Script Engine ............ SUCCESS [  3.172 s]
[INFO] ManifoldCF - Framework - Combined Service ......... SUCCESS [  2.949 s]
[INFO] ManifoldCF - Test materials ....................... SUCCESS [  0.088 s]
[INFO] ManifoldCF - Test Materials - Alfresco WAR ........ SUCCESS [ 55.340 s]
[INFO] ManifoldCF - Connectors ........................... SUCCESS [  0.384 s]
[INFO] ManifoldCF - Connectors - Active Directory ........ SUCCESS [  3.935 s]
[INFO] ManifoldCF - Connectors - Alfresco Webscript ...... SUCCESS [  7.550 s]
[INFO] ManifoldCF - Connectors - Filesystem .............. SUCCESS [  5.517 s]
[INFO] ManifoldCF - Connectors - MetaCarta GTS ........... SUCCESS [  4.040 s]
[INFO] ManifoldCF - Connectors - HDFS .................... SUCCESS [  4.675 s]
[INFO] ManifoldCF - Connectors - jCIFS ................... SUCCESS [  3.061 s]
[INFO] ManifoldCF - Connectors - JDBC .................... SUCCESS [  2.867 s]
[INFO] ManifoldCF - Connectors - GridFS .................. SUCCESS [  2.257 s]
[INFO] ManifoldCF - Connectors - LDAP .................... SUCCESS [  2.451 s]
[INFO] ManifoldCF - Connectors - Null Authority .......... SUCCESS [  1.979 s]
[INFO] ManifoldCF - Connectors - Null Output ............. SUCCESS [  1.888 s]
[INFO] ManifoldCF - Connectors - Null Transformation ..... SUCCESS [  1.053 s]
[INFO] ManifoldCF - Connectors - RSS ..................... SUCCESS [  3.070 s]
[INFO] ManifoldCF - Connectors - SharePoint .............. SUCCESS [  8.603 s]
[INFO] ManifoldCF - Connectors - Solr .................... SUCCESS [  3.572 s]
[INFO] ManifoldCF - Connectors - Web ..................... SUCCESS [  4.641 s]
[INFO] ManifoldCF - Connectors - CMIS .................... SUCCESS [  3.002 s]
[INFO] ManifoldCF - Connectors - OpenSearchServer ........ SUCCESS [  2.583 s]
[INFO] ManifoldCF - Connectors - Wiki .................... SUCCESS [  3.234 s]
[INFO] ManifoldCF - Connectors - Alfresco ................ SUCCESS [  3.789 s]
[INFO] ManifoldCF - Connectors - ElasticSearch ........... SUCCESS [  5.853 s]
[INFO] ManifoldCF - Connectors - Dropbox ................. SUCCESS [  2.329 s]
[INFO] ManifoldCF - Connectors - GoogleDrive ............. SUCCESS [  2.370 s]
[INFO] ManifoldCF - Connectors - Jira .................... SUCCESS [  2.591 s]
[INFO] ManifoldCF - Connectors - Generic ................. SUCCESS [  1.659 s]
[INFO] ManifoldCF - Connectors - Regexp Mapper ........... SUCCESS [  1.695 s]
[INFO] ManifoldCF - Connectors - Email ................... SUCCESS [  2.280 s]
[INFO] ManifoldCF - Connectors - Amazon CloudSearch Output  SUCCESS [  1.628 s]
[INFO] ManifoldCF - Connectors - Forced metadata ......... SUCCESS [  2.389 s]
[INFO] ManifoldCF - Connectors - Tika Transformer ........ SUCCESS [  1.669 s]
[INFO] ManifoldCF - Connectors - Document Filter ......... SUCCESS [  1.363 s]
[INFO] ManifoldCF - Connectors - SearchBlox .............. SUCCESS [ 12.314 s]
[INFO] ManifoldCF - Connectors - Confluence Connector .... FAILURE [  2.518 s]
[INFO] ManifoldCF - Framework - Jetty Runner ............. SKIPPED
[INFO] ------------------------------------------------------------------------
[INFO] BUILD FAILURE
[INFO] ------------------------------------------------------------------------
[INFO] Total time: 03:44 min
[INFO] Finished at: 2015-08-15T02:42:04+00:00
[INFO] Final Memory: 61M/420M
[INFO] ------------------------------------------------------------------------
[ERROR] Failed to execute goal org.apache.maven.plugins:maven-compiler-plugin:2.3.2:compile
(default-compile) on project mcf-confluence-connector: Compilation failure: Compilation failure:
[ERROR] <https://builds.apache.org/job/ManifoldCF-mvn-1x/ws/connectors/confluence/connector/src/main/java/org/apache/manifoldcf/crawler/connectors/confluence/client/ConfluenceClient.java>:[30,40]
error: cannot find symbol
[ERROR] package org.apache.manifoldcf.core.common
[ERROR] <https://builds.apache.org/job/ManifoldCF-mvn-1x/ws/connectors/confluence/connector/src/main/java/org/apache/manifoldcf/crawler/connectors/confluence/client/ConfluenceClient.java>:[31,44]
error: cannot find symbol
[ERROR] package org.apache.manifoldcf.core.interfaces
[ERROR] <https://builds.apache.org/job/ManifoldCF-mvn-1x/ws/connectors/confluence/connector/src/main/java/org/apache/manifoldcf/crawler/connectors/confluence/client/ConfluenceClient.java>:[123,57]
error: cannot find symbol
[ERROR] class ConfluenceClient
[ERROR] <https://builds.apache.org/job/ManifoldCF-mvn-1x/ws/connectors/confluence/connector/src/main/java/org/apache/manifoldcf/crawler/connectors/confluence/client/ConfluenceClient.java>:[124,79]
error: cannot find symbol
[ERROR] -> [Help 1]
[ERROR] 
[ERROR] To see the full stack trace of the errors, re-run Maven with the -e switch.
[ERROR] Re-run Maven using the -X switch to enable full debug logging.
[ERROR] 
[ERROR] For more information about the errors and possible solutions, please read the following
articles:
[ERROR] [Help 1] http://cwiki.apache.org/confluence/display/MAVEN/MojoFailureException
[ERROR] 
[ERROR] After correcting the problems, you can resume the build with the command
[ERROR]   mvn <goals> -rf :mcf-confluence-connector
Build step 'Invoke top-level Maven targets' marked build as failure
[locks-and-latches] Releasing all the locks
[locks-and-latches] All the locks released

Mime
View raw message