manifoldcf-dev mailing list archives

Site index · List index
Message view « Date » · « Thread »
Top « Date » · « Thread »
From Karl Wright <daddy...@gmail.com>
Subject Re: Build failed in Jenkins: ManifoldCF-ant #404
Date Tue, 14 Jul 2015 01:45:33 GMT
I've alerted Maurizio, hopefully this is something simple.

Karl

On Mon, Jul 13, 2015 at 9:38 PM, Apache Jenkins Server <
jenkins@builds.apache.org> wrote:

> See <https://builds.apache.org/job/ManifoldCF-ant/404/changes>
>
> Changes:
>
> [kwright] Fix for CONNECTORS-1222.
>
> ------------------------------------------
> [...truncated 4583 lines...]
>
> compile-pull-agent:
>
> jar-pull-agent:
>
> compile-jetty-runner:
>
> jar-jetty-runner:
>
> compile-script-engine:
>
> jar-script-engine:
>
> lib:
>
> process-lib-classpath:
>
> lib-proprietary:
>
> process-lib-proprietary-classpath:
>
> database-lib-classpath:
>
> jetty-lib-classpath:
>
> setup-start-processes-proprietary:
>
> general-set-start-classpath:
>
> compile-authority-servlet:
>
> jar-authority-servlet:
>
> compile-authority-service:
>
> webapp-authority-service:
>
> war-authority-service:
>
> compile-api-servlet:
>
> jar-api-servlet:
>
> compile-api-service:
>
> webapp-api-service:
>
> war-api-service:
>
> compile-crawler-ui:
>
> webapp-crawler-ui:
>
> war-crawler-ui:
>
> compile-combined-service:
>
> webapp-combined-service:
>
> war-combined-service:
>
> wars:
>
> webapp-authority-service-proprietary:
>      [copy] Copying 3 files to <
> https://builds.apache.org/job/ManifoldCF-ant/ws/framework/build/webapp/authority-service-proprietary/WEB-INF/lib
> >
>
> war-authority-service-proprietary:
>       [war] Building war: <
> https://builds.apache.org/job/ManifoldCF-ant/ws/framework/build/war-proprietary/mcf-authority-service.war
> >
>
> webapp-api-service-proprietary:
>      [copy] Copying 3 files to <
> https://builds.apache.org/job/ManifoldCF-ant/ws/framework/build/webapp/api-service-proprietary/WEB-INF/lib
> >
>
> war-api-service-proprietary:
>       [war] Building war: <
> https://builds.apache.org/job/ManifoldCF-ant/ws/framework/build/war-proprietary/mcf-api-service.war
> >
>
> webapp-crawler-ui-proprietary:
>      [copy] Copying 3 files to <
> https://builds.apache.org/job/ManifoldCF-ant/ws/framework/build/webapp/crawler-ui-proprietary/WEB-INF/lib
> >
>
> war-crawler-ui-proprietary:
>       [war] Building war: <
> https://builds.apache.org/job/ManifoldCF-ant/ws/framework/build/war-proprietary/mcf-crawler-ui.war
> >
>
> webapp-combined-service-proprietary:
>      [copy] Copying 3 files to <
> https://builds.apache.org/job/ManifoldCF-ant/ws/framework/build/webapp/combined-service-proprietary/WEB-INF/lib
> >
>
> war-combined-service-proprietary:
>       [war] Building war: <
> https://builds.apache.org/job/ManifoldCF-ant/ws/framework/build/war-proprietary/mcf-combined-service.war
> >
>
> wars-proprietary:
>      [copy] Copying 4 files to <
> https://builds.apache.org/job/ManifoldCF-ant/ws/framework/dist/web-proprietary/war
> >
>
> compile-connector-common:
>
> jar-connector-common:
>
> connector-common-lib:
>
> example-common:
>
> script-engine:
>
> preclean-engine-processes:
>    [delete] Deleting: <
> https://builds.apache.org/job/ManifoldCF-ant/ws/framework/dist/script-engine/options.env.win
> >
>    [delete] Deleting: <
> https://builds.apache.org/job/ManifoldCF-ant/ws/framework/dist/script-engine/options.env.unix
> >
>
> scripts-common:
>
> scripts-engine:
>      [copy] Copying 2 files to <
> https://builds.apache.org/job/ManifoldCF-ant/ws/framework/dist/script-engine
> >
>
> compile-core:
>
> jar-core:
>
> compile-ui-core:
>
> jar-ui-core:
>
> compile-agents:
>
> jar-agents:
>
> compile-pull-agent:
>
> jar-pull-agent:
>
> compile-jetty-runner:
>
> jar-jetty-runner:
>
> compile-script-engine:
>
> jar-script-engine:
>
> lib:
>
> engine-lib-classpath:
>
> setup-engine-processes:
>
> general-set-engine-classpath:
>
> obfuscation-utility:
>
> preclean-obfuscate-processes:
>    [delete] Deleting: <
> https://builds.apache.org/job/ManifoldCF-ant/ws/framework/dist/obfuscation-utility/options.env.win
> >
>    [delete] Deleting: <
> https://builds.apache.org/job/ManifoldCF-ant/ws/framework/dist/obfuscation-utility/options.env.unix
> >
>
> scripts-common:
>
> scripts-obfuscate:
>      [copy] Copying 2 files to <
> https://builds.apache.org/job/ManifoldCF-ant/ws/framework/dist/obfuscation-utility
> >
>
> compile-core:
>
> jar-core:
>
> compile-ui-core:
>
> jar-ui-core:
>
> compile-agents:
>
> jar-agents:
>
> compile-pull-agent:
>
> jar-pull-agent:
>
> compile-jetty-runner:
>
> jar-jetty-runner:
>
> compile-script-engine:
>
> jar-script-engine:
>
> lib:
>
> obfuscate-lib-classpath:
>
> setup-obfuscate-processes:
>
> general-set-obfuscate-classpath:
>
> buildfiles:
>
> compile-core-tests:
>
> jar-core-tests:
>
> compile-agents-tests:
>
> jar-agents-tests:
>
> compile-pull-agent-tests:
>
> jar-pull-agent-tests:
>
> compile-script-engine-tests:
>
> jar-script-engine-tests:
>
> jar-tests:
>
> test-lib:
>
> build:
>
> deliver-framework:
>      [copy] Copying 4 files to <
> https://builds.apache.org/job/ManifoldCF-ant/ws/dist/web-proprietary>
>      [copy] Copying 3 files to <
> https://builds.apache.org/job/ManifoldCF-ant/ws/dist/lib-proprietary>
>      [copy] Copying 7 files to <
> https://builds.apache.org/job/ManifoldCF-ant/ws/dist/multiprocess-file-example
> >
>      [copy] Copying 7 files to <
> https://builds.apache.org/job/ManifoldCF-ant/ws/dist/multiprocess-file-example-proprietary
> >
>      [copy] Copying 9 files to <
> https://builds.apache.org/job/ManifoldCF-ant/ws/dist/multiprocess-zk-example
> >
>      [copy] Copying 9 files to <
> https://builds.apache.org/job/ManifoldCF-ant/ws/dist/multiprocess-zk-example-proprietary
> >
>      [copy] Copying 5 files to <
> https://builds.apache.org/job/ManifoldCF-ant/ws/dist/example>
>      [copy] Copying 6 files to <
> https://builds.apache.org/job/ManifoldCF-ant/ws/dist/example-proprietary>
>      [copy] Copying 2 files to <
> https://builds.apache.org/job/ManifoldCF-ant/ws/dist/script-engine>
>      [copy] Copying 2 files to <
> https://builds.apache.org/job/ManifoldCF-ant/ws/dist/obfuscation-utility>
>      [copy] Copying 2 files to <
> https://builds.apache.org/job/ManifoldCF-ant/ws/dist>
>
> download-connectors-dependencies:
>
> download-dependencies:
>
> download-dependencies:
>
> setup-maven-url:
>
> download-via-maven:
>       [get] Getting:
> https://repo1.maven.org/maven2/com/github/maoo/indexer/alfresco-indexer-webscripts-war/0.7.1/alfresco-indexer-webscripts-war-0.7.1.war
>       [get] To: <
> https://builds.apache.org/job/ManifoldCF-ant/ws/connectors/alfresco-webscript/test-materials-proprietary/alfresco-indexer-webscripts-war-0.7.1.war
> >
>       [get] Error opening connection java.io.IOException: Server returned
> HTTP response code: 503 for URL:
> https://repo1.maven.org/maven2/com/github/maoo/indexer/alfresco-indexer-webscripts-war/0.7.1/alfresco-indexer-webscripts-war-0.7.1.war
>       [get] Error opening connection java.io.IOException: Server returned
> HTTP response code: 503 for URL:
> https://repo1.maven.org/maven2/com/github/maoo/indexer/alfresco-indexer-webscripts-war/0.7.1/alfresco-indexer-webscripts-war-0.7.1.war
>       [get] Error opening connection java.io.IOException: Server returned
> HTTP response code: 503 for URL:
> https://repo1.maven.org/maven2/com/github/maoo/indexer/alfresco-indexer-webscripts-war/0.7.1/alfresco-indexer-webscripts-war-0.7.1.war
>       [get] Can't get
> https://repo1.maven.org/maven2/com/github/maoo/indexer/alfresco-indexer-webscripts-war/0.7.1/alfresco-indexer-webscripts-war-0.7.1.war
> to <
> https://builds.apache.org/job/ManifoldCF-ant/ws/connectors/alfresco-webscript/test-materials-proprietary/alfresco-indexer-webscripts-war-0.7.1.war
> >
>
> BUILD FAILED
> <https://builds.apache.org/job/ManifoldCF-ant/ws/build.xml>:358: The
> following error occurred while executing this line:
> <https://builds.apache.org/job/ManifoldCF-ant/ws/build.xml>:348: The
> following error occurred while executing this line:
> <
> https://builds.apache.org/job/ManifoldCF-ant/ws/connectors/alfresco-webscript/build.xml>:77:
> The following error occurred while executing this line:
> <https://builds.apache.org/job/ManifoldCF-ant/ws/dist/connector-build.xml>:27:
> Can't get
> https://repo1.maven.org/maven2/com/github/maoo/indexer/alfresco-indexer-webscripts-war/0.7.1/alfresco-indexer-webscripts-war-0.7.1.war
> to <
> https://builds.apache.org/job/ManifoldCF-ant/ws/connectors/alfresco-webscript/test-materials-proprietary/alfresco-indexer-webscripts-war-0.7.1.war
> >
>
> Total time: 1 minute 35 seconds
> Build step 'Invoke Ant' marked build as failure
> [locks-and-latches] Releasing all the locks
> [locks-and-latches] All the locks released
> Archiving artifacts
> Publishing Javadoc
>

Mime
  • Unnamed multipart/alternative (inline, None, 0 bytes)
View raw message