manifoldcf-dev mailing list archives

Site index · List index
Message view « Date » · « Thread »
Top « Date » · « Thread »
From Apache Jenkins Server <jenk...@builds.apache.org>
Subject Build failed in Jenkins: ManifoldCF-mvn-1x #77
Date Wed, 27 May 2015 04:39:48 GMT
See <https://builds.apache.org/job/ManifoldCF-mvn-1x/77/changes>

Changes:

[kwright] Pull up fix for CONNECTORS-1193 from trunk.

------------------------------------------
[...truncated 2161 lines...]
[INFO] Processing /x1/jenkins/jenkins-slave/workspace/ManifoldCF-mvn-1x/connectors/sharepoint/target/classes/org/apache/manifoldcf/authorities/authorities/sharepoint/common_ja_JP.properties
[INFO] Processing /x1/jenkins/jenkins-slave/workspace/ManifoldCF-mvn-1x/connectors/sharepoint/target/classes/org/apache/manifoldcf/authorities/authorities/sharepoint/common_zh_CN.properties
[INFO] Processing /x1/jenkins/jenkins-slave/workspace/ManifoldCF-mvn-1x/connectors/sharepoint/target/classes/org/apache/manifoldcf/crawler/connectors/sharepoint/common_en_US.properties
[INFO] Processing /x1/jenkins/jenkins-slave/workspace/ManifoldCF-mvn-1x/connectors/sharepoint/target/classes/org/apache/manifoldcf/crawler/connectors/sharepoint/common_ja_JP.properties
[INFO] Processing /x1/jenkins/jenkins-slave/workspace/ManifoldCF-mvn-1x/connectors/sharepoint/target/classes/org/apache/manifoldcf/crawler/connectors/sharepoint/common_zh_CN.properties
[INFO] 
[INFO] --- maven-resources-plugin:2.5:testResources (default-testResources) @ mcf-sharepoint-connector
---
[debug] execute contextualize
[INFO] Using 'UTF-8' encoding to copy filtered resources.
[INFO] skip non existing resourceDirectory /x1/jenkins/jenkins-slave/workspace/ManifoldCF-mvn-1x/connectors/sharepoint/connector/src/test/resources
[INFO] Copying 3 resources
[INFO] 
[INFO] --- maven-compiler-plugin:2.3.2:testCompile (default-testCompile) @ mcf-sharepoint-connector
---
[INFO] Compiling 1 source file to /x1/jenkins/jenkins-slave/workspace/ManifoldCF-mvn-1x/connectors/sharepoint/target/test-classes
[INFO] 
[INFO] --- maven-surefire-plugin:2.17:test (default-test) @ mcf-sharepoint-connector ---
[INFO] Tests are skipped.
[INFO] 
[INFO] --- maven-jar-plugin:2.3.1:jar (default-jar) @ mcf-sharepoint-connector ---
[INFO] Building jar: /x1/jenkins/jenkins-slave/workspace/ManifoldCF-mvn-1x/connectors/sharepoint/target/mcf-sharepoint-connector-1.10-SNAPSHOT.jar
[INFO] 
[INFO] --- maven-site-plugin:3.4:attach-descriptor (attach-descriptor) @ mcf-sharepoint-connector
---
[INFO] 
[INFO] >>> maven-source-plugin:2.4:jar (attach-sources) @ mcf-sharepoint-connector
>>>
[INFO] 
[INFO] --- axistools-maven-plugin:1.4:wsdl2java (default) @ mcf-sharepoint-connector ---
[INFO] about to add compile source root
[INFO] Nothing to generate. All WSDL files are up to date.
[INFO] 
[INFO] <<< maven-source-plugin:2.4:jar (attach-sources) @ mcf-sharepoint-connector
<<<
[INFO] 
[INFO] --- maven-source-plugin:2.4:jar (attach-sources) @ mcf-sharepoint-connector ---
[INFO] Building jar: /x1/jenkins/jenkins-slave/workspace/ManifoldCF-mvn-1x/connectors/sharepoint/target/mcf-sharepoint-connector-1.10-SNAPSHOT-sources.jar
[INFO] 
[INFO] --- maven-failsafe-plugin:2.12.3:integration-test (integration-test) @ mcf-sharepoint-connector
---
[INFO] Tests are skipped.
[INFO] 
[INFO] --- maven-failsafe-plugin:2.12.3:verify (verify) @ mcf-sharepoint-connector ---
[INFO] Tests are skipped.
[INFO] 
[INFO] --- maven-install-plugin:2.5.2:install (default-install) @ mcf-sharepoint-connector
---
[INFO] Installing /x1/jenkins/jenkins-slave/workspace/ManifoldCF-mvn-1x/connectors/sharepoint/target/mcf-sharepoint-connector-1.10-SNAPSHOT.jar
to /home/jenkins/.m2/repository/org/apache/manifoldcf/mcf-sharepoint-connector/1.10-SNAPSHOT/mcf-sharepoint-connector-1.10-SNAPSHOT.jar
[INFO] Installing /x1/jenkins/jenkins-slave/workspace/ManifoldCF-mvn-1x/connectors/sharepoint/pom.xml
to /home/jenkins/.m2/repository/org/apache/manifoldcf/mcf-sharepoint-connector/1.10-SNAPSHOT/mcf-sharepoint-connector-1.10-SNAPSHOT.pom
[INFO] Installing /x1/jenkins/jenkins-slave/workspace/ManifoldCF-mvn-1x/connectors/sharepoint/target/mcf-sharepoint-connector-1.10-SNAPSHOT-sources.jar
to /home/jenkins/.m2/repository/org/apache/manifoldcf/mcf-sharepoint-connector/1.10-SNAPSHOT/mcf-sharepoint-connector-1.10-SNAPSHOT-sources.jar
[INFO]                                                                         
[INFO] ------------------------------------------------------------------------
[INFO] Building ManifoldCF - Connectors - Solr 1.10-SNAPSHOT
[INFO] ------------------------------------------------------------------------
[INFO] 
[INFO] --- maven-clean-plugin:2.4.1:clean (default-clean) @ mcf-solr-connector ---
[INFO] Deleting /x1/jenkins/jenkins-slave/workspace/ManifoldCF-mvn-1x/connectors/solr/target
[INFO] 
[INFO] --- maven-remote-resources-plugin:1.5:process (default) @ mcf-solr-connector ---
[INFO] 
[INFO] --- maven-dependency-plugin:2.8:copy (copy-war) @ mcf-solr-connector ---
[INFO] Configured Artifact: org.apache.manifoldcf:mcf-api-service:1.10-SNAPSHOT:war
[INFO] Configured Artifact: org.apache.manifoldcf:mcf-authority-service:1.10-SNAPSHOT:war
[INFO] Configured Artifact: org.apache.manifoldcf:mcf-crawler-ui:1.10-SNAPSHOT:war
[INFO] Copying mcf-api-service-1.10-SNAPSHOT.war to /x1/jenkins/jenkins-slave/workspace/ManifoldCF-mvn-1x/connectors/solr/target/dependency/mcf-api-service.war
[INFO] Copying mcf-authority-service-1.10-SNAPSHOT.war to /x1/jenkins/jenkins-slave/workspace/ManifoldCF-mvn-1x/connectors/solr/target/dependency/mcf-authority-service.war
[INFO] Copying mcf-crawler-ui-1.10-SNAPSHOT.war to /x1/jenkins/jenkins-slave/workspace/ManifoldCF-mvn-1x/connectors/solr/target/dependency/mcf-crawler-ui.war
[INFO] 
[INFO] --- maven-resources-plugin:2.5:resources (default-resources) @ mcf-solr-connector ---
[debug] execute contextualize
[INFO] Using 'UTF-8' encoding to copy filtered resources.
[INFO] Copying 3 resources
[INFO] skip non existing resourceDirectory /x1/jenkins/jenkins-slave/workspace/ManifoldCF-mvn-1x/connectors/solr/connector/src/main/resources
[INFO] Copying 3 resources
[INFO] 
[INFO] --- maven-compiler-plugin:2.3.2:compile (default-compile) @ mcf-solr-connector ---
[INFO] Compiling 8 source files to /x1/jenkins/jenkins-slave/workspace/ManifoldCF-mvn-1x/connectors/solr/target/classes
[INFO] 
[INFO] --- native2ascii-maven-plugin:1.0-beta-1:native2ascii (native2ascii-utf8) @ mcf-solr-connector
---
[INFO] Includes: [**/*.properties]
[INFO] Excludes: []
[INFO] Processing /x1/jenkins/jenkins-slave/workspace/ManifoldCF-mvn-1x/connectors/solr/target/classes/org/apache/manifoldcf/agents/output/solr/common_en_US.properties
[INFO] Processing /x1/jenkins/jenkins-slave/workspace/ManifoldCF-mvn-1x/connectors/solr/target/classes/org/apache/manifoldcf/agents/output/solr/common_ja_JP.properties
[INFO] Processing /x1/jenkins/jenkins-slave/workspace/ManifoldCF-mvn-1x/connectors/solr/target/classes/org/apache/manifoldcf/agents/output/solr/common_zh_CN.properties
[INFO] 
[INFO] --- maven-resources-plugin:2.5:testResources (default-testResources) @ mcf-solr-connector
---
[debug] execute contextualize
[INFO] Using 'UTF-8' encoding to copy filtered resources.
[INFO] skip non existing resourceDirectory /x1/jenkins/jenkins-slave/workspace/ManifoldCF-mvn-1x/connectors/solr/connector/src/test/resources
[INFO] Copying 3 resources
[INFO] 
[INFO] --- maven-compiler-plugin:2.3.2:testCompile (default-testCompile) @ mcf-solr-connector
---
[INFO] Compiling 6 source files to /x1/jenkins/jenkins-slave/workspace/ManifoldCF-mvn-1x/connectors/solr/target/test-classes
[INFO] 
[INFO] --- maven-surefire-plugin:2.17:test (default-test) @ mcf-solr-connector ---
[INFO] Tests are skipped.
[INFO] 
[INFO] --- maven-jar-plugin:2.3.1:jar (default-jar) @ mcf-solr-connector ---
[INFO] Building jar: /x1/jenkins/jenkins-slave/workspace/ManifoldCF-mvn-1x/connectors/solr/target/mcf-solr-connector-1.10-SNAPSHOT.jar
[INFO] 
[INFO] --- maven-site-plugin:3.4:attach-descriptor (attach-descriptor) @ mcf-solr-connector
---
[INFO] 
[INFO] >>> maven-source-plugin:2.4:jar (attach-sources) @ mcf-solr-connector >>>
[INFO] 
[INFO] <<< maven-source-plugin:2.4:jar (attach-sources) @ mcf-solr-connector <<<
[INFO] 
[INFO] --- maven-source-plugin:2.4:jar (attach-sources) @ mcf-solr-connector ---
[INFO] Building jar: /x1/jenkins/jenkins-slave/workspace/ManifoldCF-mvn-1x/connectors/solr/target/mcf-solr-connector-1.10-SNAPSHOT-sources.jar
[INFO] 
[INFO] --- maven-failsafe-plugin:2.12.3:integration-test (integration-test) @ mcf-solr-connector
---
[INFO] Tests are skipped.
[INFO] 
[INFO] --- maven-failsafe-plugin:2.12.3:verify (verify) @ mcf-solr-connector ---
[INFO] Tests are skipped.
[INFO] 
[INFO] --- maven-install-plugin:2.5.2:install (default-install) @ mcf-solr-connector ---
[INFO] Installing /x1/jenkins/jenkins-slave/workspace/ManifoldCF-mvn-1x/connectors/solr/target/mcf-solr-connector-1.10-SNAPSHOT.jar
to /home/jenkins/.m2/repository/org/apache/manifoldcf/mcf-solr-connector/1.10-SNAPSHOT/mcf-solr-connector-1.10-SNAPSHOT.jar
[INFO] Installing /x1/jenkins/jenkins-slave/workspace/ManifoldCF-mvn-1x/connectors/solr/pom.xml
to /home/jenkins/.m2/repository/org/apache/manifoldcf/mcf-solr-connector/1.10-SNAPSHOT/mcf-solr-connector-1.10-SNAPSHOT.pom
[INFO] Installing /x1/jenkins/jenkins-slave/workspace/ManifoldCF-mvn-1x/connectors/solr/target/mcf-solr-connector-1.10-SNAPSHOT-sources.jar
to /home/jenkins/.m2/repository/org/apache/manifoldcf/mcf-solr-connector/1.10-SNAPSHOT/mcf-solr-connector-1.10-SNAPSHOT-sources.jar
[INFO]                                                                         
[INFO] ------------------------------------------------------------------------
[INFO] Building ManifoldCF - Connectors - Web 1.10-SNAPSHOT
[INFO] ------------------------------------------------------------------------
[INFO] 
[INFO] --- maven-clean-plugin:2.4.1:clean (default-clean) @ mcf-web-connector ---
[INFO] Deleting /x1/jenkins/jenkins-slave/workspace/ManifoldCF-mvn-1x/connectors/webcrawler/target
[INFO] 
[INFO] --- maven-remote-resources-plugin:1.5:process (default) @ mcf-web-connector ---
[INFO] 
[INFO] --- maven-dependency-plugin:2.8:copy (copy-war) @ mcf-web-connector ---
[INFO] Configured Artifact: org.apache.manifoldcf:mcf-api-service:1.10-SNAPSHOT:war
[INFO] Configured Artifact: org.apache.manifoldcf:mcf-authority-service:1.10-SNAPSHOT:war
[INFO] Configured Artifact: org.apache.manifoldcf:mcf-crawler-ui:1.10-SNAPSHOT:war
[INFO] Copying mcf-api-service-1.10-SNAPSHOT.war to /x1/jenkins/jenkins-slave/workspace/ManifoldCF-mvn-1x/connectors/webcrawler/target/dependency/mcf-api-service.war
[INFO] Copying mcf-authority-service-1.10-SNAPSHOT.war to /x1/jenkins/jenkins-slave/workspace/ManifoldCF-mvn-1x/connectors/webcrawler/target/dependency/mcf-authority-service.war
[INFO] Copying mcf-crawler-ui-1.10-SNAPSHOT.war to /x1/jenkins/jenkins-slave/workspace/ManifoldCF-mvn-1x/connectors/webcrawler/target/dependency/mcf-crawler-ui.war
[INFO] 
[INFO] --- maven-resources-plugin:2.5:resources (default-resources) @ mcf-web-connector ---
[debug] execute contextualize
[INFO] Using 'UTF-8' encoding to copy filtered resources.
[INFO] Copying 3 resources
[INFO] skip non existing resourceDirectory /x1/jenkins/jenkins-slave/workspace/ManifoldCF-mvn-1x/connectors/webcrawler/connector/src/main/resources
[INFO] Copying 3 resources
[INFO] 
[INFO] --- maven-compiler-plugin:2.3.2:compile (default-compile) @ mcf-web-connector ---
[INFO] Compiling 39 source files to /x1/jenkins/jenkins-slave/workspace/ManifoldCF-mvn-1x/connectors/webcrawler/target/classes
[INFO] 
[INFO] --- native2ascii-maven-plugin:1.0-beta-1:native2ascii (native2ascii-utf8) @ mcf-web-connector
---
[INFO] Includes: [**/*.properties]
[INFO] Excludes: []
[INFO] Processing /x1/jenkins/jenkins-slave/workspace/ManifoldCF-mvn-1x/connectors/webcrawler/target/classes/org/apache/manifoldcf/crawler/connectors/webcrawler/common_en_US.properties
[INFO] Processing /x1/jenkins/jenkins-slave/workspace/ManifoldCF-mvn-1x/connectors/webcrawler/target/classes/org/apache/manifoldcf/crawler/connectors/webcrawler/common_ja_JP.properties
[INFO] Processing /x1/jenkins/jenkins-slave/workspace/ManifoldCF-mvn-1x/connectors/webcrawler/target/classes/org/apache/manifoldcf/crawler/connectors/webcrawler/common_zh_CN.properties
[INFO] 
[INFO] --- maven-resources-plugin:2.5:testResources (default-testResources) @ mcf-web-connector
---
[debug] execute contextualize
[INFO] Using 'UTF-8' encoding to copy filtered resources.
[INFO] skip non existing resourceDirectory /x1/jenkins/jenkins-slave/workspace/ManifoldCF-mvn-1x/connectors/webcrawler/connector/src/test/resources
[INFO] Copying 3 resources
[INFO] 
[INFO] --- maven-compiler-plugin:2.3.2:testCompile (default-testCompile) @ mcf-web-connector
---
[INFO] Compiling 17 source files to /x1/jenkins/jenkins-slave/workspace/ManifoldCF-mvn-1x/connectors/webcrawler/target/test-classes
[INFO] -------------------------------------------------------------
[ERROR] COMPILATION ERROR : 
[INFO] -------------------------------------------------------------
[ERROR] /x1/jenkins/jenkins-slave/workspace/ManifoldCF-mvn-1x/connectors/webcrawler/connector/src/test/java/org/apache/manifoldcf/crawler/connectors/webcrawler/DocumentContentExclusionIT.java:[14,64]
error: cannot find symbol
[ERROR]  package org.apache.manifoldcf.crawler.connectors.webcrawler.tests
/x1/jenkins/jenkins-slave/workspace/ManifoldCF-mvn-1x/connectors/webcrawler/connector/src/test/java/org/apache/manifoldcf/crawler/connectors/webcrawler/DocumentContentExclusionIT.java:[34,48]
error: cannot find symbol
[ERROR]  class BaseITHSQLDB
/x1/jenkins/jenkins-slave/workspace/ManifoldCF-mvn-1x/connectors/webcrawler/connector/src/test/java/org/apache/manifoldcf/crawler/connectors/webcrawler/DocumentContentExclusionIT.java:[197,8]
error: cannot find symbol
[ERROR]  class DocumentContentExclusionIT
/x1/jenkins/jenkins-slave/workspace/ManifoldCF-mvn-1x/connectors/webcrawler/connector/src/test/java/org/apache/manifoldcf/crawler/connectors/webcrawler/DocumentContentExclusionIT.java:[204,12]
error: cannot find symbol
[INFO] 4 errors 
[INFO] -------------------------------------------------------------
[INFO] ------------------------------------------------------------------------
[INFO] Reactor Summary:
[INFO] 
[INFO] ManifoldCF ........................................ SUCCESS [  2.526 s]
[INFO] ManifoldCF - Framework ............................ SUCCESS [  0.039 s]
[INFO] ManifoldCF - Framework - Core ..................... SUCCESS [  6.423 s]
[INFO] ManifoldCF - Connector-Common ..................... SUCCESS [  2.161 s]
[INFO] ManifoldCF - Framework - UI Core .................. SUCCESS [  1.719 s]
[INFO] ManifoldCF - Framework - Agents ................... SUCCESS [  3.203 s]
[INFO] ManifoldCF - Framework - Pull Agent ............... SUCCESS [ 10.025 s]
[INFO] ManifoldCF - Framework - Authority Servlet ........ SUCCESS [  2.440 s]
[INFO] ManifoldCF - Framework - API Servlet .............. SUCCESS [  4.054 s]
[INFO] ManifoldCF - Framework - Authority Service ........ SUCCESS [  4.250 s]
[INFO] ManifoldCF - Framework - API Service .............. SUCCESS [  2.897 s]
[INFO] ManifoldCF - Framework - Crawler UI ............... SUCCESS [  3.107 s]
[INFO] ManifoldCF - Framework - Script Engine ............ SUCCESS [  2.328 s]
[INFO] ManifoldCF - Framework - Combined Service ......... SUCCESS [  3.154 s]
[INFO] ManifoldCF - Test materials ....................... SUCCESS [  0.066 s]
[INFO] ManifoldCF - Test Materials - Alfresco WAR ........ SUCCESS [ 47.783 s]
[INFO] ManifoldCF - Connectors ........................... SUCCESS [  0.082 s]
[INFO] ManifoldCF - Connectors - Active Directory ........ SUCCESS [  4.030 s]
[INFO] ManifoldCF - Connectors - Alfresco Webscript ...... SUCCESS [ 17.875 s]
[INFO] ManifoldCF - Connectors - Filesystem .............. SUCCESS [  3.411 s]
[INFO] ManifoldCF - Connectors - MetaCarta GTS ........... SUCCESS [  2.272 s]
[INFO] ManifoldCF - Connectors - HDFS .................... SUCCESS [  3.453 s]
[INFO] ManifoldCF - Connectors - jCIFS ................... SUCCESS [  2.538 s]
[INFO] ManifoldCF - Connectors - JDBC .................... SUCCESS [  2.767 s]
[INFO] ManifoldCF - Connectors - GridFS .................. SUCCESS [  1.993 s]
[INFO] ManifoldCF - Connectors - LDAP .................... SUCCESS [  2.401 s]
[INFO] ManifoldCF - Connectors - Null Authority .......... SUCCESS [  1.520 s]
[INFO] ManifoldCF - Connectors - Null Output ............. SUCCESS [  1.142 s]
[INFO] ManifoldCF - Connectors - Null Transformation ..... SUCCESS [  1.051 s]
[INFO] ManifoldCF - Connectors - RSS ..................... SUCCESS [  2.814 s]
[INFO] ManifoldCF - Connectors - SharePoint .............. SUCCESS [  8.503 s]
[INFO] ManifoldCF - Connectors - Solr .................... SUCCESS [  3.892 s]
[INFO] ManifoldCF - Connectors - Web ..................... FAILURE [  2.687 s]
[INFO] ManifoldCF - Connectors - CMIS .................... SKIPPED
[INFO] ManifoldCF - Connectors - OpenSearchServer ........ SKIPPED
[INFO] ManifoldCF - Connectors - Wiki .................... SKIPPED
[INFO] ManifoldCF - Connectors - Alfresco ................ SKIPPED
[INFO] ManifoldCF - Connectors - ElasticSearch ........... SKIPPED
[INFO] ManifoldCF - Connectors - Dropbox ................. SKIPPED
[INFO] ManifoldCF - Connectors - GoogleDrive ............. SKIPPED
[INFO] ManifoldCF - Connectors - Jira .................... SKIPPED
[INFO] ManifoldCF - Connectors - Generic ................. SKIPPED
[INFO] ManifoldCF - Connectors - Regexp Mapper ........... SKIPPED
[INFO] ManifoldCF - Connectors - Email ................... SKIPPED
[INFO] ManifoldCF - Connectors - Amazon CloudSearch Output  SKIPPED
[INFO] ManifoldCF - Connectors - Forced metadata ......... SKIPPED
[INFO] ManifoldCF - Connectors - Tika Transformer ........ SKIPPED
[INFO] ManifoldCF - Connectors - Document Filter ......... SKIPPED
[INFO] ManifoldCF - Connectors - SearchBlox .............. SKIPPED
[INFO] ManifoldCF - Framework - Jetty Runner ............. SKIPPED
[INFO] ------------------------------------------------------------------------
[INFO] BUILD FAILURE
[INFO] ------------------------------------------------------------------------
[INFO] Total time: 02:39 min
[INFO] Finished at: 2015-05-27T04:39:48+00:00
[INFO] Final Memory: 42M/362M
[INFO] ------------------------------------------------------------------------
[ERROR] Failed to execute goal org.apache.maven.plugins:maven-compiler-plugin:2.3.2:testCompile
(default-testCompile) on project mcf-web-connector: Compilation failure: Compilation failure:
[ERROR] /x1/jenkins/jenkins-slave/workspace/ManifoldCF-mvn-1x/connectors/webcrawler/connector/src/test/java/org/apache/manifoldcf/crawler/connectors/webcrawler/DocumentContentExclusionIT.java:[14,64]
error: cannot find symbol
[ERROR] package org.apache.manifoldcf.crawler.connectors.webcrawler.tests
[ERROR] /x1/jenkins/jenkins-slave/workspace/ManifoldCF-mvn-1x/connectors/webcrawler/connector/src/test/java/org/apache/manifoldcf/crawler/connectors/webcrawler/DocumentContentExclusionIT.java:[34,48]
error: cannot find symbol
[ERROR] class BaseITHSQLDB
[ERROR] /x1/jenkins/jenkins-slave/workspace/ManifoldCF-mvn-1x/connectors/webcrawler/connector/src/test/java/org/apache/manifoldcf/crawler/connectors/webcrawler/DocumentContentExclusionIT.java:[197,8]
error: cannot find symbol
[ERROR] class DocumentContentExclusionIT
[ERROR] /x1/jenkins/jenkins-slave/workspace/ManifoldCF-mvn-1x/connectors/webcrawler/connector/src/test/java/org/apache/manifoldcf/crawler/connectors/webcrawler/DocumentContentExclusionIT.java:[204,12]
error: cannot find symbol
[ERROR] -> [Help 1]
[ERROR] 
[ERROR] To see the full stack trace of the errors, re-run Maven with the -e switch.
[ERROR] Re-run Maven using the -X switch to enable full debug logging.
[ERROR] 
[ERROR] For more information about the errors and possible solutions, please read the following
articles:
[ERROR] [Help 1] http://cwiki.apache.org/confluence/display/MAVEN/MojoFailureException
[ERROR] 
[ERROR] After correcting the problems, you can resume the build with the command
[ERROR]   mvn <goals> -rf :mcf-web-connector
Build step 'Invoke top-level Maven targets' marked build as failure
[locks-and-latches] Releasing all the locks
[locks-and-latches] All the locks released

Mime
View raw message