manifoldcf-dev mailing list archives

Site index · List index
Message view « Date » · « Thread »
Top « Date » · « Thread »
From Apache Jenkins Server <jenk...@builds.apache.org>
Subject Build failed in Jenkins: ManifoldCF-mvn #372
Date Sun, 22 Mar 2015 01:24:29 GMT
See <https://builds.apache.org/job/ManifoldCF-mvn/372/changes>

Changes:

[kwright] Add SearchBlox connector, CONNECTORS-1168

------------------------------------------
Started by an SCM change
Building remotely on ubuntu3 (Ubuntu ubuntu legacy-ubuntu) in workspace <https://builds.apache.org/job/ManifoldCF-mvn/ws/>
Updating https://svn.apache.org/repos/asf/manifoldcf/trunk at revision '2015-03-22T01:24:06.788
+0000'
U         connectors/pom.xml
A         connectors/searchblox
A         connectors/searchblox/connector
A         connectors/searchblox/connector/src
A         connectors/searchblox/connector/src/main
A         connectors/searchblox/connector/src/main/java
A         connectors/searchblox/connector/src/main/java/org
A         connectors/searchblox/connector/src/main/java/org/apache
A         connectors/searchblox/connector/src/main/java/org/apache/manifoldcf
A         connectors/searchblox/connector/src/main/java/org/apache/manifoldcf/agents
A         connectors/searchblox/connector/src/main/java/org/apache/manifoldcf/agents/output
A         connectors/searchblox/connector/src/main/java/org/apache/manifoldcf/agents/output/searchblox
A         connectors/searchblox/connector/src/main/java/org/apache/manifoldcf/agents/output/searchblox/SearchBloxClient.java
A         connectors/searchblox/connector/src/main/java/org/apache/manifoldcf/agents/output/searchblox/SearchBloxDocument.java
A         connectors/searchblox/connector/src/main/java/org/apache/manifoldcf/agents/output/searchblox/SearchBloxException.java
A         connectors/searchblox/connector/src/main/java/org/apache/manifoldcf/agents/output/searchblox/SearchBloxConfig.java
A         connectors/searchblox/connector/src/main/java/org/apache/manifoldcf/agents/output/searchblox/SearchBloxConnector.java
A         connectors/searchblox/connector/src/main/java/org/apache/manifoldcf/agents/output/searchblox/Messages.java
A         connectors/searchblox/connector/src/main/native2ascii
A         connectors/searchblox/connector/src/main/native2ascii/org
A         connectors/searchblox/connector/src/main/native2ascii/org/apache
A         connectors/searchblox/connector/src/main/native2ascii/org/apache/manifoldcf
A         connectors/searchblox/connector/src/main/native2ascii/org/apache/manifoldcf/agents
A         connectors/searchblox/connector/src/main/native2ascii/org/apache/manifoldcf/agents/output
A         connectors/searchblox/connector/src/main/native2ascii/org/apache/manifoldcf/agents/output/searchblox
A         connectors/searchblox/connector/src/main/native2ascii/org/apache/manifoldcf/agents/output/searchblox/common_en_US.properties
A         connectors/searchblox/connector/src/main/resources
A         connectors/searchblox/connector/src/main/resources/org
A         connectors/searchblox/connector/src/main/resources/org/apache
A         connectors/searchblox/connector/src/main/resources/org/apache/manifoldcf
A         connectors/searchblox/connector/src/main/resources/org/apache/manifoldcf/agents
A         connectors/searchblox/connector/src/main/resources/org/apache/manifoldcf/agents/output
A         connectors/searchblox/connector/src/main/resources/org/apache/manifoldcf/agents/output/searchblox
A         connectors/searchblox/connector/src/main/resources/org/apache/manifoldcf/agents/output/searchblox/viewSpecification.html
A         connectors/searchblox/connector/src/main/resources/org/apache/manifoldcf/agents/output/searchblox/editSpecification_Configuration.html
A         connectors/searchblox/connector/src/main/resources/org/apache/manifoldcf/agents/output/searchblox/editSpecification.js
A         connectors/searchblox/connector/src/main/resources/org/apache/manifoldcf/agents/output/searchblox/editConfiguration_Parameters.html
A         connectors/searchblox/connector/src/main/resources/org/apache/manifoldcf/agents/output/searchblox/viewConfiguration.html
A         connectors/searchblox/connector/src/main/resources/org/apache/manifoldcf/agents/output/searchblox/editConfiguration.js
A         connectors/searchblox/connector/src/test
A         connectors/searchblox/connector/src/test/java
A         connectors/searchblox/connector/src/test/java/org
A         connectors/searchblox/connector/src/test/java/org/apache
A         connectors/searchblox/connector/src/test/java/org/apache/manifoldcf
A         connectors/searchblox/connector/src/test/java/org/apache/manifoldcf/agents
A         connectors/searchblox/connector/src/test/java/org/apache/manifoldcf/agents/output
A         connectors/searchblox/connector/src/test/java/org/apache/manifoldcf/agents/output/searchblox
A         connectors/searchblox/connector/src/test/java/org/apache/manifoldcf/agents/output/searchblox/tests
A         connectors/searchblox/connector/src/test/java/org/apache/manifoldcf/agents/output/searchblox/tests/SearchBloxDocumentTest.java
A         connectors/searchblox/pom.xml
A         connectors/searchblox/build.xml
U         lib-license/LICENSE.txt
U         build.xml
 U        .
At revision 1668331
[locks-and-latches] Checking to see if we really have the locks
[locks-and-latches] Have all the locks, build can start
[ManifoldCF-mvn] $ /home/jenkins/jenkins-slave/tools/hudson.tasks.Maven_MavenInstallation/maven-3.2.1/bin/mvn
-DskipTests=false -DskipITs=true clean -DskipTests -DskipITs install
[INFO] Scanning for projects...
Downloading: http://repo.maven.apache.org/maven2/org/apache/manifoldcf/mcf-connectors/2.0.2/mcf-connectors-2.0.2.pom

[ERROR] The build could not read 1 project -> [Help 1]
[ERROR]   
[ERROR]   The project org.apache.manifoldcf:mcf-searchblox-connector:2.0.2 (/x1/jenkins/jenkins-slave/workspace/ManifoldCF-mvn/connectors/searchblox/pom.xml)
has 1 error
[ERROR]     Non-resolvable parent POM: Could not find artifact org.apache.manifoldcf:mcf-connectors:pom:2.0.2
in central (http://repo.maven.apache.org/maven2) and 'parent.relativePath' points at wrong
local POM @ line 6, column 10 -> [Help 2]
[ERROR] 
[ERROR] To see the full stack trace of the errors, re-run Maven with the -e switch.
[ERROR] Re-run Maven using the -X switch to enable full debug logging.
[ERROR] 
[ERROR] For more information about the errors and possible solutions, please read the following
articles:
[ERROR] [Help 1] http://cwiki.apache.org/confluence/display/MAVEN/ProjectBuildingException
[ERROR] [Help 2] http://cwiki.apache.org/confluence/display/MAVEN/UnresolvableModelException
Build step 'Invoke top-level Maven targets' marked build as failure
[locks-and-latches] Releasing all the locks
[locks-and-latches] All the locks released

Mime
View raw message