manifoldcf-dev mailing list archives

Site index · List index
Message view « Date » · « Thread »
Top « Date » · « Thread »
From Apache Jenkins Server <jenk...@builds.apache.org>
Subject Build failed in Jenkins: ManifoldCF-mvn #290
Date Sun, 12 Oct 2014 01:26:43 GMT
See <https://builds.apache.org/job/ManifoldCF-mvn/290/changes>

Changes:

[kwright] Fix for CONNECTORS-1061.

------------------------------------------
[...truncated 937 lines...]
[INFO] ManifoldCF - Framework - API Service .............. SUCCESS [  4.555 s]
[INFO] ManifoldCF - Framework - Crawler UI ............... SUCCESS [  4.285 s]
[INFO] ManifoldCF - Framework - Script Engine ............ SUCCESS [  2.329 s]
[INFO] ManifoldCF - Framework - Combined Service ......... SUCCESS [  2.768 s]
[INFO] ManifoldCF - Test materials ....................... SUCCESS [  0.322 s]
[INFO] ManifoldCF - Test Materials - Alfresco WAR ........ SUCCESS [ 46.150 s]
[INFO] ManifoldCF - Connectors ........................... SUCCESS [  0.066 s]
[INFO] ManifoldCF - Connectors - Active Directory ........ SUCCESS [  4.294 s]
[INFO] ManifoldCF - Connectors - Alfresco Webscript ...... FAILURE [  4.205 s]
[INFO] ManifoldCF - Connectors - Filesystem .............. SKIPPED
[INFO] ManifoldCF - Connectors - MetaCarta GTS ........... SKIPPED
[INFO] ManifoldCF - Connectors - HDFS .................... SKIPPED
[INFO] ManifoldCF - Connectors - jCIFS ................... SKIPPED
[INFO] ManifoldCF - Connectors - JDBC .................... SKIPPED
[INFO] ManifoldCF - Connectors - GridFS .................. SKIPPED
[INFO] ManifoldCF - Connectors - LDAP .................... SKIPPED
[INFO] ManifoldCF - Connectors - Null Authority .......... SKIPPED
[INFO] ManifoldCF - Connectors - Null Output ............. SKIPPED
[INFO] ManifoldCF - Connectors - Null Transformation ..... SKIPPED
[INFO] ManifoldCF - Connectors - RSS ..................... SKIPPED
[INFO] ManifoldCF - Connectors - SharePoint .............. SKIPPED
[INFO] ManifoldCF - Connectors - Solr .................... SKIPPED
[INFO] ManifoldCF - Connectors - Web ..................... SKIPPED
[INFO] ManifoldCF - Connectors - CMIS .................... SKIPPED
[INFO] ManifoldCF - Connectors - OpenSearchServer ........ SKIPPED
[INFO] ManifoldCF - Connectors - Wiki .................... SKIPPED
[INFO] ManifoldCF - Connectors - Alfresco ................ SKIPPED
[INFO] ManifoldCF - Connectors - ElasticSearch ........... SKIPPED
[INFO] ManifoldCF - Connectors - Dropbox ................. SKIPPED
[INFO] ManifoldCF - Connectors - GoogleDrive ............. SKIPPED
[INFO] ManifoldCF - Connectors - Jira .................... SKIPPED
[INFO] ManifoldCF - Connectors - Generic ................. SKIPPED
[INFO] ManifoldCF - Connectors - Regexp Mapper ........... SKIPPED
[INFO] ManifoldCF - Connectors - Email ................... SKIPPED
[INFO] ManifoldCF - Connectors - Amazon CloudSearch Output  SKIPPED
[INFO] ManifoldCF - Connectors - Forced metadata ......... SKIPPED
[INFO] ManifoldCF - Connectors - Tika Transformer ........ SKIPPED
[INFO] ManifoldCF - Connectors - Document Filter ......... SKIPPED
[INFO] ManifoldCF - Framework - Jetty Runner ............. SKIPPED
[INFO] ------------------------------------------------------------------------
[INFO] BUILD FAILURE
[INFO] ------------------------------------------------------------------------
[INFO] Total time: 01:34 min
[INFO] Finished at: 2014-10-12T01:26:42+00:00
[INFO] Final Memory: 32M/389M
[INFO] ------------------------------------------------------------------------
[ERROR] Failed to execute goal org.apache.maven.plugins:maven-compiler-plugin:2.3.2:testCompile
(default-testCompile) on project mcf-alfresco-webscript-connector: Compilation failure: Compilation
failure:
[ERROR] /x1/jenkins/jenkins-slave/workspace/ManifoldCF-mvn/connectors/alfresco-webscript/connector/src/test/java/org/apache/manifoldcf/crawler/connectors/alfrescowebscript/tests/NavigationHSQLDBUI.java:[23,39]
error: package org.apache.manifoldcf.core.tests does not exist
[ERROR] /x1/jenkins/jenkins-slave/workspace/ManifoldCF-mvn/connectors/alfresco-webscript/connector/src/test/java/org/apache/manifoldcf/crawler/connectors/alfrescowebscript/tests/BaseUIHSQLDB.java:[23,69]
error: package org.apache.manifoldcf.crawler.tests does not exist
[ERROR] /x1/jenkins/jenkins-slave/workspace/ManifoldCF-mvn/connectors/alfresco-webscript/connector/src/test/java/org/apache/manifoldcf/crawler/connectors/alfrescowebscript/tests/NavigationHSQLDBUI.java:[34,4]
error: cannot find symbol
[ERROR] class NavigationHSQLDBUI
[ERROR] /x1/jenkins/jenkins-slave/workspace/ManifoldCF-mvn/connectors/alfresco-webscript/connector/src/test/java/org/apache/manifoldcf/crawler/connectors/alfrescowebscript/tests/NavigationHSQLDBUI.java:[36,14]
error: package HTMLTester does not exist
[ERROR] /x1/jenkins/jenkins-slave/workspace/ManifoldCF-mvn/connectors/alfresco-webscript/connector/src/test/java/org/apache/manifoldcf/crawler/connectors/alfrescowebscript/tests/NavigationHSQLDBUI.java:[37,14]
error: package HTMLTester does not exist
[ERROR] /x1/jenkins/jenkins-slave/workspace/ManifoldCF-mvn/connectors/alfresco-webscript/connector/src/test/java/org/apache/manifoldcf/crawler/connectors/alfrescowebscript/tests/NavigationHSQLDBUI.java:[38,14]
error: package HTMLTester does not exist
[ERROR] /x1/jenkins/jenkins-slave/workspace/ManifoldCF-mvn/connectors/alfresco-webscript/connector/src/test/java/org/apache/manifoldcf/crawler/connectors/alfrescowebscript/tests/NavigationHSQLDBUI.java:[39,14]
error: package HTMLTester does not exist
[ERROR] /x1/jenkins/jenkins-slave/workspace/ManifoldCF-mvn/connectors/alfresco-webscript/connector/src/test/java/org/apache/manifoldcf/crawler/connectors/alfrescowebscript/tests/NavigationHSQLDBUI.java:[40,14]
error: package HTMLTester does not exist
[ERROR] /x1/jenkins/jenkins-slave/workspace/ManifoldCF-mvn/connectors/alfresco-webscript/connector/src/test/java/org/apache/manifoldcf/crawler/connectors/alfrescowebscript/tests/NavigationHSQLDBUI.java:[41,14]
error: package HTMLTester does not exist
[ERROR] /x1/jenkins/jenkins-slave/workspace/ManifoldCF-mvn/connectors/alfresco-webscript/connector/src/test/java/org/apache/manifoldcf/crawler/connectors/alfrescowebscript/tests/NavigationHSQLDBUI.java:[42,14]
error: package HTMLTester does not exist
[ERROR] /x1/jenkins/jenkins-slave/workspace/ManifoldCF-mvn/connectors/alfresco-webscript/connector/src/test/java/org/apache/manifoldcf/crawler/connectors/alfrescowebscript/tests/NavigationHSQLDBUI.java:[43,14]
error: package HTMLTester does not exist
[ERROR] /x1/jenkins/jenkins-slave/workspace/ManifoldCF-mvn/connectors/alfresco-webscript/connector/src/test/java/org/apache/manifoldcf/crawler/connectors/alfrescowebscript/tests/NavigationHSQLDBUI.java:[45,13]
error: cannot find symbol
[ERROR] class NavigationHSQLDBUI
[ERROR] /x1/jenkins/jenkins-slave/workspace/ManifoldCF-mvn/connectors/alfresco-webscript/connector/src/test/java/org/apache/manifoldcf/crawler/connectors/alfrescowebscript/tests/NavigationHSQLDBUI.java:[48,27]
error: cannot find symbol
[ERROR] class NavigationHSQLDBUI
[ERROR] /x1/jenkins/jenkins-slave/workspace/ManifoldCF-mvn/connectors/alfresco-webscript/connector/src/test/java/org/apache/manifoldcf/crawler/connectors/alfrescowebscript/tests/NavigationHSQLDBUI.java:[49,33]
error: cannot find symbol
[ERROR] class NavigationHSQLDBUI
[ERROR] /x1/jenkins/jenkins-slave/workspace/ManifoldCF-mvn/connectors/alfresco-webscript/connector/src/test/java/org/apache/manifoldcf/crawler/connectors/alfrescowebscript/tests/NavigationHSQLDBUI.java:[50,22]
error: cannot find symbol
[ERROR] class NavigationHSQLDBUI
[ERROR] /x1/jenkins/jenkins-slave/workspace/ManifoldCF-mvn/connectors/alfresco-webscript/connector/src/test/java/org/apache/manifoldcf/crawler/connectors/alfrescowebscript/tests/NavigationHSQLDBUI.java:[51,33]
error: cannot find symbol
[ERROR] class NavigationHSQLDBUI
[ERROR] /x1/jenkins/jenkins-slave/workspace/ManifoldCF-mvn/connectors/alfresco-webscript/connector/src/test/java/org/apache/manifoldcf/crawler/connectors/alfrescowebscript/tests/NavigationHSQLDBUI.java:[52,22]
error: cannot find symbol
[ERROR] class NavigationHSQLDBUI
[ERROR] /x1/jenkins/jenkins-slave/workspace/ManifoldCF-mvn/connectors/alfresco-webscript/connector/src/test/java/org/apache/manifoldcf/crawler/connectors/alfrescowebscript/tests/NavigationHSQLDBUI.java:[53,31]
error: cannot find symbol
[ERROR] class NavigationHSQLDBUI
[ERROR] /x1/jenkins/jenkins-slave/workspace/ManifoldCF-mvn/connectors/alfresco-webscript/connector/src/test/java/org/apache/manifoldcf/crawler/connectors/alfrescowebscript/tests/NavigationHSQLDBUI.java:[55,13]
error: cannot find symbol
[ERROR] class NavigationHSQLDBUI
[ERROR] /x1/jenkins/jenkins-slave/workspace/ManifoldCF-mvn/connectors/alfresco-webscript/connector/src/test/java/org/apache/manifoldcf/crawler/connectors/alfrescowebscript/tests/NavigationHSQLDBUI.java:[58,27]
error: cannot find symbol
[ERROR] class NavigationHSQLDBUI
[ERROR] /x1/jenkins/jenkins-slave/workspace/ManifoldCF-mvn/connectors/alfresco-webscript/connector/src/test/java/org/apache/manifoldcf/crawler/connectors/alfrescowebscript/tests/NavigationHSQLDBUI.java:[60,13]
error: cannot find symbol
[ERROR] class NavigationHSQLDBUI
[ERROR] /x1/jenkins/jenkins-slave/workspace/ManifoldCF-mvn/connectors/alfresco-webscript/connector/src/test/java/org/apache/manifoldcf/crawler/connectors/alfrescowebscript/tests/NavigationHSQLDBUI.java:[61,27]
error: cannot find symbol
[ERROR] class NavigationHSQLDBUI
[ERROR] /x1/jenkins/jenkins-slave/workspace/ManifoldCF-mvn/connectors/alfresco-webscript/connector/src/test/java/org/apache/manifoldcf/crawler/connectors/alfrescowebscript/tests/NavigationHSQLDBUI.java:[64,13]
error: cannot find symbol
[ERROR] class NavigationHSQLDBUI
[ERROR] /x1/jenkins/jenkins-slave/workspace/ManifoldCF-mvn/connectors/alfresco-webscript/connector/src/test/java/org/apache/manifoldcf/crawler/connectors/alfrescowebscript/tests/NavigationHSQLDBUI.java:[65,27]
error: cannot find symbol
[ERROR] class NavigationHSQLDBUI
[ERROR] /x1/jenkins/jenkins-slave/workspace/ManifoldCF-mvn/connectors/alfresco-webscript/connector/src/test/java/org/apache/manifoldcf/crawler/connectors/alfrescowebscript/tests/NavigationHSQLDBUI.java:[66,33]
error: cannot find symbol
[ERROR] class NavigationHSQLDBUI
[ERROR] /x1/jenkins/jenkins-slave/workspace/ManifoldCF-mvn/connectors/alfresco-webscript/connector/src/test/java/org/apache/manifoldcf/crawler/connectors/alfrescowebscript/tests/NavigationHSQLDBUI.java:[67,22]
error: cannot find symbol
[ERROR] class NavigationHSQLDBUI
[ERROR] /x1/jenkins/jenkins-slave/workspace/ManifoldCF-mvn/connectors/alfresco-webscript/connector/src/test/java/org/apache/manifoldcf/crawler/connectors/alfrescowebscript/tests/NavigationHSQLDBUI.java:[68,27]
error: cannot find symbol
[ERROR] class NavigationHSQLDBUI
[ERROR] /x1/jenkins/jenkins-slave/workspace/ManifoldCF-mvn/connectors/alfresco-webscript/connector/src/test/java/org/apache/manifoldcf/crawler/connectors/alfrescowebscript/tests/NavigationHSQLDBUI.java:[71,13]
error: cannot find symbol
[ERROR] class NavigationHSQLDBUI
[ERROR] /x1/jenkins/jenkins-slave/workspace/ManifoldCF-mvn/connectors/alfresco-webscript/connector/src/test/java/org/apache/manifoldcf/crawler/connectors/alfrescowebscript/tests/NavigationHSQLDBUI.java:[72,27]
error: cannot find symbol
[ERROR] class NavigationHSQLDBUI
[ERROR] /x1/jenkins/jenkins-slave/workspace/ManifoldCF-mvn/connectors/alfresco-webscript/connector/src/test/java/org/apache/manifoldcf/crawler/connectors/alfrescowebscript/tests/NavigationHSQLDBUI.java:[73,35]
error: cannot find symbol
[ERROR] class NavigationHSQLDBUI
[ERROR] /x1/jenkins/jenkins-slave/workspace/ManifoldCF-mvn/connectors/alfresco-webscript/connector/src/test/java/org/apache/manifoldcf/crawler/connectors/alfrescowebscript/tests/NavigationHSQLDBUI.java:[74,26]
error: cannot find symbol
[ERROR] class NavigationHSQLDBUI
[ERROR] /x1/jenkins/jenkins-slave/workspace/ManifoldCF-mvn/connectors/alfresco-webscript/connector/src/test/java/org/apache/manifoldcf/crawler/connectors/alfrescowebscript/tests/NavigationHSQLDBUI.java:[75,31]
error: cannot find symbol
[ERROR] class NavigationHSQLDBUI
[ERROR] /x1/jenkins/jenkins-slave/workspace/ManifoldCF-mvn/connectors/alfresco-webscript/connector/src/test/java/org/apache/manifoldcf/crawler/connectors/alfrescowebscript/tests/NavigationHSQLDBUI.java:[78,13]
error: cannot find symbol
[ERROR] class NavigationHSQLDBUI
[ERROR] /x1/jenkins/jenkins-slave/workspace/ManifoldCF-mvn/connectors/alfresco-webscript/connector/src/test/java/org/apache/manifoldcf/crawler/connectors/alfrescowebscript/tests/NavigationHSQLDBUI.java:[79,27]
error: cannot find symbol
[ERROR] class NavigationHSQLDBUI
[ERROR] /x1/jenkins/jenkins-slave/workspace/ManifoldCF-mvn/connectors/alfresco-webscript/connector/src/test/java/org/apache/manifoldcf/crawler/connectors/alfrescowebscript/tests/NavigationHSQLDBUI.java:[82,13]
error: cannot find symbol
[ERROR] class NavigationHSQLDBUI
[ERROR] /x1/jenkins/jenkins-slave/workspace/ManifoldCF-mvn/connectors/alfresco-webscript/connector/src/test/java/org/apache/manifoldcf/crawler/connectors/alfrescowebscript/tests/NavigationHSQLDBUI.java:[83,27]
error: cannot find symbol
[ERROR] class NavigationHSQLDBUI
[ERROR] /x1/jenkins/jenkins-slave/workspace/ManifoldCF-mvn/connectors/alfresco-webscript/connector/src/test/java/org/apache/manifoldcf/crawler/connectors/alfrescowebscript/tests/NavigationHSQLDBUI.java:[86,13]
error: cannot find symbol
[ERROR] class NavigationHSQLDBUI
[ERROR] /x1/jenkins/jenkins-slave/workspace/ManifoldCF-mvn/connectors/alfresco-webscript/connector/src/test/java/org/apache/manifoldcf/crawler/connectors/alfrescowebscript/tests/NavigationHSQLDBUI.java:[87,31]
error: cannot find symbol
[ERROR] class NavigationHSQLDBUI
[ERROR] /x1/jenkins/jenkins-slave/workspace/ManifoldCF-mvn/connectors/alfresco-webscript/connector/src/test/java/org/apache/manifoldcf/crawler/connectors/alfrescowebscript/tests/NavigationHSQLDBUI.java:[91,13]
error: cannot find symbol
[ERROR] class NavigationHSQLDBUI
[ERROR] /x1/jenkins/jenkins-slave/workspace/ManifoldCF-mvn/connectors/alfresco-webscript/connector/src/test/java/org/apache/manifoldcf/crawler/connectors/alfrescowebscript/tests/NavigationHSQLDBUI.java:[92,27]
error: cannot find symbol
[ERROR] class NavigationHSQLDBUI
[ERROR] /x1/jenkins/jenkins-slave/workspace/ManifoldCF-mvn/connectors/alfresco-webscript/connector/src/test/java/org/apache/manifoldcf/crawler/connectors/alfrescowebscript/tests/NavigationHSQLDBUI.java:[94,13]
error: cannot find symbol
[ERROR] class NavigationHSQLDBUI
[ERROR] /x1/jenkins/jenkins-slave/workspace/ManifoldCF-mvn/connectors/alfresco-webscript/connector/src/test/java/org/apache/manifoldcf/crawler/connectors/alfrescowebscript/tests/NavigationHSQLDBUI.java:[95,27]
error: cannot find symbol
[ERROR] class NavigationHSQLDBUI
[ERROR] /x1/jenkins/jenkins-slave/workspace/ManifoldCF-mvn/connectors/alfresco-webscript/connector/src/test/java/org/apache/manifoldcf/crawler/connectors/alfrescowebscript/tests/NavigationHSQLDBUI.java:[98,13]
error: cannot find symbol
[ERROR] class NavigationHSQLDBUI
[ERROR] /x1/jenkins/jenkins-slave/workspace/ManifoldCF-mvn/connectors/alfresco-webscript/connector/src/test/java/org/apache/manifoldcf/crawler/connectors/alfrescowebscript/tests/NavigationHSQLDBUI.java:[99,27]
error: cannot find symbol
[ERROR] class NavigationHSQLDBUI
[ERROR] /x1/jenkins/jenkins-slave/workspace/ManifoldCF-mvn/connectors/alfresco-webscript/connector/src/test/java/org/apache/manifoldcf/crawler/connectors/alfrescowebscript/tests/NavigationHSQLDBUI.java:[100,33]
error: cannot find symbol
[ERROR] class NavigationHSQLDBUI
[ERROR] /x1/jenkins/jenkins-slave/workspace/ManifoldCF-mvn/connectors/alfresco-webscript/connector/src/test/java/org/apache/manifoldcf/crawler/connectors/alfrescowebscript/tests/NavigationHSQLDBUI.java:[101,22]
error: cannot find symbol
[ERROR] class NavigationHSQLDBUI
[ERROR] /x1/jenkins/jenkins-slave/workspace/ManifoldCF-mvn/connectors/alfresco-webscript/connector/src/test/java/org/apache/manifoldcf/crawler/connectors/alfrescowebscript/tests/NavigationHSQLDBUI.java:[102,27]
error: cannot find symbol
[ERROR] class NavigationHSQLDBUI
[ERROR] /x1/jenkins/jenkins-slave/workspace/ManifoldCF-mvn/connectors/alfresco-webscript/connector/src/test/java/org/apache/manifoldcf/crawler/connectors/alfrescowebscript/tests/NavigationHSQLDBUI.java:[105,13]
error: cannot find symbol
[ERROR] class NavigationHSQLDBUI
[ERROR] /x1/jenkins/jenkins-slave/workspace/ManifoldCF-mvn/connectors/alfresco-webscript/connector/src/test/java/org/apache/manifoldcf/crawler/connectors/alfrescowebscript/tests/NavigationHSQLDBUI.java:[106,27]
error: cannot find symbol
[ERROR] class NavigationHSQLDBUI
[ERROR] /x1/jenkins/jenkins-slave/workspace/ManifoldCF-mvn/connectors/alfresco-webscript/connector/src/test/java/org/apache/manifoldcf/crawler/connectors/alfrescowebscript/tests/NavigationHSQLDBUI.java:[107,35]
error: cannot find symbol
[ERROR] class NavigationHSQLDBUI
[ERROR] /x1/jenkins/jenkins-slave/workspace/ManifoldCF-mvn/connectors/alfresco-webscript/connector/src/test/java/org/apache/manifoldcf/crawler/connectors/alfrescowebscript/tests/NavigationHSQLDBUI.java:[108,26]
error: cannot find symbol
[ERROR] class NavigationHSQLDBUI
[ERROR] /x1/jenkins/jenkins-slave/workspace/ManifoldCF-mvn/connectors/alfresco-webscript/connector/src/test/java/org/apache/manifoldcf/crawler/connectors/alfrescowebscript/tests/NavigationHSQLDBUI.java:[109,31]
error: cannot find symbol
[ERROR] class NavigationHSQLDBUI
[ERROR] /x1/jenkins/jenkins-slave/workspace/ManifoldCF-mvn/connectors/alfresco-webscript/connector/src/test/java/org/apache/manifoldcf/crawler/connectors/alfrescowebscript/tests/NavigationHSQLDBUI.java:[112,13]
error: cannot find symbol
[ERROR] class NavigationHSQLDBUI
[ERROR] /x1/jenkins/jenkins-slave/workspace/ManifoldCF-mvn/connectors/alfresco-webscript/connector/src/test/java/org/apache/manifoldcf/crawler/connectors/alfrescowebscript/tests/NavigationHSQLDBUI.java:[113,27]
error: cannot find symbol
[ERROR] class NavigationHSQLDBUI
[ERROR] /x1/jenkins/jenkins-slave/workspace/ManifoldCF-mvn/connectors/alfresco-webscript/connector/src/test/java/org/apache/manifoldcf/crawler/connectors/alfrescowebscript/tests/NavigationHSQLDBUI.java:[116,13]
error: cannot find symbol
[ERROR] class NavigationHSQLDBUI
[ERROR] /x1/jenkins/jenkins-slave/workspace/ManifoldCF-mvn/connectors/alfresco-webscript/connector/src/test/java/org/apache/manifoldcf/crawler/connectors/alfrescowebscript/tests/NavigationHSQLDBUI.java:[117,27]
error: cannot find symbol
[ERROR] class NavigationHSQLDBUI
[ERROR] /x1/jenkins/jenkins-slave/workspace/ManifoldCF-mvn/connectors/alfresco-webscript/connector/src/test/java/org/apache/manifoldcf/crawler/connectors/alfrescowebscript/tests/NavigationHSQLDBUI.java:[119,13]
error: cannot find symbol
[ERROR] class NavigationHSQLDBUI
[ERROR] /x1/jenkins/jenkins-slave/workspace/ManifoldCF-mvn/connectors/alfresco-webscript/connector/src/test/java/org/apache/manifoldcf/crawler/connectors/alfrescowebscript/tests/NavigationHSQLDBUI.java:[120,27]
error: cannot find symbol
[ERROR] class NavigationHSQLDBUI
[ERROR] /x1/jenkins/jenkins-slave/workspace/ManifoldCF-mvn/connectors/alfresco-webscript/connector/src/test/java/org/apache/manifoldcf/crawler/connectors/alfrescowebscript/tests/NavigationHSQLDBUI.java:[121,33]
error: cannot find symbol
[ERROR] class NavigationHSQLDBUI
[ERROR] /x1/jenkins/jenkins-slave/workspace/ManifoldCF-mvn/connectors/alfresco-webscript/connector/src/test/java/org/apache/manifoldcf/crawler/connectors/alfrescowebscript/tests/NavigationHSQLDBUI.java:[122,22]
error: cannot find symbol
[ERROR] class NavigationHSQLDBUI
[ERROR] /x1/jenkins/jenkins-slave/workspace/ManifoldCF-mvn/connectors/alfresco-webscript/connector/src/test/java/org/apache/manifoldcf/crawler/connectors/alfrescowebscript/tests/NavigationHSQLDBUI.java:[123,33]
error: cannot find symbol
[ERROR] class NavigationHSQLDBUI
[ERROR] /x1/jenkins/jenkins-slave/workspace/ManifoldCF-mvn/connectors/alfresco-webscript/connector/src/test/java/org/apache/manifoldcf/crawler/connectors/alfrescowebscript/tests/NavigationHSQLDBUI.java:[124,22]
error: cannot find symbol
[ERROR] class NavigationHSQLDBUI
[ERROR] /x1/jenkins/jenkins-slave/workspace/ManifoldCF-mvn/connectors/alfresco-webscript/connector/src/test/java/org/apache/manifoldcf/crawler/connectors/alfrescowebscript/tests/NavigationHSQLDBUI.java:[125,35]
error: cannot find symbol
[ERROR] class NavigationHSQLDBUI
[ERROR] /x1/jenkins/jenkins-slave/workspace/ManifoldCF-mvn/connectors/alfresco-webscript/connector/src/test/java/org/apache/manifoldcf/crawler/connectors/alfrescowebscript/tests/NavigationHSQLDBUI.java:[126,26]
error: cannot find symbol
[ERROR] class NavigationHSQLDBUI
[ERROR] /x1/jenkins/jenkins-slave/workspace/ManifoldCF-mvn/connectors/alfresco-webscript/connector/src/test/java/org/apache/manifoldcf/crawler/connectors/alfrescowebscript/tests/NavigationHSQLDBUI.java:[127,33]
error: cannot find symbol
[ERROR] class NavigationHSQLDBUI
[ERROR] /x1/jenkins/jenkins-slave/workspace/ManifoldCF-mvn/connectors/alfresco-webscript/connector/src/test/java/org/apache/manifoldcf/crawler/connectors/alfrescowebscript/tests/NavigationHSQLDBUI.java:[128,22]
error: cannot find symbol
[ERROR] class NavigationHSQLDBUI
[ERROR] /x1/jenkins/jenkins-slave/workspace/ManifoldCF-mvn/connectors/alfresco-webscript/connector/src/test/java/org/apache/manifoldcf/crawler/connectors/alfrescowebscript/tests/NavigationHSQLDBUI.java:[129,33]
error: cannot find symbol
[ERROR] class NavigationHSQLDBUI
[ERROR] /x1/jenkins/jenkins-slave/workspace/ManifoldCF-mvn/connectors/alfresco-webscript/connector/src/test/java/org/apache/manifoldcf/crawler/connectors/alfrescowebscript/tests/NavigationHSQLDBUI.java:[130,22]
error: cannot find symbol
[ERROR] class NavigationHSQLDBUI
[ERROR] /x1/jenkins/jenkins-slave/workspace/ManifoldCF-mvn/connectors/alfresco-webscript/connector/src/test/java/org/apache/manifoldcf/crawler/connectors/alfrescowebscript/tests/NavigationHSQLDBUI.java:[136,27]
error: cannot find symbol
[ERROR] class NavigationHSQLDBUI
[ERROR] /x1/jenkins/jenkins-slave/workspace/ManifoldCF-mvn/connectors/alfresco-webscript/connector/src/test/java/org/apache/manifoldcf/crawler/connectors/alfrescowebscript/tests/NavigationHSQLDBUI.java:[138,13]
error: cannot find symbol
[ERROR] class NavigationHSQLDBUI
[ERROR] /x1/jenkins/jenkins-slave/workspace/ManifoldCF-mvn/connectors/alfresco-webscript/connector/src/test/java/org/apache/manifoldcf/crawler/connectors/alfrescowebscript/tests/NavigationHSQLDBUI.java:[140,31]
error: cannot find symbol
[ERROR] class NavigationHSQLDBUI
[ERROR] /x1/jenkins/jenkins-slave/workspace/ManifoldCF-mvn/connectors/alfresco-webscript/connector/src/test/java/org/apache/manifoldcf/crawler/connectors/alfrescowebscript/tests/NavigationHSQLDBUI.java:[144,13]
error: cannot find symbol
[ERROR] class NavigationHSQLDBUI
[ERROR] /x1/jenkins/jenkins-slave/workspace/ManifoldCF-mvn/connectors/alfresco-webscript/connector/src/test/java/org/apache/manifoldcf/crawler/connectors/alfrescowebscript/tests/NavigationHSQLDBUI.java:[145,27]
error: cannot find symbol
[ERROR] class NavigationHSQLDBUI
[ERROR] /x1/jenkins/jenkins-slave/workspace/ManifoldCF-mvn/connectors/alfresco-webscript/connector/src/test/java/org/apache/manifoldcf/crawler/connectors/alfrescowebscript/tests/NavigationHSQLDBUI.java:[148,13]
error: cannot find symbol
[ERROR] class NavigationHSQLDBUI
[ERROR] /x1/jenkins/jenkins-slave/workspace/ManifoldCF-mvn/connectors/alfresco-webscript/connector/src/test/java/org/apache/manifoldcf/crawler/connectors/alfrescowebscript/tests/NavigationHSQLDBUI.java:[149,27]
error: cannot find symbol
[ERROR] class NavigationHSQLDBUI
[ERROR] /x1/jenkins/jenkins-slave/workspace/ManifoldCF-mvn/connectors/alfresco-webscript/connector/src/test/java/org/apache/manifoldcf/crawler/connectors/alfrescowebscript/tests/NavigationHSQLDBUI.java:[152,13]
error: cannot find symbol
[ERROR] class NavigationHSQLDBUI
[ERROR] /x1/jenkins/jenkins-slave/workspace/ManifoldCF-mvn/connectors/alfresco-webscript/connector/src/test/java/org/apache/manifoldcf/crawler/connectors/alfrescowebscript/tests/NavigationHSQLDBUI.java:[153,27]
error: cannot find symbol
[ERROR] class NavigationHSQLDBUI
[ERROR] /x1/jenkins/jenkins-slave/workspace/ManifoldCF-mvn/connectors/alfresco-webscript/connector/src/test/java/org/apache/manifoldcf/crawler/connectors/alfrescowebscript/tests/NavigationHSQLDBUI.java:[154,33]
error: cannot find symbol
[ERROR] class NavigationHSQLDBUI
[ERROR] /x1/jenkins/jenkins-slave/workspace/ManifoldCF-mvn/connectors/alfresco-webscript/connector/src/test/java/org/apache/manifoldcf/crawler/connectors/alfrescowebscript/tests/NavigationHSQLDBUI.java:[155,22]
error: cannot find symbol
[ERROR] class NavigationHSQLDBUI
[ERROR] /x1/jenkins/jenkins-slave/workspace/ManifoldCF-mvn/connectors/alfresco-webscript/connector/src/test/java/org/apache/manifoldcf/crawler/connectors/alfrescowebscript/tests/NavigationHSQLDBUI.java:[156,27]
error: cannot find symbol
[ERROR] class NavigationHSQLDBUI
[ERROR] /x1/jenkins/jenkins-slave/workspace/ManifoldCF-mvn/connectors/alfresco-webscript/connector/src/test/java/org/apache/manifoldcf/crawler/connectors/alfrescowebscript/tests/NavigationHSQLDBUI.java:[159,13]
error: cannot find symbol
[ERROR] class NavigationHSQLDBUI
[ERROR] /x1/jenkins/jenkins-slave/workspace/ManifoldCF-mvn/connectors/alfresco-webscript/connector/src/test/java/org/apache/manifoldcf/crawler/connectors/alfrescowebscript/tests/NavigationHSQLDBUI.java:[160,27]
error: cannot find symbol
[ERROR] class NavigationHSQLDBUI
[ERROR] /x1/jenkins/jenkins-slave/workspace/ManifoldCF-mvn/connectors/alfresco-webscript/connector/src/test/java/org/apache/manifoldcf/crawler/connectors/alfrescowebscript/tests/NavigationHSQLDBUI.java:[161,35]
error: cannot find symbol
[ERROR] class NavigationHSQLDBUI
[ERROR] /x1/jenkins/jenkins-slave/workspace/ManifoldCF-mvn/connectors/alfresco-webscript/connector/src/test/java/org/apache/manifoldcf/crawler/connectors/alfrescowebscript/tests/NavigationHSQLDBUI.java:[162,26]
error: cannot find symbol
[ERROR] class NavigationHSQLDBUI
[ERROR] /x1/jenkins/jenkins-slave/workspace/ManifoldCF-mvn/connectors/alfresco-webscript/connector/src/test/java/org/apache/manifoldcf/crawler/connectors/alfrescowebscript/tests/NavigationHSQLDBUI.java:[163,35]
error: cannot find symbol
[ERROR] class NavigationHSQLDBUI
[ERROR] /x1/jenkins/jenkins-slave/workspace/ManifoldCF-mvn/connectors/alfresco-webscript/connector/src/test/java/org/apache/manifoldcf/crawler/connectors/alfrescowebscript/tests/NavigationHSQLDBUI.java:[164,26]
error: cannot find symbol
[ERROR] class NavigationHSQLDBUI
[ERROR] /x1/jenkins/jenkins-slave/workspace/ManifoldCF-mvn/connectors/alfresco-webscript/connector/src/test/java/org/apache/manifoldcf/crawler/connectors/alfrescowebscript/tests/NavigationHSQLDBUI.java:[165,31]
error: cannot find symbol
[ERROR] class NavigationHSQLDBUI
[ERROR] /x1/jenkins/jenkins-slave/workspace/ManifoldCF-mvn/connectors/alfresco-webscript/connector/src/test/java/org/apache/manifoldcf/crawler/connectors/alfrescowebscript/tests/NavigationHSQLDBUI.java:[167,13]
error: cannot find symbol
[ERROR] class NavigationHSQLDBUI
[ERROR] /x1/jenkins/jenkins-slave/workspace/ManifoldCF-mvn/connectors/alfresco-webscript/connector/src/test/java/org/apache/manifoldcf/crawler/connectors/alfrescowebscript/tests/NavigationHSQLDBUI.java:[168,27]
error: cannot find symbol
[ERROR] class NavigationHSQLDBUI
[ERROR] /x1/jenkins/jenkins-slave/workspace/ManifoldCF-mvn/connectors/alfresco-webscript/connector/src/test/java/org/apache/manifoldcf/crawler/connectors/alfrescowebscript/tests/NavigationHSQLDBUI.java:[169,35]
error: cannot find symbol
[ERROR] class NavigationHSQLDBUI
[ERROR] /x1/jenkins/jenkins-slave/workspace/ManifoldCF-mvn/connectors/alfresco-webscript/connector/src/test/java/org/apache/manifoldcf/crawler/connectors/alfrescowebscript/tests/NavigationHSQLDBUI.java:[170,26]
error: cannot find symbol
[ERROR] class NavigationHSQLDBUI
[ERROR] /x1/jenkins/jenkins-slave/workspace/ManifoldCF-mvn/connectors/alfresco-webscript/connector/src/test/java/org/apache/manifoldcf/crawler/connectors/alfrescowebscript/tests/NavigationHSQLDBUI.java:[171,31]
error: cannot find symbol
[ERROR] class NavigationHSQLDBUI
[ERROR] /x1/jenkins/jenkins-slave/workspace/ManifoldCF-mvn/connectors/alfresco-webscript/connector/src/test/java/org/apache/manifoldcf/crawler/connectors/alfrescowebscript/tests/NavigationHSQLDBUI.java:[174,13]
error: cannot find symbol
[ERROR] class NavigationHSQLDBUI
[ERROR] /x1/jenkins/jenkins-slave/workspace/ManifoldCF-mvn/connectors/alfresco-webscript/connector/src/test/java/org/apache/manifoldcf/crawler/connectors/alfrescowebscript/tests/NavigationHSQLDBUI.java:[175,27]
error: cannot find symbol
[ERROR] class NavigationHSQLDBUI
[ERROR] /x1/jenkins/jenkins-slave/workspace/ManifoldCF-mvn/connectors/alfresco-webscript/connector/src/test/java/org/apache/manifoldcf/crawler/connectors/alfrescowebscript/tests/NavigationHSQLDBUI.java:[177,13]
error: cannot find symbol
[ERROR] class NavigationHSQLDBUI
[ERROR] /x1/jenkins/jenkins-slave/workspace/ManifoldCF-mvn/connectors/alfresco-webscript/connector/src/test/java/org/apache/manifoldcf/crawler/connectors/alfrescowebscript/tests/NavigationHSQLDBUI.java:[178,27]
error: cannot find symbol
[ERROR] class NavigationHSQLDBUI
[ERROR] /x1/jenkins/jenkins-slave/workspace/ManifoldCF-mvn/connectors/alfresco-webscript/connector/src/test/java/org/apache/manifoldcf/crawler/connectors/alfrescowebscript/tests/NavigationHSQLDBUI.java:[179,35]
error: cannot find symbol
[ERROR] class NavigationHSQLDBUI
[ERROR] /x1/jenkins/jenkins-slave/workspace/ManifoldCF-mvn/connectors/alfresco-webscript/connector/src/test/java/org/apache/manifoldcf/crawler/connectors/alfrescowebscript/tests/NavigationHSQLDBUI.java:[180,26]
error: cannot find symbol
[ERROR] class NavigationHSQLDBUI
[ERROR] /x1/jenkins/jenkins-slave/workspace/ManifoldCF-mvn/connectors/alfresco-webscript/connector/src/test/java/org/apache/manifoldcf/crawler/connectors/alfrescowebscript/tests/NavigationHSQLDBUI.java:[181,35]
error: cannot find symbol
[ERROR] class NavigationHSQLDBUI
[ERROR] /x1/jenkins/jenkins-slave/workspace/ManifoldCF-mvn/connectors/alfresco-webscript/connector/src/test/java/org/apache/manifoldcf/crawler/connectors/alfrescowebscript/tests/NavigationHSQLDBUI.java:[182,26]
error: cannot find symbol
[ERROR] -> [Help 1]
[ERROR] 
[ERROR] To see the full stack trace of the errors, re-run Maven with the -e switch.
[ERROR] Re-run Maven using the -X switch to enable full debug logging.
[ERROR] 
[ERROR] For more information about the errors and possible solutions, please read the following
articles:
[ERROR] [Help 1] http://cwiki.apache.org/confluence/display/MAVEN/MojoFailureException
[ERROR] 
[ERROR] After correcting the problems, you can resume the build with the command
[ERROR]   mvn <goals> -rf :mcf-alfresco-webscript-connector
Build step 'Invoke top-level Maven targets' marked build as failure
[locks-and-latches] Releasing all the locks
[locks-and-latches] All the locks released

Mime
View raw message