manifoldcf-dev mailing list archives

Site index · List index
Message view « Date » · « Thread »
Top « Date » · « Thread »
From Apache Jenkins Server <jenk...@builds.apache.org>
Subject Build failed in Jenkins: ManifoldCF-mvn #227
Date Mon, 21 Jul 2014 01:36:13 GMT
See <https://builds.apache.org/job/ManifoldCF-mvn/227/changes>

Changes:

[kwright] Try to fix maven failure

[kwright] Fix for CONNECTORS-989.  Introduce component document concept.

------------------------------------------
[...truncated 2646 lines...]
Fetching 7/118
Fetching 4/115
Fetching 2/108
Fetching 9/101
Fetching 5/105
Fetching 0/108
Fetching 6/100
Fetching 8/107
Fetching 9/119
Fetching 3/103
Fetching 3/118
Fetching 8/112
Fetching 3/104
Fetching 2/112
Fetching 6/101
Fetching 5/116
Fetching 5/101
Fetching 0/115
Fetching 7/117
Fetching 1/101
Fetching 6/105
Fetching 4/117
Fetching 4/104
Fetching 4/105
Fetching 8/125
Fetching 4/136
Fetching 3/137
Fetching 9/122
Fetching 2/129
Fetching 2/121
Fetching 7/127
Fetching 1/128
Fetching 5/139
Fetching 5/138
Fetching 6/139
Fetching 6/134
Fetching 0/138
Fetching 0/126
Fetching 8/137
Fetching 0/127
Fetching 4/132
Fetching 3/120
Fetching 1/138
Fetching 9/129
Fetching 7/121
Fetching 4/123
Fetching 3/131
Fetching 8/122
Fetching 5/136
Fetching 6/123
Fetching 1/131
Fetching 2/137
Fetching 9/138
Fetching 1/123
Fetching 9/132
Fetching 2/136
Fetching 3/123
Fetching 5/131
Fetching 5/130
Fetching 0/128
Fetching 7/128
Fetching 2/125
Fetching 9/127
Fetching 9/120
Fetching 3/126
Fetching 8/128
Fetching 3/139
Fetching 4/139
Fetching 5/125
Fetching 4/122
Fetching 6/120
Fetching 4/121
Fetching 1/137
Fetching 1/129
Fetching 2/128
Fetching 8/123
Fetching 0/131
Fetching 7/120
Fetching 6/137
Fetching 8/131
Fetching 7/137
Fetching 0/137
Fetching 7/131
Fetching 6/131
Fetching 0/133
Fetching 2/124
Fetching 4/137
Fetching 8/126
Fetching 5/126
Fetching 6/127
Fetching 3/136
Fetching 9/123
Fetching 9/136
Fetching 1/132
Fetching 2/127
Fetching 7/123
Fetching 0/124
Fetching 4/120
Fetching 4/131
Fetching 2/135
Fetching 5/135
Fetching 6/132
Fetching 1/135
Fetching 8/136
Fetching 3/125
Fetching 0/130
Fetching 7/138
Fetching 2/120
Fetching 5/128
Fetching 1/130
Fetching 6/130
Fetching 9/126
Fetching 8/134
Fetching 3/124
Fetching 7/129
Fetching 0/125
Fetching 8/133
Fetching 8/127
Fetching 4/127
Fetching 2/139
Fetching 1/127
Fetching 1/136
Fetching 1/139
Fetching 1/125
Fetching 4/134
Fetching 7/125
Fetching 8/135
Fetching 7/134
Fetching 2/133
Fetching 6/121
Fetching 5/133
Fetching 9/135
Fetching 3/133
Fetching 7/126
Fetching 4/125
Fetching 9/134
Fetching 9/121
Fetching 3/135
Fetching 6/129
Fetching 3/128
Fetching 0/132
Fetching 5/123
Fetching 0/134
Fetching 6/128
Fetching 5/121
Fetching 5/134
Fetching 2/159
Fetching 6/140
Fetching 1/152
Fetching 4/126
Fetching 5/137
Fetching 8/129
Fetching 3/127
Fetching 0/122
Fetching 7/133
Fetching 7/132
Fetching 8/138
Fetching 2/132
Fetching 1/134
Fetching 0/120
Fetching 7/135
Fetching 3/121
Fetching 5/120
Fetching 3/129
Fetching 6/122
Fetching 7/122
Fetching 9/137
Fetching 4/128
Fetching 7/139
Fetching 9/131
Fetching 4/124
Fetching 6/126
Fetching 4/130
Fetching 9/128
Fetching 9/139
Fetching 7/124
Fetching 1/120
Fetching 2/138
Fetching 5/124
Fetching 8/124
Fetching 6/138
Fetching 0/136
Fetching 2/134
org.apache.manifoldcf.core.interfaces.ManifoldCFException: Can't delete repository connection
'SchedulerTest Connection': existing jobs refer to it
	at org.apache.manifoldcf.crawler.repository.RepositoryConnectionManager.delete(RepositoryConnectionManager.java:528)
	at org.apache.manifoldcf.crawler.tests.ConnectorBaseHSQLDB.localCleanUp(ConnectorBaseHSQLDB.java:235)
	at org.apache.manifoldcf.crawler.tests.SchedulerHSQLDBTest.cleanUp(SchedulerHSQLDBTest.java:127)
	at sun.reflect.NativeMethodAccessorImpl.invoke0(Native Method)
	at sun.reflect.NativeMethodAccessorImpl.invoke(NativeMethodAccessorImpl.java:57)
	at sun.reflect.DelegatingMethodAccessorImpl.invoke(DelegatingMethodAccessorImpl.java:43)
	at java.lang.reflect.Method.invoke(Method.java:606)
	at org.junit.runners.model.FrameworkMethod$1.runReflectiveCall(FrameworkMethod.java:44)
	at org.junit.internal.runners.model.ReflectiveCallable.run(ReflectiveCallable.java:15)
	at org.junit.runners.model.FrameworkMethod.invokeExplosively(FrameworkMethod.java:41)
	at org.junit.internal.runners.statements.RunAfters.evaluate(RunAfters.java:37)
	at org.junit.runners.BlockJUnit4ClassRunner.runNotIgnored(BlockJUnit4ClassRunner.java:79)
	at org.junit.runners.BlockJUnit4ClassRunner.runChild(BlockJUnit4ClassRunner.java:71)
	at org.junit.runners.BlockJUnit4ClassRunner.runChild(BlockJUnit4ClassRunner.java:49)
	at org.junit.runners.ParentRunner$3.run(ParentRunner.java:193)
	at org.junit.runners.ParentRunner$1.schedule(ParentRunner.java:52)
	at org.junit.runners.ParentRunner.runChildren(ParentRunner.java:191)
	at org.junit.runners.ParentRunner.access$000(ParentRunner.java:42)
	at org.junit.runners.ParentRunner$2.evaluate(ParentRunner.java:184)
	at org.junit.runners.ParentRunner.run(ParentRunner.java:236)
	at org.apache.maven.surefire.junit4.JUnit4TestSet.execute(JUnit4TestSet.java:35)
	at org.apache.maven.surefire.junit4.JUnit4Provider.executeTestSet(JUnit4Provider.java:115)
	at org.apache.maven.surefire.junit4.JUnit4Provider.invoke(JUnit4Provider.java:97)
	at sun.reflect.NativeMethodAccessorImpl.invoke0(Native Method)
	at sun.reflect.NativeMethodAccessorImpl.invoke(NativeMethodAccessorImpl.java:57)
	at sun.reflect.DelegatingMethodAccessorImpl.invoke(DelegatingMethodAccessorImpl.java:43)
	at java.lang.reflect.Method.invoke(Method.java:606)
	at org.apache.maven.surefire.booter.ProviderFactory$ClassLoaderProxy.invoke(ProviderFactory.java:103)
	at com.sun.proxy.$Proxy0.invoke(Unknown Source)
	at org.apache.maven.surefire.booter.SurefireStarter.invokeProvider(SurefireStarter.java:150)
	at org.apache.maven.surefire.booter.SurefireStarter.runSuitesInProcess(SurefireStarter.java:74)
	at org.apache.maven.surefire.booter.ForkedBooter.main(ForkedBooter.java:69)
Tests run: 2, Failures: 0, Errors: 2, Skipped: 0, Time elapsed: 183.018 sec <<< FAILURE!
Running org.apache.manifoldcf.crawler.tests.SanityHSQLDBTest
Configuration file successfully read
Tests run: 1, Failures: 0, Errors: 0, Skipped: 0, Time elapsed: 8.37 sec
Running org.apache.manifoldcf.crawler.tests.InterruptionHSQLDBTest
Configuration file successfully read
Tests run: 1, Failures: 0, Errors: 0, Skipped: 0, Time elapsed: 53.057 sec
Running org.apache.manifoldcf.crawler.tests.SanityDerbyTest
Configuration file successfully read
Tests run: 1, Failures: 0, Errors: 0, Skipped: 0, Time elapsed: 36.252 sec

Results :

Tests in error: 

Tests run: 5, Failures: 0, Errors: 2, Skipped: 0

[INFO] ------------------------------------------------------------------------
[ERROR] BUILD FAILURE
[INFO] ------------------------------------------------------------------------
[INFO] There are test failures.

Please refer to /x1/jenkins/jenkins-slave/workspace/ManifoldCF-mvn/framework/pull-agent/target/surefire-reports
for the individual test results.
[INFO] ------------------------------------------------------------------------
[INFO] For more information, run Maven with the -e switch
[INFO] ------------------------------------------------------------------------
[INFO] Total time: 8 minutes 45 seconds
[INFO] Finished at: Mon Jul 21 01:36:11 UTC 2014
[INFO] Final Memory: 45M/386M
[INFO] ------------------------------------------------------------------------
Build step 'Invoke top-level Maven targets' marked build as failure
[locks-and-latches] Releasing all the locks
[locks-and-latches] All the locks released

Mime
View raw message