manifoldcf-dev mailing list archives

Site index · List index
Message view « Date » · « Thread »
Top « Date » · « Thread »
From Apache Jenkins Server <jenk...@builds.apache.org>
Subject Build failed in Jenkins: ManifoldCF-mvn #225
Date Sat, 19 Jul 2014 05:56:59 GMT
See <https://builds.apache.org/job/ManifoldCF-mvn/225/>

------------------------------------------
[...truncated 2347 lines...]
Fetching 3/69
Fetching 5/88
Fetching 7/75
Fetching 1/76
Fetching 4/92
Fetching 1/61
Fetching 6/88
Fetching 4/95
Fetching 4/94
Fetching 0/78
Fetching 8/67
Fetching 9/65
Fetching 7/62
Fetching 3/66
Fetching 5/98
Fetching 5/94
Fetching 8/72
Fetching 2/79
Fetching 0/77
Fetching 0/74
Fetching 6/94
Fetching 6/97
Fetching 2/75
Fetching 4/88
Fetching 0/65
Fetching 5/86
Fetching 4/87
Fetching 4/110
Fetching 3/96
Fetching 5/108
Fetching 2/93
Fetching 8/84
Fetching 7/86
Fetching 9/82
Fetching 0/96
Fetching 1/90
Fetching 6/112
Fetching 2/84
Fetching 4/111
Fetching 3/83
Fetching 7/87
Fetching 5/107
Fetching 9/84
Fetching 0/83
Fetching 1/82
Fetching 8/99
Fetching 6/119
Fetching 2/88
Fetching 3/80
Fetching 7/88
Fetching 4/116
Fetching 8/91
Fetching 1/84
Fetching 5/106
Fetching 0/99
Fetching 9/94
Fetching 8/97
Fetching 2/83
Fetching 6/116
Fetching 2/91
Fetching 0/98
Fetching 1/75
Fetching 1/66
Fetching 6/104
Fetching 4/106
Fetching 4/81
Fetching 1/83
Fetching 4/101
Fetching 7/82
Fetching 7/78
Fetching 5/117
Fetching 5/103
Fetching 7/60
Fetching 3/94
Fetching 3/82
Fetching 9/80
Fetching 0/92
Fetching 9/78
Fetching 8/68
Fetching 9/61
Fetching 8/64
Fetching 5/89
Fetching 0/71
Fetching 6/96
Fetching 6/81
Fetching 2/61
Fetching 3/75
Fetching 3/73
Fetching 2/86
Fetching 7/96
Fetching 8/94
Fetching 5/119
Fetching 4/119
Fetching 1/91
Fetching 3/92
Fetching 9/90
Fetching 0/86
Fetching 6/113
Fetching 7/85
Fetching 2/99
Fetching 8/85
Fetching 1/87
Fetching 5/110
Fetching 4/100
Fetching 9/85
Fetching 0/82
Fetching 3/89
Fetching 6/106
Fetching 6/114
Fetching 2/97
Fetching 7/84
Fetching 8/83
Fetching 5/113
Fetching 1/88
Fetching 4/109
Fetching 0/81
Fetching 3/86
Fetching 9/98
Fetching 6/115
Fetching 5/104
Fetching 8/81
Fetching 2/95
Fetching 6/117
Fetching 9/92
Fetching 3/81
Fetching 6/111
Fetching 7/92
Fetching 2/90
Fetching 3/98
Fetching 7/83
Fetching 9/99
Fetching 1/92
Fetching 8/98
Fetching 3/99
Fetching 1/94
Fetching 0/91
Fetching 7/81
Fetching 5/115
Fetching 8/82
Fetching 0/84
Fetching 2/87
Fetching 4/102
Fetching 4/114
Fetching 0/88
Fetching 4/108
Fetching 1/97
Fetching 9/91
Fetching 8/89
Fetching 1/96
Fetching 7/80
Fetching 7/98
Fetching 2/80
Fetching 1/95
Fetching 5/114
Fetching 0/80
Fetching 0/90
Fetching 3/88
Fetching 8/88
Fetching 4/112
Fetching 4/113
Fetching 9/95
Fetching 6/107
Fetching 2/98
Fetching 5/109
Fetching 3/97
Fetching 8/96
Fetching 6/109
Fetching 9/96
Fetching 1/93
Fetching 7/91
Fetching 2/94
Fetching 5/111
Fetching 3/90
Fetching 0/95
Fetching 8/80
Fetching 6/103
Fetching 1/99
Fetching 9/86
Fetching 4/103
Fetching 4/118
Fetching 0/94
Fetching 0/97
Fetching 2/92
org.apache.manifoldcf.core.interfaces.ManifoldCFException: Can't delete repository connection
'SchedulerTest Connection': existing jobs refer to it
	at org.apache.manifoldcf.crawler.repository.RepositoryConnectionManager.delete(RepositoryConnectionManager.java:528)
	at org.apache.manifoldcf.crawler.tests.ConnectorBaseHSQLDB.localCleanUp(ConnectorBaseHSQLDB.java:235)
	at org.apache.manifoldcf.crawler.tests.SchedulerHSQLDBTest.cleanUp(SchedulerHSQLDBTest.java:127)
	at sun.reflect.NativeMethodAccessorImpl.invoke0(Native Method)
	at sun.reflect.NativeMethodAccessorImpl.invoke(NativeMethodAccessorImpl.java:57)
	at sun.reflect.DelegatingMethodAccessorImpl.invoke(DelegatingMethodAccessorImpl.java:43)
	at java.lang.reflect.Method.invoke(Method.java:606)
	at org.junit.runners.model.FrameworkMethod$1.runReflectiveCall(FrameworkMethod.java:44)
	at org.junit.internal.runners.model.ReflectiveCallable.run(ReflectiveCallable.java:15)
	at org.junit.runners.model.FrameworkMethod.invokeExplosively(FrameworkMethod.java:41)
	at org.junit.internal.runners.statements.RunAfters.evaluate(RunAfters.java:37)
	at org.junit.runners.BlockJUnit4ClassRunner.runNotIgnored(BlockJUnit4ClassRunner.java:79)
	at org.junit.runners.BlockJUnit4ClassRunner.runChild(BlockJUnit4ClassRunner.java:71)
	at org.junit.runners.BlockJUnit4ClassRunner.runChild(BlockJUnit4ClassRunner.java:49)
	at org.junit.runners.ParentRunner$3.run(ParentRunner.java:193)
	at org.junit.runners.ParentRunner$1.schedule(ParentRunner.java:52)
	at org.junit.runners.ParentRunner.runChildren(ParentRunner.java:191)
	at org.junit.runners.ParentRunner.access$000(ParentRunner.java:42)
	at org.junit.runners.ParentRunner$2.evaluate(ParentRunner.java:184)
	at org.junit.runners.ParentRunner.run(ParentRunner.java:236)
	at org.apache.maven.surefire.junit4.JUnit4TestSet.execute(JUnit4TestSet.java:35)
	at org.apache.maven.surefire.junit4.JUnit4Provider.executeTestSet(JUnit4Provider.java:115)
	at org.apache.maven.surefire.junit4.JUnit4Provider.invoke(JUnit4Provider.java:97)
	at sun.reflect.NativeMethodAccessorImpl.invoke0(Native Method)
	at sun.reflect.NativeMethodAccessorImpl.invoke(NativeMethodAccessorImpl.java:57)
	at sun.reflect.DelegatingMethodAccessorImpl.invoke(DelegatingMethodAccessorImpl.java:43)
	at java.lang.reflect.Method.invoke(Method.java:606)
	at org.apache.maven.surefire.booter.ProviderFactory$ClassLoaderProxy.invoke(ProviderFactory.java:103)
	at com.sun.proxy.$Proxy0.invoke(Unknown Source)
	at org.apache.maven.surefire.booter.SurefireStarter.invokeProvider(SurefireStarter.java:150)
	at org.apache.maven.surefire.booter.SurefireStarter.runSuitesInProcess(SurefireStarter.java:74)
	at org.apache.maven.surefire.booter.ForkedBooter.main(ForkedBooter.java:69)
Tests run: 2, Failures: 0, Errors: 2, Skipped: 0, Time elapsed: 177.978 sec <<< FAILURE!
Running org.apache.manifoldcf.crawler.tests.SanityHSQLDBTest
Configuration file successfully read
Tests run: 1, Failures: 0, Errors: 0, Skipped: 0, Time elapsed: 8.005 sec
Running org.apache.manifoldcf.crawler.tests.InterruptionHSQLDBTest
Configuration file successfully read
Tests run: 1, Failures: 0, Errors: 0, Skipped: 0, Time elapsed: 53.174 sec
Running org.apache.manifoldcf.crawler.tests.SanityDerbyTest
Configuration file successfully read
Tests run: 1, Failures: 0, Errors: 0, Skipped: 0, Time elapsed: 40.049 sec

Results :

Tests in error: 

Tests run: 5, Failures: 0, Errors: 2, Skipped: 0

[INFO] ------------------------------------------------------------------------
[ERROR] BUILD FAILURE
[INFO] ------------------------------------------------------------------------
[INFO] There are test failures.

Please refer to /x1/jenkins/jenkins-slave/workspace/ManifoldCF-mvn/framework/pull-agent/target/surefire-reports
for the individual test results.
[INFO] ------------------------------------------------------------------------
[INFO] For more information, run Maven with the -e switch
[INFO] ------------------------------------------------------------------------
[INFO] Total time: 8 minutes 40 seconds
[INFO] Finished at: Sat Jul 19 05:56:58 UTC 2014
[INFO] Final Memory: 45M/387M
[INFO] ------------------------------------------------------------------------
Build step 'Invoke top-level Maven targets' marked build as failure
[locks-and-latches] Releasing all the locks
[locks-and-latches] All the locks released

Mime
View raw message