mahout-user mailing list archives

Site index · List index
Message view « Date » · « Thread »
Top « Date » · « Thread »
From Sean Owen <sro...@gmail.com>
Subject Re: Installation Help
Date Thu, 01 Apr 2010 17:30:07 GMT
Yeah that's still not quite showing the nature of the error.

Ted's saying that, for example, the output says that
TestFuzzyKmeansClustering failed. In target/surefire-reports, you'll
see a file with the output from this test. Could you for example find
the error in there and post it?

I'm guessing it is all due to some common cause related to the environment.

Sean

On Thu, Apr 1, 2010 at 6:27 PM, Eleftherios Spyromitros
<espyromi@csd.auth.gr> wrote:
> And I get the following from Eclipse mvn console:
>
> Tests run: 395, Failures: 20, Errors: 32, Skipped: 0
>
> [INFO] ------------------------------------------------------------------------
> [INFO] Reactor Summary:
> [INFO]
> [INFO] Apache Lucene Mahout .............................. SUCCESS [11.833s]
> [INFO] Mahout Common Maven Parent ........................ SUCCESS [0.039s]
> [INFO] Maven Mojo to generate code for collections ....... SUCCESS [16.677s]
> [INFO] Mahout Collections ................................ SUCCESS [20.901s]
> [INFO] Mahout Math ....................................... SUCCESS [20.585s]
> [INFO] Mahout Core ....................................... FAILURE [56.658s]
> [INFO] Mahout Taste Webapp ............................... SKIPPED
> [INFO] Mahout Utilities .................................. SKIPPED
> [INFO] Mahout Examples ................................... SKIPPED
> [INFO] ------------------------------------------------------------------------
> [INFO] BUILD FAILURE
> [INFO] ------------------------------------------------------------------------
> [INFO] Total time: 2:06.868s
> [INFO] Finished at: Thu Apr 01 20:26:13 EEST 2010
> [INFO] Final Memory: 28M/107M
> [INFO] ------------------------------------------------------------------------
> [ERROR] Failed to execute goal org.apache.maven.plugins:maven-surefire-plugin:2.5:test
(default-test) on project mahout-core: There are test failures.
>
> Please refer to D:\Users\lefteris\workspace2\mahout-0.3\core\target\surefire-reports
for the individual test results.
> -> [Help 1]
> [ERROR]
> [ERROR] To see the full stack trace of the errors, re-run Maven with the -e switch.
> [ERROR] Re-run Maven using the -X switch to enable full debug logging.
> [ERROR]
> [ERROR] For more information about the errors and possible solutions, please read the
following articles:
> [ERROR] [Help 1] http://cwiki.apache.org/confluence/display/MAVEN/MojoFailureException
> [ERROR]
> [ERROR] After correcting the problems, you can resume the build with the command
> [ERROR]   mvn <goals> -rf :mahout-core
>

Mime
View raw message