mahout-dev mailing list archives

Site index · List index
Message view « Date » · « Thread »
Top « Date » · « Thread »
From Apache Jenkins Server <jenk...@builds.apache.org>
Subject Build failed in Jenkins: mahout-nightly #2238
Date Wed, 29 Nov 2017 22:16:23 GMT
See <https://builds.apache.org/job/mahout-nightly/2238/display/redirect?page=changes>

Changes:

[trevor.d.grant] [WEBSITE] Update how-to-update-website instructions

[trevor.d.grant] [WEBSITE] Jekyll build path command updates

[trevor.d.grant] [WEBSITE] Deleted frontsite

------------------------------------------
[...truncated 262.13 KB...]
Running org.apache.mahout.cf.taste.impl.model.BooleanUserPreferenceArrayTest
Tests run: 6, Failures: 0, Errors: 0, Skipped: 0, Time elapsed: 0.166 sec - in org.apache.mahout.cf.taste.impl.model.BooleanUserPreferenceArrayTest
Running org.apache.mahout.cf.taste.impl.model.PlusAnonymousConcurrentUserDataModelTest
Tests run: 15, Failures: 0, Errors: 0, Skipped: 0, Time elapsed: 0.37 sec - in org.apache.mahout.cf.taste.impl.model.PlusAnonymousConcurrentUserDataModelTest
Tests run: 11, Failures: 0, Errors: 0, Skipped: 0, Time elapsed: 3.406 sec - in org.apache.mahout.cf.taste.impl.model.file.FileDataModelTest
Running org.apache.mahout.cf.taste.hadoop.item.ToUserVectorsReducerTest
Tests run: 2, Failures: 0, Errors: 0, Skipped: 0, Time elapsed: 0.375 sec - in org.apache.mahout.cf.taste.hadoop.item.ToUserVectorsReducerTest
Running org.apache.mahout.cf.taste.hadoop.item.RecommenderJobTest
Running org.apache.mahout.cf.taste.hadoop.item.IDReaderTest
Tests run: 1, Failures: 0, Errors: 0, Skipped: 0, Time elapsed: 0.36 sec - in org.apache.mahout.cf.taste.hadoop.item.IDReaderTest
Running org.apache.mahout.cf.taste.hadoop.similarity.item.ItemSimilarityJobTest
Tests run: 4, Failures: 0, Errors: 0, Skipped: 0, Time elapsed: 21.083 sec - in org.apache.mahout.cf.taste.hadoop.similarity.item.ItemSimilarityJobTest
Running org.apache.mahout.cf.taste.hadoop.TopItemsQueueTest
Tests run: 2, Failures: 0, Errors: 0, Skipped: 0, Time elapsed: 0.151 sec - in org.apache.mahout.cf.taste.hadoop.TopItemsQueueTest
Running org.apache.mahout.cf.taste.hadoop.als.ParallelALSFactorizationJobTest
Tests run: 21, Failures: 0, Errors: 0, Skipped: 0, Time elapsed: 35.885 sec - in org.apache.mahout.cf.taste.hadoop.item.RecommenderJobTest
Running org.apache.mahout.cf.taste.hadoop.TasteHadoopUtilsTest
Tests run: 1, Failures: 0, Errors: 0, Skipped: 0, Time elapsed: 0.087 sec - in org.apache.mahout.cf.taste.hadoop.TasteHadoopUtilsTest
Running org.apache.mahout.ep.EvolutionaryProcessTest
Tests run: 1, Failures: 0, Errors: 0, Skipped: 0, Time elapsed: 0.452 sec - in org.apache.mahout.ep.EvolutionaryProcessTest
Running org.apache.mahout.driver.MahoutDriverTest
Tests run: 1, Failures: 0, Errors: 0, Skipped: 0, Time elapsed: 0.565 sec - in org.apache.mahout.driver.MahoutDriverTest
Running org.apache.mahout.common.AbstractJobTest
Tests run: 3, Failures: 0, Errors: 0, Skipped: 0, Time elapsed: 1.105 sec - in org.apache.mahout.common.AbstractJobTest
Running org.apache.mahout.common.DistributedCacheFileLocationTest
Tests run: 2, Failures: 0, Errors: 0, Skipped: 0, Time elapsed: 0.16 sec - in org.apache.mahout.common.DistributedCacheFileLocationTest
Running org.apache.mahout.common.IntPairWritableTest
Tests run: 3, Failures: 0, Errors: 0, Skipped: 0, Time elapsed: 0.143 sec - in org.apache.mahout.common.IntPairWritableTest
Running org.apache.mahout.common.DummyRecordWriterTest
Tests run: 1, Failures: 0, Errors: 0, Skipped: 0, Time elapsed: 0.074 sec - in org.apache.mahout.common.DummyRecordWriterTest
Running org.apache.mahout.common.StringUtilsTest
Tests run: 2, Failures: 0, Errors: 0, Skipped: 0, Time elapsed: 0.406 sec - in org.apache.mahout.common.StringUtilsTest
Running org.apache.mahout.common.iterator.TestFixedSizeSampler
Tests run: 5, Failures: 0, Errors: 0, Skipped: 0, Time elapsed: 0.2 sec - in org.apache.mahout.common.iterator.TestFixedSizeSampler
Running org.apache.mahout.common.iterator.TestStableFixedSizeSampler
Tests run: 5, Failures: 0, Errors: 0, Skipped: 0, Time elapsed: 0.191 sec - in org.apache.mahout.common.iterator.TestStableFixedSizeSampler
Running org.apache.mahout.common.iterator.TestSamplingIterator
Tests run: 6, Failures: 0, Errors: 0, Skipped: 0, Time elapsed: 1.301 sec - in org.apache.mahout.common.iterator.TestSamplingIterator
Running org.apache.mahout.common.iterator.CountingIteratorTest
Tests run: 2, Failures: 0, Errors: 0, Skipped: 0, Time elapsed: 0.104 sec - in org.apache.mahout.common.iterator.CountingIteratorTest
Running org.apache.mahout.common.distance.TestMahalanobisDistanceMeasure
Tests run: 1, Failures: 0, Errors: 0, Skipped: 0, Time elapsed: 0.169 sec - in org.apache.mahout.common.distance.TestMahalanobisDistanceMeasure
Running org.apache.mahout.common.distance.TestMinkowskiMeasure
Tests run: 1, Failures: 0, Errors: 0, Skipped: 0, Time elapsed: 0.186 sec - in org.apache.mahout.common.distance.TestMinkowskiMeasure
Running org.apache.mahout.common.distance.TestEuclideanDistanceMeasure
Tests run: 1, Failures: 0, Errors: 0, Skipped: 0, Time elapsed: 0.19 sec - in org.apache.mahout.common.distance.TestEuclideanDistanceMeasure
Running org.apache.mahout.common.distance.TestManhattanDistanceMeasure
Tests run: 1, Failures: 0, Errors: 0, Skipped: 0, Time elapsed: 0.198 sec - in org.apache.mahout.common.distance.TestManhattanDistanceMeasure
Running org.apache.mahout.common.distance.TestChebyshevMeasure
Tests run: 1, Failures: 0, Errors: 0, Skipped: 0, Time elapsed: 0.157 sec - in org.apache.mahout.common.distance.TestChebyshevMeasure
Running org.apache.mahout.common.distance.CosineDistanceMeasureTest
Tests run: 1, Failures: 0, Errors: 0, Skipped: 0, Time elapsed: 0.172 sec - in org.apache.mahout.common.distance.CosineDistanceMeasureTest
Running org.apache.mahout.common.distance.TestWeightedEuclideanDistanceMeasureTest
Tests run: 2, Failures: 0, Errors: 0, Skipped: 0, Time elapsed: 0.22 sec - in org.apache.mahout.common.distance.TestWeightedEuclideanDistanceMeasureTest
Running org.apache.mahout.common.distance.TestWeightedManhattanDistanceMeasure
Tests run: 2, Failures: 0, Errors: 0, Skipped: 0, Time elapsed: 0.185 sec - in org.apache.mahout.common.distance.TestWeightedManhattanDistanceMeasure
Running org.apache.mahout.common.distance.TestTanimotoDistanceMeasure
Tests run: 2, Failures: 0, Errors: 0, Skipped: 0, Time elapsed: 0.231 sec - in org.apache.mahout.common.distance.TestTanimotoDistanceMeasure
Running org.apache.mahout.common.MahoutTestCase
Tests run: 0, Failures: 0, Errors: 0, Skipped: 0, Time elapsed: 0.045 sec - in org.apache.mahout.common.MahoutTestCase
Running org.apache.mahout.common.lucene.AnalyzerUtilsTest
Tests run: 2, Failures: 0, Errors: 0, Skipped: 0, Time elapsed: 0.082 sec - in org.apache.mahout.common.lucene.AnalyzerUtilsTest
Running org.apache.mahout.clustering.TestClusterInterface
Tests run: 4, Failures: 0, Errors: 0, Skipped: 0, Time elapsed: 0.513 sec - in org.apache.mahout.clustering.TestClusterInterface
Running org.apache.mahout.clustering.TestGaussianAccumulators
Tests run: 6, Failures: 0, Errors: 0, Skipped: 0, Time elapsed: 3.052 sec - in org.apache.mahout.clustering.TestGaussianAccumulators
Running org.apache.mahout.clustering.lda.cvb.TestCVBModelTrainer
Tests run: 6, Failures: 0, Errors: 0, Skipped: 0, Time elapsed: 98.22 sec - in org.apache.mahout.cf.taste.hadoop.als.ParallelALSFactorizationJobTest
Running org.apache.mahout.clustering.kmeans.TestRandomSeedGenerator
Tests run: 3, Failures: 0, Errors: 0, Skipped: 0, Time elapsed: 2.314 sec - in org.apache.mahout.clustering.kmeans.TestRandomSeedGenerator
Running org.apache.mahout.clustering.kmeans.TestKmeansClustering
Tests run: 4, Failures: 0, Errors: 0, Skipped: 0, Time elapsed: 23.107 sec - in org.apache.mahout.clustering.kmeans.TestKmeansClustering
Running org.apache.mahout.clustering.streaming.cluster.BallKMeansTest
Tests run: 2, Failures: 0, Errors: 0, Skipped: 0, Time elapsed: 89.278 sec - in org.apache.mahout.clustering.lda.cvb.TestCVBModelTrainer
Running org.apache.mahout.clustering.streaming.cluster.StreamingKMeansTest
Tests run: 3, Failures: 0, Errors: 0, Skipped: 0, Time elapsed: 25.532 sec - in org.apache.mahout.clustering.streaming.cluster.BallKMeansTest
Running org.apache.mahout.clustering.streaming.tools.ResplitSequenceFilesTest
Tests run: 1, Failures: 0, Errors: 0, Skipped: 0, Time elapsed: 1.602 sec - in org.apache.mahout.clustering.streaming.tools.ResplitSequenceFilesTest
Running org.apache.mahout.clustering.classify.ClusterClassificationDriverTest
Tests run: 3, Failures: 0, Errors: 0, Skipped: 0, Time elapsed: 5.59 sec - in org.apache.mahout.clustering.classify.ClusterClassificationDriverTest
Running org.apache.mahout.clustering.iterator.TestClusterClassifier
Tests run: 11, Failures: 0, Errors: 0, Skipped: 0, Time elapsed: 8.592 sec - in org.apache.mahout.clustering.iterator.TestClusterClassifier
Running org.apache.mahout.clustering.fuzzykmeans.TestFuzzyKmeansClustering
Tests run: 2, Failures: 0, Errors: 0, Skipped: 0, Time elapsed: 36.676 sec - in org.apache.mahout.clustering.fuzzykmeans.TestFuzzyKmeansClustering
Running org.apache.mahout.clustering.canopy.TestCanopyCreation
Tests run: 17, Failures: 0, Errors: 0, Skipped: 0, Time elapsed: 13.353 sec - in org.apache.mahout.clustering.canopy.TestCanopyCreation
Running org.apache.mahout.clustering.topdown.PathDirectoryTest
Tests run: 5, Failures: 0, Errors: 0, Skipped: 0, Time elapsed: 0.182 sec - in org.apache.mahout.clustering.topdown.PathDirectoryTest
Running org.apache.mahout.clustering.topdown.postprocessor.ClusterOutputPostProcessorTest
Tests run: 1, Failures: 0, Errors: 0, Skipped: 0, Time elapsed: 2.311 sec - in org.apache.mahout.clustering.topdown.postprocessor.ClusterOutputPostProcessorTest
Running org.apache.mahout.clustering.topdown.postprocessor.ClusterCountReaderTest
Tests run: 1, Failures: 0, Errors: 0, Skipped: 0, Time elapsed: 2.171 sec - in org.apache.mahout.clustering.topdown.postprocessor.ClusterCountReaderTest
Running org.apache.mahout.clustering.spectral.TestMatrixDiagonalizeJob
Tests run: 2, Failures: 0, Errors: 0, Skipped: 0, Time elapsed: 1.164 sec - in org.apache.mahout.clustering.spectral.TestMatrixDiagonalizeJob
Running org.apache.mahout.clustering.spectral.kmeans.TestEigenSeedGenerator
Tests run: 1, Failures: 0, Errors: 0, Skipped: 0, Time elapsed: 1.768 sec - in org.apache.mahout.clustering.spectral.kmeans.TestEigenSeedGenerator
Running org.apache.mahout.clustering.spectral.TestVectorMatrixMultiplicationJob
Tests run: 1, Failures: 0, Errors: 0, Skipped: 0, Time elapsed: 1.009 sec - in org.apache.mahout.clustering.spectral.TestVectorMatrixMultiplicationJob
Running org.apache.mahout.clustering.spectral.TestUnitVectorizerJob
Tests run: 1, Failures: 0, Errors: 0, Skipped: 0, Time elapsed: 1.035 sec - in org.apache.mahout.clustering.spectral.TestUnitVectorizerJob
Running org.apache.mahout.clustering.spectral.TestAffinityMatrixInputJob
Tests run: 2, Failures: 0, Errors: 0, Skipped: 0, Time elapsed: 1.287 sec - in org.apache.mahout.clustering.spectral.TestAffinityMatrixInputJob
Running org.apache.mahout.clustering.spectral.TestVectorCache
Tests run: 3, Failures: 0, Errors: 0, Skipped: 0, Time elapsed: 1.537 sec - in org.apache.mahout.clustering.spectral.TestVectorCache
Running org.apache.mahout.classifier.RegressionResultAnalyzerTest
Tests run: 2, Failures: 0, Errors: 0, Skipped: 0, Time elapsed: 0.128 sec - in org.apache.mahout.classifier.RegressionResultAnalyzerTest
Running org.apache.mahout.classifier.sequencelearning.hmm.HMMEvaluatorTest
Tests run: 2, Failures: 0, Errors: 0, Skipped: 0, Time elapsed: 0.157 sec - in org.apache.mahout.classifier.sequencelearning.hmm.HMMEvaluatorTest
Running org.apache.mahout.classifier.sequencelearning.hmm.HMMTrainerTest
Tests run: 4, Failures: 0, Errors: 0, Skipped: 0, Time elapsed: 0.177 sec - in org.apache.mahout.classifier.sequencelearning.hmm.HMMTrainerTest
Running org.apache.mahout.classifier.sequencelearning.hmm.HMMModelTest
Tests run: 1, Failures: 0, Errors: 0, Skipped: 0, Time elapsed: 0.203 sec - in org.apache.mahout.classifier.sequencelearning.hmm.HMMModelTest
Running org.apache.mahout.classifier.sequencelearning.hmm.HMMAlgorithmsTest
Tests run: 6, Failures: 0, Errors: 0, Skipped: 0, Time elapsed: 0.201 sec - in org.apache.mahout.classifier.sequencelearning.hmm.HMMAlgorithmsTest
Running org.apache.mahout.classifier.sequencelearning.hmm.HMMUtilsTest
Tests run: 7, Failures: 0, Errors: 0, Skipped: 0, Time elapsed: 0.219 sec - in org.apache.mahout.classifier.sequencelearning.hmm.HMMUtilsTest
Tests run: 8, Failures: 0, Errors: 0, Skipped: 0, Time elapsed: 115.402 sec - in org.apache.mahout.clustering.streaming.cluster.StreamingKMeansTest
Running org.apache.mahout.classifier.ConfusionMatrixTest
Tests run: 3, Failures: 0, Errors: 0, Skipped: 0, Time elapsed: 0.209 sec - in org.apache.mahout.classifier.ConfusionMatrixTest
Running org.apache.mahout.classifier.naivebayes.StandardNaiveBayesClassifierTest
Tests run: 1, Failures: 0, Errors: 0, Skipped: 0, Time elapsed: 0.165 sec - in org.apache.mahout.classifier.naivebayes.StandardNaiveBayesClassifierTest
Running org.apache.mahout.classifier.naivebayes.ComplementaryNaiveBayesClassifierTest
Tests run: 1, Failures: 0, Errors: 0, Skipped: 0, Time elapsed: 0.159 sec - in org.apache.mahout.classifier.naivebayes.ComplementaryNaiveBayesClassifierTest
Running org.apache.mahout.classifier.naivebayes.NaiveBayesModelTest
Tests run: 1, Failures: 0, Errors: 0, Skipped: 0, Time elapsed: 0.143 sec - in org.apache.mahout.classifier.naivebayes.NaiveBayesModelTest
Running org.apache.mahout.classifier.naivebayes.training.ThetaMapperTest
Tests run: 1, Failures: 0, Errors: 0, Skipped: 0, Time elapsed: 0.371 sec - in org.apache.mahout.classifier.naivebayes.training.ThetaMapperTest
Running org.apache.mahout.classifier.naivebayes.training.IndexInstancesMapperTest
Tests run: 2, Failures: 0, Errors: 0, Skipped: 0, Time elapsed: 0.398 sec - in org.apache.mahout.classifier.naivebayes.training.IndexInstancesMapperTest
Running org.apache.mahout.classifier.naivebayes.training.WeightsMapperTest
Tests run: 1, Failures: 0, Errors: 0, Skipped: 0, Time elapsed: 0.451 sec - in org.apache.mahout.classifier.naivebayes.training.WeightsMapperTest
Running org.apache.mahout.classifier.naivebayes.NaiveBayesTest
Running org.apache.mahout.classifier.df.data.DescriptorUtilsTest
Tests run: 2, Failures: 0, Errors: 0, Skipped: 0, Time elapsed: 0.179 sec - in org.apache.mahout.classifier.df.data.DescriptorUtilsTest
Running org.apache.mahout.classifier.df.data.DataTest
Tests run: 10, Failures: 0, Errors: 0, Skipped: 0, Time elapsed: 1.186 sec - in org.apache.mahout.classifier.df.data.DataTest
Running org.apache.mahout.classifier.df.data.DataConverterTest
Tests run: 1, Failures: 0, Errors: 0, Skipped: 0, Time elapsed: 0.665 sec - in org.apache.mahout.classifier.df.data.DataConverterTest
Running org.apache.mahout.classifier.df.data.DataLoaderTest
Tests run: 4, Failures: 0, Errors: 0, Skipped: 0, Time elapsed: 2.155 sec - in org.apache.mahout.classifier.df.data.DataLoaderTest
Running org.apache.mahout.classifier.df.data.DatasetTest
Tests run: 2, Failures: 0, Errors: 0, Skipped: 0, Time elapsed: 0.525 sec - in org.apache.mahout.classifier.df.data.DatasetTest
Running org.apache.mahout.classifier.df.node.NodeTest
Tests run: 4, Failures: 0, Errors: 0, Skipped: 0, Time elapsed: 0.171 sec - in org.apache.mahout.classifier.df.node.NodeTest
Tests run: 2, Failures: 0, Errors: 0, Skipped: 0, Time elapsed: 8.641 sec - in org.apache.mahout.classifier.naivebayes.NaiveBayesTest
Running org.apache.mahout.classifier.df.split.RegressionSplitTest
Running org.apache.mahout.classifier.df.DecisionForestTest
Tests run: 1, Failures: 0, Errors: 0, Skipped: 0, Time elapsed: 0.435 sec - in org.apache.mahout.classifier.df.split.RegressionSplitTest
Tests run: 3, Failures: 0, Errors: 0, Skipped: 0, Time elapsed: 0.587 sec - in org.apache.mahout.classifier.df.DecisionForestTest
Running org.apache.mahout.classifier.df.split.DefaultIgSplitTest
Running org.apache.mahout.classifier.df.mapreduce.partial.Step1MapperTest
Tests run: 1, Failures: 0, Errors: 0, Skipped: 0, Time elapsed: 0.63 sec - in org.apache.mahout.classifier.df.split.DefaultIgSplitTest
Tests run: 1, Failures: 0, Errors: 0, Skipped: 0, Time elapsed: 0.722 sec - in org.apache.mahout.classifier.df.mapreduce.partial.Step1MapperTest
Running org.apache.mahout.classifier.df.mapreduce.partial.TreeIDTest
Running org.apache.mahout.classifier.df.mapreduce.partial.PartialBuilderTest
Tests run: 1, Failures: 0, Errors: 0, Skipped: 0, Time elapsed: 0.448 sec - in org.apache.mahout.classifier.df.mapreduce.partial.TreeIDTest
Running org.apache.mahout.classifier.df.mapreduce.inmem.InMemInputSplitTest
Tests run: 2, Failures: 0, Errors: 0, Skipped: 0, Time elapsed: 0.123 sec - in org.apache.mahout.classifier.df.mapreduce.inmem.InMemInputSplitTest
Tests run: 2, Failures: 0, Errors: 0, Skipped: 0, Time elapsed: 1.347 sec - in org.apache.mahout.classifier.df.mapreduce.partial.PartialBuilderTest
Running org.apache.mahout.classifier.df.mapreduce.inmem.InMemInputFormatTest
Tests run: 2, Failures: 0, Errors: 0, Skipped: 0, Time elapsed: 0.445 sec - in org.apache.mahout.classifier.df.mapreduce.inmem.InMemInputFormatTest
Running org.apache.mahout.classifier.df.builder.DecisionTreeBuilderTest
Tests run: 1, Failures: 0, Errors: 0, Skipped: 0, Time elapsed: 0.183 sec - in org.apache.mahout.classifier.df.builder.DecisionTreeBuilderTest
Running org.apache.mahout.classifier.df.builder.InfiniteRecursionTest
Running org.apache.mahout.classifier.df.builder.DefaultTreeBuilderTest
Tests run: 1, Failures: 0, Errors: 0, Skipped: 0, Time elapsed: 0.142 sec - in org.apache.mahout.classifier.df.builder.DefaultTreeBuilderTest
Tests run: 1, Failures: 0, Errors: 0, Skipped: 0, Time elapsed: 0.511 sec - in org.apache.mahout.classifier.df.builder.InfiniteRecursionTest
Running org.apache.mahout.classifier.df.tools.VisualizerTest
Running org.apache.mahout.classifier.evaluation.AucTest
Tests run: 5, Failures: 0, Errors: 0, Skipped: 0, Time elapsed: 0.529 sec - in org.apache.mahout.classifier.df.tools.VisualizerTest
Tests run: 3, Failures: 0, Errors: 0, Skipped: 0, Time elapsed: 0.611 sec - in org.apache.mahout.classifier.evaluation.AucTest
Running org.apache.mahout.classifier.sgd.OnlineLogisticRegressionTest
Running org.apache.mahout.classifier.sgd.GradientMachineTest
Tests run: 1, Failures: 0, Errors: 0, Skipped: 0, Time elapsed: 0.25 sec - in org.apache.mahout.classifier.sgd.GradientMachineTest
Running org.apache.mahout.classifier.sgd.AdaptiveLogisticRegressionTest
Tests run: 5, Failures: 0, Errors: 0, Skipped: 0, Time elapsed: 4.087 sec - in org.apache.mahout.classifier.sgd.AdaptiveLogisticRegressionTest
Running org.apache.mahout.classifier.sgd.CsvRecordFactoryTest
Tests run: 2, Failures: 0, Errors: 0, Skipped: 0, Time elapsed: 0.311 sec - in org.apache.mahout.classifier.sgd.CsvRecordFactoryTest
Running org.apache.mahout.classifier.sgd.PassiveAggressiveTest
Tests run: 1, Failures: 0, Errors: 0, Skipped: 0, Time elapsed: 0.351 sec - in org.apache.mahout.classifier.sgd.PassiveAggressiveTest
Running org.apache.mahout.classifier.sgd.ModelSerializerTest
Tests run: 4, Failures: 0, Errors: 0, Skipped: 0, Time elapsed: 1.129 sec - in org.apache.mahout.classifier.sgd.ModelSerializerTest
Tests run: 6, Failures: 0, Errors: 0, Skipped: 0, Time elapsed: 11.034 sec - in org.apache.mahout.classifier.sgd.OnlineLogisticRegressionTest

Results :

Tests run: 742, Failures: 0, Errors: 0, Skipped: 0

[JENKINS] Recording test results
[INFO] ------------------------------------------------------------------------
[INFO] Reactor Summary:
[INFO] 
[INFO] Mahout Build Tools ................................. SUCCESS [ 18.968 s]
[INFO] Apache Mahout ...................................... SUCCESS [  6.585 s]
[INFO] Mahout Math ........................................ SUCCESS [03:25 min]
[INFO] Mahout HDFS ........................................ SUCCESS [ 38.668 s]
[INFO] Mahout Map-Reduce .................................. FAILURE [11:56 min]
[INFO] Mahout Integration ................................. SKIPPED
[INFO] Mahout Examples .................................... SKIPPED
[INFO] Mahout Math Scala bindings ......................... SKIPPED
[INFO] Mahout Spark bindings .............................. SKIPPED
[INFO] Mahout H2O backend ................................. SKIPPED
[INFO] ------------------------------------------------------------------------
[INFO] BUILD FAILURE
[INFO] ------------------------------------------------------------------------
[INFO] Total time: 16:45 min
[INFO] Finished at: 2017-11-29T22:15:36+00:00
[INFO] Final Memory: 37M/549M
[INFO] ------------------------------------------------------------------------
[ERROR] Failed to execute goal org.apache.maven.plugins:maven-surefire-plugin:2.18.1:test
(default-test) on project mahout-mr: ExecutionException: java.lang.RuntimeException: The forked
VM terminated without properly saying goodbye. VM crash or System.exit called?
[ERROR] Command was /bin/sh -c cd <https://builds.apache.org/job/mahout-nightly/ws/mr>
&& /home/jenkins/tools/java/latest1.7/bin/java -Djava.security.auth.login.config=<https://builds.apache.org/job/mahout-nightly/ws/mr/target/../../buildtools/src/test/resources/jaas.config>
-jar <https://builds.apache.org/job/mahout-nightly/ws/mr/target/surefire/surefirebooter3380067746669789483.jar>
<https://builds.apache.org/job/mahout-nightly/ws/mr/target/surefire/surefire7235300686266945768tmp>
<https://builds.apache.org/job/mahout-nightly/ws/mr/target/surefire/surefire_1411544663779671062080tmp>
[ERROR] -> [Help 1]
[ERROR] 
[ERROR] To see the full stack trace of the errors, re-run Maven with the -e switch.
[ERROR] Re-run Maven using the -X switch to enable full debug logging.
[ERROR] 
[ERROR] For more information about the errors and possible solutions, please read the following
articles:
[ERROR] [Help 1] http://cwiki.apache.org/confluence/display/MAVEN/MojoFailureException
[ERROR] 
[ERROR] After correcting the problems, you can resume the build with the command
[ERROR]   mvn <goals> -rf :mahout-mr
[JENKINS] Archiving <https://builds.apache.org/job/mahout-nightly/ws/spark/pom.xml>
to org.apache.mahout/mahout-spark_2.10/0.13.1-SNAPSHOT/mahout-spark_2.10-0.13.1-SNAPSHOT.pom
[Fast Archiver] No artifacts from mahout-nightly » Mahout Spark bindings #2237 to compare,
so performing full copy of artifacts
[JENKINS] Archiving <https://builds.apache.org/job/mahout-nightly/ws/examples/pom.xml>
to org.apache.mahout/mahout-examples/0.13.1-SNAPSHOT/mahout-examples-0.13.1-SNAPSHOT.pom
[Fast Archiver] No artifacts from mahout-nightly » Mahout Examples #2237 to compare, so performing
full copy of artifacts
[JENKINS] Archiving <https://builds.apache.org/job/mahout-nightly/ws/pom.xml> to org.apache.mahout/mahout/0.13.1-SNAPSHOT/mahout-0.13.1-SNAPSHOT.pom
[Fast Archiver] No artifacts from mahout-nightly » Apache Mahout #2237 to compare, so performing
full copy of artifacts
[JENKINS] Archiving <https://builds.apache.org/job/mahout-nightly/ws/math/pom.xml> to
org.apache.mahout/mahout-math/0.13.1-SNAPSHOT/mahout-math-0.13.1-SNAPSHOT.pom
[JENKINS] Archiving <https://builds.apache.org/job/mahout-nightly/ws/math/target/mahout-math-0.13.1-SNAPSHOT.jar>
to org.apache.mahout/mahout-math/0.13.1-20171129.220237-54/mahout-math-0.13.1-20171129.220237-54.jar
[JENKINS] Archiving <https://builds.apache.org/job/mahout-nightly/ws/math/target/mahout-math-0.13.1-SNAPSHOT-tests.jar>
to org.apache.mahout/mahout-math/0.13.1-20171129.220237-54/mahout-math-0.13.1-20171129.220237-54-tests.jar
[Fast Archiver] No artifacts from mahout-nightly » Mahout Math #2237 to compare, so performing
full copy of artifacts
[JENKINS] Archiving <https://builds.apache.org/job/mahout-nightly/ws/integration/pom.xml>
to org.apache.mahout/mahout-integration/0.13.1-SNAPSHOT/mahout-integration-0.13.1-SNAPSHOT.pom
[Fast Archiver] No artifacts from mahout-nightly » Mahout Integration #2237 to compare, so
performing full copy of artifacts
[JENKINS] Archiving <https://builds.apache.org/job/mahout-nightly/ws/h2o/pom.xml> to
org.apache.mahout/mahout-h2o_2.10/0.13.1-SNAPSHOT/mahout-h2o_2.10-0.13.1-SNAPSHOT.pom
[Fast Archiver] No artifacts from mahout-nightly » Mahout H2O backend #2237 to compare, so
performing full copy of artifacts
[JENKINS] Archiving <https://builds.apache.org/job/mahout-nightly/ws/hdfs/pom.xml> to
org.apache.mahout/mahout-hdfs/0.13.1-SNAPSHOT/mahout-hdfs-0.13.1-SNAPSHOT.pom
[JENKINS] Archiving <https://builds.apache.org/job/mahout-nightly/ws/hdfs/target/mahout-hdfs-0.13.1-SNAPSHOT.jar>
to org.apache.mahout/mahout-hdfs/0.13.1-20171129.220319-54/mahout-hdfs-0.13.1-20171129.220319-54.jar
[JENKINS] Archiving <https://builds.apache.org/job/mahout-nightly/ws/hdfs/target/mahout-hdfs-0.13.1-SNAPSHOT-tests.jar>
to org.apache.mahout/mahout-hdfs/0.13.1-20171129.220319-54/mahout-hdfs-0.13.1-20171129.220319-54-tests.jar
[Fast Archiver] No artifacts from mahout-nightly » Mahout HDFS #2237 to compare, so performing
full copy of artifacts
[JENKINS] Archiving <https://builds.apache.org/job/mahout-nightly/ws/mr/pom.xml> to
org.apache.mahout/mahout-mr/0.13.1-SNAPSHOT/mahout-mr-0.13.1-SNAPSHOT.pom
[Fast Archiver] No artifacts from mahout-nightly » Mahout Map-Reduce #2237 to compare, so
performing full copy of artifacts
[JENKINS] Archiving <https://builds.apache.org/job/mahout-nightly/ws/buildtools/pom.xml>
to org.apache.mahout/mahout-buildtools/0.13.1-SNAPSHOT/mahout-buildtools-0.13.1-SNAPSHOT.pom
[JENKINS] Archiving <https://builds.apache.org/job/mahout-nightly/ws/buildtools/target/mahout-buildtools-0.13.1-SNAPSHOT.jar>
to org.apache.mahout/mahout-buildtools/0.13.1-20171129.215906-55/mahout-buildtools-0.13.1-20171129.215906-55.jar
[Fast Archiver] No artifacts from mahout-nightly » Mahout Build Tools #2237 to compare, so
performing full copy of artifacts
[JENKINS] Archiving <https://builds.apache.org/job/mahout-nightly/ws/math-scala/pom.xml>
to org.apache.mahout/mahout-math-scala_2.10/0.13.1-SNAPSHOT/mahout-math-scala_2.10-0.13.1-SNAPSHOT.pom
[Fast Archiver] No artifacts from mahout-nightly » Mahout Math Scala bindings #2237 to compare,
so performing full copy of artifacts
Sending e-mails to: dev@mahout.apache.org
channel stopped
Not sending mail to unregistered user trevor.d.grant@gmail.com

Mime
View raw message