mahout-dev mailing list archives

Site index · List index
Message view « Date » · « Thread »
Top « Date » · « Thread »
From Apache Jenkins Server <jenk...@builds.apache.org>
Subject Build failed in Jenkins: Mahout-Quality #3326
Date Mon, 11 Apr 2016 09:38:54 GMT
See <https://builds.apache.org/job/Mahout-Quality/3326/changes>

Changes:

[apalumbo] fix conflict on root pom

------------------------------------------
[...truncated 3250 lines...]
[INFO] Installing <https://builds.apache.org/job/Mahout-Quality/ws/spark/pom.xml> to
/home/jenkins/.m2/repository/org/apache/mahout/mahout-spark_2.10/0.12.0-SNAPSHOT/mahout-spark_2.10-0.12.0-SNAPSHOT.pom
[INFO] Installing <https://builds.apache.org/job/Mahout-Quality/3326/artifact/spark/target/mahout-spark_2.10-0.12.0-SNAPSHOT-dependency-reduced.jar>
to /home/jenkins/.m2/repository/org/apache/mahout/mahout-spark_2.10/0.12.0-SNAPSHOT/mahout-spark_2.10-0.12.0-SNAPSHOT-dependency-reduced.jar
[INFO] Installing <https://builds.apache.org/job/Mahout-Quality/3326/artifact/spark/target/mahout-spark_2.10-0.12.0-SNAPSHOT-tests.jar>
to /home/jenkins/.m2/repository/org/apache/mahout/mahout-spark_2.10/0.12.0-SNAPSHOT/mahout-spark_2.10-0.12.0-SNAPSHOT-tests.jar
[INFO]                                                                         
[INFO] ------------------------------------------------------------------------
[INFO] Building Mahout Flink bindings 0.12.0-SNAPSHOT
[INFO] ------------------------------------------------------------------------
[INFO] 
[INFO] --- maven-clean-plugin:2.5:clean (default-clean) @ mahout-flink_2.10 ---
[INFO] Deleting <https://builds.apache.org/job/Mahout-Quality/ws/flink/target>
[INFO] 
[INFO] --- maven-enforcer-plugin:1.4:enforce (enforce-versions) @ mahout-flink_2.10 ---
[INFO] 
[INFO] --- scala-maven-plugin:3.2.0:add-source (add-scala-sources) @ mahout-flink_2.10 ---
[INFO] Add Source directory: <https://builds.apache.org/job/Mahout-Quality/ws/flink/src/main/scala>
[INFO] Add Test Source directory: <https://builds.apache.org/job/Mahout-Quality/ws/flink/src/test/scala>
[INFO] 
[INFO] --- maven-remote-resources-plugin:1.5:process (default) @ mahout-flink_2.10 ---
[INFO] 
[INFO] --- maven-resources-plugin:2.7:resources (default-resources) @ mahout-flink_2.10 ---
[INFO] Using 'UTF-8' encoding to copy filtered resources.
[INFO] Copying 1 resource
[INFO] Copying 3 resources
[INFO] 
[INFO] --- scala-maven-plugin:3.2.0:compile (scala-compile) @ mahout-flink_2.10 ---
[INFO] <https://builds.apache.org/job/Mahout-Quality/ws/flink/src/main/scala>:-1: info:
compiling
[INFO] Compiling 23 source files to <https://builds.apache.org/job/Mahout-Quality/3326/artifact/flink/target/classes>
at 1460367469273
[WARNING] <https://builds.apache.org/job/Mahout-Quality/ws/flink/src/main/scala/org/apache/mahout/flinkbindings/io/Hadoop2HDFSUtil.scala>:46:
warning: method isDir in class FileStatus is deprecated: see corresponding Javadoc for more
information.
[WARNING]         !s.getPath.getName.startsWith("\\.") && !s.getPath.getName.startsWith("_")
&& !s.isDir
[WARNING]                                                                                
         ^
[WARNING] <https://builds.apache.org/job/Mahout-Quality/ws/flink/src/main/scala/org/apache/mahout/flinkbindings/io/Hadoop2HDFSUtil.scala>:61:
warning: constructor Reader in class Reader is deprecated: see corresponding Javadoc for more
information.
[WARNING]      val reader = new SequenceFile.Reader(fs, partFilePath, fs.getConf)
[WARNING]                   ^
[WARNING] two warnings found
[INFO] prepare-compile in 0 s
[INFO] compile in 26 s
[INFO] 
[INFO] --- maven-compiler-plugin:3.3:compile (default-compile) @ mahout-flink_2.10 ---
[INFO] Nothing to compile - all classes are up to date
[INFO] 
[INFO] --- maven-resources-plugin:2.7:testResources (default-testResources) @ mahout-flink_2.10
---
[INFO] Using 'UTF-8' encoding to copy filtered resources.
[INFO] skip non existing resourceDirectory <https://builds.apache.org/job/Mahout-Quality/ws/flink/src/test/resources>
[INFO] Copying 3 resources
[INFO] 
[INFO] --- scala-maven-plugin:3.2.0:testCompile (scala-test-compile) @ mahout-flink_2.10 ---
[INFO] <https://builds.apache.org/job/Mahout-Quality/ws/flink/src/test/scala>:-1: info:
compiling
[INFO] Compiling 12 source files to <https://builds.apache.org/job/Mahout-Quality/3326/artifact/flink/target/test-classes>
at 1460367495332
[WARNING] <https://builds.apache.org/job/Mahout-Quality/ws/flink/src/test/scala/org/apache/mahout/flinkbindings/blas/LATestSuite.scala>:202:
warning: Type Any has no fields that are visible from Scala Type analysis. Falling back to
Java Type Analysis (TypeExtractor).
[WARNING]     val res = FlinkOpAtA.fat(op, Aany)
[WARNING]                                  ^
[WARNING] one warning found
[INFO] prepare-compile in 0 s
[INFO] compile in 16 s
[INFO] 
[INFO] --- maven-compiler-plugin:3.3:testCompile (default-testCompile) @ mahout-flink_2.10
---
[INFO] Nothing to compile - all classes are up to date
[INFO] 
[INFO] --- maven-surefire-plugin:2.18.1:test (default-test) @ mahout-flink_2.10 ---
[INFO] Tests are skipped.
[INFO] 
[INFO] --- scalatest-maven-plugin:1.0:test (test) @ mahout-flink_2.10 ---
Discovery starting.
Discovery completed in 583 milliseconds.
Run starting. Expected test count is: 105
DrmLikeOpsSuite:
Exception encountered when invoking run on a nested suite - requirement failed: MAHOUT_HOME
is required to spawn mahout-based flink jobs *** ABORTED ***
  java.lang.IllegalArgumentException: requirement failed: MAHOUT_HOME is required to
spawn mahout-based flink jobs
  at scala.Predef$.require(Predef.scala:233)
  at org.apache.mahout.flinkbindings.package$.getMahoutHome(package.scala:111)
  at org.apache.mahout.flinkbindings.FlinkDistributedContext.<init>(FlinkDistributedContext.scala:28)
  at org.apache.mahout.flinkbindings.package$.wrapContext(package.scala:52)
  at org.apache.mahout.flinkbindings.DistributedFlinkSuite$class.initContext(DistributedFlinkSuite.scala:42)
  at org.apache.mahout.flinkbindings.DrmLikeOpsSuite.initContext(DrmLikeOpsSuite.scala:28)
  at org.apache.mahout.flinkbindings.DistributedFlinkSuite$class.beforeAll(DistributedFlinkSuite.scala:71)
  at org.apache.mahout.flinkbindings.DrmLikeOpsSuite.beforeAll(DrmLikeOpsSuite.scala:28)
  at org.scalatest.BeforeAndAfterAllConfigMap$class.run(BeforeAndAfterAllConfigMap.scala:244)
  at org.apache.mahout.flinkbindings.DrmLikeOpsSuite.run(DrmLikeOpsSuite.scala:28)
  ...
LATestSuite:
Exception encountered when invoking run on a nested suite - requirement failed: MAHOUT_HOME
is required to spawn mahout-based flink jobs *** ABORTED ***
  java.lang.IllegalArgumentException: requirement failed: MAHOUT_HOME is required to
spawn mahout-based flink jobs
  at scala.Predef$.require(Predef.scala:233)
  at org.apache.mahout.flinkbindings.package$.getMahoutHome(package.scala:111)
  at org.apache.mahout.flinkbindings.FlinkDistributedContext.<init>(FlinkDistributedContext.scala:28)
  at org.apache.mahout.flinkbindings.package$.wrapContext(package.scala:52)
  at org.apache.mahout.flinkbindings.DistributedFlinkSuite$class.initContext(DistributedFlinkSuite.scala:42)
  at org.apache.mahout.flinkbindings.blas.LATestSuite.initContext(LATestSuite.scala:31)
  at org.apache.mahout.flinkbindings.DistributedFlinkSuite$class.beforeAll(DistributedFlinkSuite.scala:71)
  at org.apache.mahout.flinkbindings.blas.LATestSuite.beforeAll(LATestSuite.scala:31)
  at org.scalatest.BeforeAndAfterAllConfigMap$class.run(BeforeAndAfterAllConfigMap.scala:244)
  at org.apache.mahout.flinkbindings.blas.LATestSuite.run(LATestSuite.scala:31)
  ...
UseCasesSuite:
Exception encountered when invoking run on a nested suite - requirement failed: MAHOUT_HOME
is required to spawn mahout-based flink jobs *** ABORTED ***
  java.lang.IllegalArgumentException: requirement failed: MAHOUT_HOME is required to
spawn mahout-based flink jobs
  at scala.Predef$.require(Predef.scala:233)
  at org.apache.mahout.flinkbindings.package$.getMahoutHome(package.scala:111)
  at org.apache.mahout.flinkbindings.FlinkDistributedContext.<init>(FlinkDistributedContext.scala:28)
  at org.apache.mahout.flinkbindings.package$.wrapContext(package.scala:52)
  at org.apache.mahout.flinkbindings.DistributedFlinkSuite$class.initContext(DistributedFlinkSuite.scala:42)
  at org.apache.mahout.flinkbindings.UseCasesSuite.initContext(UseCasesSuite.scala:32)
  at org.apache.mahout.flinkbindings.DistributedFlinkSuite$class.beforeAll(DistributedFlinkSuite.scala:71)
  at org.apache.mahout.flinkbindings.UseCasesSuite.beforeAll(UseCasesSuite.scala:32)
  at org.scalatest.BeforeAndAfterAllConfigMap$class.run(BeforeAndAfterAllConfigMap.scala:244)
  at org.apache.mahout.flinkbindings.UseCasesSuite.run(UseCasesSuite.scala:32)
  ...
FlinkDistributedDecompositionsSuite:
Exception encountered when invoking run on a nested suite - requirement failed: MAHOUT_HOME
is required to spawn mahout-based flink jobs *** ABORTED ***
  java.lang.IllegalArgumentException: requirement failed: MAHOUT_HOME is required to
spawn mahout-based flink jobs
  at scala.Predef$.require(Predef.scala:233)
  at org.apache.mahout.flinkbindings.package$.getMahoutHome(package.scala:111)
  at org.apache.mahout.flinkbindings.FlinkDistributedContext.<init>(FlinkDistributedContext.scala:28)
  at org.apache.mahout.flinkbindings.package$.wrapContext(package.scala:52)
  at org.apache.mahout.flinkbindings.DistributedFlinkSuite$class.initContext(DistributedFlinkSuite.scala:42)
  at org.apache.mahout.flinkbindings.standard.FlinkDistributedDecompositionsSuite.initContext(FlinkDistributedDecompositionsSuite.scala:38)
  at org.apache.mahout.flinkbindings.DistributedFlinkSuite$class.beforeAll(DistributedFlinkSuite.scala:71)
  at org.apache.mahout.flinkbindings.standard.FlinkDistributedDecompositionsSuite.beforeAll(FlinkDistributedDecompositionsSuite.scala:38)
  at org.scalatest.BeforeAndAfterAllConfigMap$class.run(BeforeAndAfterAllConfigMap.scala:244)
  at org.apache.mahout.flinkbindings.standard.FlinkDistributedDecompositionsSuite.run(FlinkDistributedDecompositionsSuite.scala:38)
  ...
RLikeOpsSuite:
Exception encountered when invoking run on a nested suite - requirement failed: MAHOUT_HOME
is required to spawn mahout-based flink jobs *** ABORTED ***
  java.lang.IllegalArgumentException: requirement failed: MAHOUT_HOME is required to
spawn mahout-based flink jobs
  at scala.Predef$.require(Predef.scala:233)
  at org.apache.mahout.flinkbindings.package$.getMahoutHome(package.scala:111)
  at org.apache.mahout.flinkbindings.FlinkDistributedContext.<init>(FlinkDistributedContext.scala:28)
  at org.apache.mahout.flinkbindings.package$.wrapContext(package.scala:52)
  at org.apache.mahout.flinkbindings.DistributedFlinkSuite$class.initContext(DistributedFlinkSuite.scala:42)
  at org.apache.mahout.flinkbindings.RLikeOpsSuite.initContext(RLikeOpsSuite.scala:34)
  at org.apache.mahout.flinkbindings.DistributedFlinkSuite$class.beforeAll(DistributedFlinkSuite.scala:71)
  at org.apache.mahout.flinkbindings.RLikeOpsSuite.beforeAll(RLikeOpsSuite.scala:34)
  at org.scalatest.BeforeAndAfterAllConfigMap$class.run(BeforeAndAfterAllConfigMap.scala:244)
  at org.apache.mahout.flinkbindings.RLikeOpsSuite.run(RLikeOpsSuite.scala:34)
  ...
FlinkByteBCastSuite:
- BCast vector
- BCast matrix
NaiveBayesTestSuite:
Exception encountered when invoking run on a nested suite - requirement failed: MAHOUT_HOME
is required to spawn mahout-based flink jobs *** ABORTED ***
  java.lang.IllegalArgumentException: requirement failed: MAHOUT_HOME is required to
spawn mahout-based flink jobs
  at scala.Predef$.require(Predef.scala:233)
  at org.apache.mahout.flinkbindings.package$.getMahoutHome(package.scala:111)
  at org.apache.mahout.flinkbindings.FlinkDistributedContext.<init>(FlinkDistributedContext.scala:28)
  at org.apache.mahout.flinkbindings.package$.wrapContext(package.scala:52)
  at org.apache.mahout.flinkbindings.DistributedFlinkSuite$class.initContext(DistributedFlinkSuite.scala:42)
  at org.apache.mahout.flinkbindings.standard.NaiveBayesTestSuite.initContext(NaiveBayesTestSuite.scala:26)
  at org.apache.mahout.flinkbindings.DistributedFlinkSuite$class.beforeAll(DistributedFlinkSuite.scala:71)
  at org.apache.mahout.flinkbindings.standard.NaiveBayesTestSuite.beforeAll(NaiveBayesTestSuite.scala:26)
  at org.scalatest.BeforeAndAfterAllConfigMap$class.run(BeforeAndAfterAllConfigMap.scala:244)
  at org.apache.mahout.flinkbindings.standard.NaiveBayesTestSuite.run(NaiveBayesTestSuite.scala:26)
  ...
DrmLikeSuite:
Exception encountered when invoking run on a nested suite - requirement failed: MAHOUT_HOME
is required to spawn mahout-based flink jobs *** ABORTED ***
  java.lang.IllegalArgumentException: requirement failed: MAHOUT_HOME is required to
spawn mahout-based flink jobs
  at scala.Predef$.require(Predef.scala:233)
  at org.apache.mahout.flinkbindings.package$.getMahoutHome(package.scala:111)
  at org.apache.mahout.flinkbindings.FlinkDistributedContext.<init>(FlinkDistributedContext.scala:28)
  at org.apache.mahout.flinkbindings.package$.wrapContext(package.scala:52)
  at org.apache.mahout.flinkbindings.DistributedFlinkSuite$class.initContext(DistributedFlinkSuite.scala:42)
  at org.apache.mahout.flinkbindings.standard.DrmLikeSuite.initContext(DrmLikeSuite.scala:25)
  at org.apache.mahout.flinkbindings.DistributedFlinkSuite$class.beforeAll(DistributedFlinkSuite.scala:71)
  at org.apache.mahout.flinkbindings.standard.DrmLikeSuite.beforeAll(DrmLikeSuite.scala:25)
  at org.scalatest.BeforeAndAfterAllConfigMap$class.run(BeforeAndAfterAllConfigMap.scala:244)
  at org.apache.mahout.flinkbindings.standard.DrmLikeSuite.run(DrmLikeSuite.scala:25)
  ...
RLikeDrmOpsSuite:
Exception encountered when invoking run on a nested suite - requirement failed: MAHOUT_HOME
is required to spawn mahout-based flink jobs *** ABORTED ***
  java.lang.IllegalArgumentException: requirement failed: MAHOUT_HOME is required to
spawn mahout-based flink jobs
  at scala.Predef$.require(Predef.scala:233)
  at org.apache.mahout.flinkbindings.package$.getMahoutHome(package.scala:111)
  at org.apache.mahout.flinkbindings.FlinkDistributedContext.<init>(FlinkDistributedContext.scala:28)
  at org.apache.mahout.flinkbindings.package$.wrapContext(package.scala:52)
  at org.apache.mahout.flinkbindings.DistributedFlinkSuite$class.initContext(DistributedFlinkSuite.scala:42)
  at org.apache.mahout.flinkbindings.standard.RLikeDrmOpsSuite.initContext(RLikeDrmOpsSuite.scala:25)
  at org.apache.mahout.flinkbindings.DistributedFlinkSuite$class.beforeAll(DistributedFlinkSuite.scala:71)
  at org.apache.mahout.flinkbindings.standard.RLikeDrmOpsSuite.beforeAll(RLikeDrmOpsSuite.scala:25)
  at org.scalatest.BeforeAndAfterAllConfigMap$class.run(BeforeAndAfterAllConfigMap.scala:244)
  at org.apache.mahout.flinkbindings.standard.RLikeDrmOpsSuite.run(RLikeDrmOpsSuite.scala:25)
  ...
DrmLikeOpsSuite:
Exception encountered when invoking run on a nested suite - requirement failed: MAHOUT_HOME
is required to spawn mahout-based flink jobs *** ABORTED ***
  java.lang.IllegalArgumentException: requirement failed: MAHOUT_HOME is required to
spawn mahout-based flink jobs
  at scala.Predef$.require(Predef.scala:233)
  at org.apache.mahout.flinkbindings.package$.getMahoutHome(package.scala:111)
  at org.apache.mahout.flinkbindings.FlinkDistributedContext.<init>(FlinkDistributedContext.scala:28)
  at org.apache.mahout.flinkbindings.package$.wrapContext(package.scala:52)
  at org.apache.mahout.flinkbindings.DistributedFlinkSuite$class.initContext(DistributedFlinkSuite.scala:42)
  at org.apache.mahout.flinkbindings.standard.DrmLikeOpsSuite.initContext(DrmLikeOpsSuite.scala:25)
  at org.apache.mahout.flinkbindings.DistributedFlinkSuite$class.beforeAll(DistributedFlinkSuite.scala:71)
  at org.apache.mahout.flinkbindings.standard.DrmLikeOpsSuite.beforeAll(DrmLikeOpsSuite.scala:25)
  at org.scalatest.BeforeAndAfterAllConfigMap$class.run(BeforeAndAfterAllConfigMap.scala:244)
  at org.apache.mahout.flinkbindings.standard.DrmLikeOpsSuite.run(DrmLikeOpsSuite.scala:25)
  ...
Run completed in 2 seconds, 621 milliseconds.
Total number of tests run: 2
Suites: completed 2, aborted 9
Tests: succeeded 2, failed 0, canceled 0, ignored 0, pending 0
*** 9 SUITES ABORTED ***
[INFO]                                                                         
[INFO] ------------------------------------------------------------------------
[INFO] Skipping Apache Mahout
[INFO] This project has been banned from the build due to previous failures.
[INFO] ------------------------------------------------------------------------
[INFO]                                                                         
[INFO] ------------------------------------------------------------------------
[INFO] Skipping Mahout Build Tools
[INFO] This project has been banned from the build due to previous failures.
[INFO] ------------------------------------------------------------------------
[INFO] ------------------------------------------------------------------------
[INFO] Reactor Summary:
[INFO] 
[INFO] Mahout Build Tools ................................. SUCCESS [  2.333 s]
[INFO] Apache Mahout ...................................... SUCCESS [  0.139 s]
[INFO] Mahout Math ........................................ SUCCESS [01:12 min]
[INFO] Mahout HDFS ........................................ SUCCESS [  3.763 s]
[INFO] Mahout Map-Reduce .................................. SUCCESS [12:28 min]
[INFO] Mahout Integration ................................. SUCCESS [ 43.360 s]
[INFO] Mahout Examples .................................... SUCCESS [ 23.201 s]
[INFO] Mahout Math Scala bindings ......................... SUCCESS [05:06 min]
[INFO] Mahout H2O backend ................................. SUCCESS [03:28 min]
[INFO] Mahout Spark bindings .............................. SUCCESS [02:13 min]
[INFO] Mahout Flink bindings .............................. FAILURE [ 48.274 s]
[INFO] Mahout Spark bindings shell ........................ SKIPPED
[INFO] Mahout Release Package ............................. SKIPPED
[INFO] ------------------------------------------------------------------------
[INFO] BUILD FAILURE
[INFO] ------------------------------------------------------------------------
[INFO] Total time: 26:32 min
[INFO] Finished at: 2016-04-11T09:38:35+00:00
[INFO] Final Memory: 69M/788M
[INFO] ------------------------------------------------------------------------
[ERROR] Failed to execute goal org.scalatest:scalatest-maven-plugin:1.0:test (test) on project
mahout-flink_2.10: There are test failures -> [Help 1]
[ERROR] 
[ERROR] To see the full stack trace of the errors, re-run Maven with the -e switch.
[ERROR] Re-run Maven using the -X switch to enable full debug logging.
[ERROR] 
[ERROR] For more information about the errors and possible solutions, please read the following
articles:
[ERROR] [Help 1] http://cwiki.apache.org/confluence/display/MAVEN/MojoFailureException
[ERROR] 
[ERROR] After correcting the problems, you can resume the build with the command
[ERROR]   mvn <goals> -rf :mahout-flink_2.10
Build step 'Invoke top-level Maven targets' marked build as failure
[PMD] Skipping publisher since build result is FAILURE
[TASKS] Skipping publisher since build result is FAILURE
Archiving artifacts
Compressed 169.75 MB of artifacts by 87.6% relative to #3323
Recording test results
Publishing Javadoc

Mime
View raw message