mahout-dev mailing list archives

Site index · List index
Message view « Date » · « Thread »
Top « Date » · « Thread »
From Apache Jenkins Server <jenk...@builds.apache.org>
Subject Build failed in Jenkins: Mahout-Quality #3264
Date Thu, 06 Aug 2015 04:47:45 GMT
See <https://builds.apache.org/job/Mahout-Quality/3264/changes>

Changes:

[smarthi] [maven-release-plugin] prepare release mahout-0.11.0

[smarthi] [maven-release-plugin] prepare for next development iteration

------------------------------------------
[...truncated 1736 lines...]
63/63 KB   276/276 KB   31/31 KB   157/238 KB   91/97 KB   
63/63 KB   276/276 KB   31/31 KB   157/238 KB   95/97 KB   
63/63 KB   276/276 KB   31/31 KB   157/238 KB   97/97 KB   
                                                           
Downloaded: http://repo.maven.apache.org/maven2/org/apache/maven/shared/maven-common-artifact-filters/1.4/maven-common-artifact-filters-1.4.jar
(31 KB at 593.4 KB/sec)
Downloading: http://repo.maven.apache.org/maven2/org/codehaus/plexus/plexus-i18n/1.0-beta-6/plexus-i18n-1.0-beta-6.jar
63/63 KB   276/276 KB   161/238 KB   97/97 KB              
                                                
63/63 KB   165/238 KB   97/97 KB                
Downloaded: http://repo.maven.apache.org/maven2/org/beanshell/bsh/2.0b4/bsh-2.0b4.jar (276
KB at 5190.4 KB/sec)
63/63 KB   169/238 KB   97/97 KB   
Downloading: http://repo.maven.apache.org/maven2/org/apache/maven/plugin-testing/maven-plugin-testing-harness/1.3/maven-plugin-testing-harness-1.3.jar
63/63 KB   173/238 KB   97/97 KB   
63/63 KB   177/238 KB   97/97 KB   
63/63 KB   181/238 KB   97/97 KB   
63/63 KB   185/238 KB   97/97 KB   
63/63 KB   189/238 KB   97/97 KB   
63/63 KB   193/238 KB   97/97 KB   
63/63 KB   197/238 KB   97/97 KB   
63/63 KB   201/238 KB   97/97 KB   
                                   
Downloaded: http://repo.maven.apache.org/maven2/org/apache/maven/shared/maven-dependency-tree/2.2/maven-dependency-tree-2.2.jar
(63 KB at 1266.9 KB/sec)
Downloading: http://repo.maven.apache.org/maven2/org/codehaus/plexus/plexus-archiver/2.2/plexus-archiver-2.2.jar
                                   
Downloaded: http://repo.maven.apache.org/maven2/org/apache/maven/enforcer/enforcer-rules/1.4/enforcer-rules-1.4.jar
(97 KB at 1047.3 KB/sec)
Downloading: http://repo.maven.apache.org/maven2/org/codehaus/plexus/plexus-io/2.0.4/plexus-io-2.0.4.jar
205/238 KB                         
207/238 KB   
211/238 KB   
215/238 KB   
219/238 KB   
223/238 KB   
223/238 KB   4/12 KB   
227/238 KB   4/12 KB   
231/238 KB   4/12 KB   
231/238 KB   8/12 KB   
235/238 KB   8/12 KB   
235/238 KB   12/12 KB   
238/238 KB   12/12 KB   
238/238 KB   12/12 KB   
238/238 KB   4/181 KB   12/12 KB   
238/238 KB   8/181 KB   12/12 KB   
238/238 KB   12/181 KB   12/12 KB   
238/238 KB   16/181 KB   12/12 KB   
238/238 KB   20/181 KB   12/12 KB   
238/238 KB   24/181 KB   12/12 KB   
238/238 KB   28/181 KB   12/12 KB   
238/238 KB   32/181 KB   12/12 KB   
238/238 KB   36/181 KB   12/12 KB   
238/238 KB   40/181 KB   12/12 KB   
238/238 KB   44/181 KB   12/12 KB   
238/238 KB   48/181 KB   12/12 KB   
238/238 KB   52/181 KB   12/12 KB   
238/238 KB   56/181 KB   12/12 KB   
238/238 KB   60/181 KB   12/12 KB   
238/238 KB   64/181 KB   12/12 KB   
4/35 KB   238/238 KB   64/181 KB   12/12 KB   
4/35 KB   238/238 KB   68/181 KB   12/12 KB   
4/35 KB   238/238 KB   72/181 KB   12/12 KB   
8/35 KB   238/238 KB   72/181 KB   12/12 KB   
8/35 KB   238/238 KB   76/181 KB   12/12 KB   
12/35 KB   238/238 KB   76/181 KB   12/12 KB   
12/35 KB   238/238 KB   80/181 KB   12/12 KB   
16/35 KB   238/238 KB   80/181 KB   12/12 KB   
16/35 KB   238/238 KB   84/181 KB   12/12 KB   
20/35 KB   238/238 KB   84/181 KB   12/12 KB   
20/35 KB   238/238 KB   88/181 KB   12/12 KB   
24/35 KB   238/238 KB   92/181 KB   12/12 KB   
24/35 KB   238/238 KB   92/181 KB   12/12 KB   
28/35 KB   238/238 KB   92/181 KB   12/12 KB   
28/35 KB   238/238 KB   96/181 KB   12/12 KB   
32/35 KB   238/238 KB   100/181 KB   12/12 KB   
32/35 KB   238/238 KB   100/181 KB   12/12 KB   
32/35 KB   238/238 KB   104/181 KB   12/12 KB   
35/35 KB   238/238 KB   104/181 KB   12/12 KB   
35/35 KB   238/238 KB   108/181 KB   12/12 KB   
35/35 KB   238/238 KB   112/181 KB   12/12 KB   
35/35 KB   238/238 KB   116/181 KB   12/12 KB   
35/35 KB   238/238 KB   120/181 KB   12/12 KB   
35/35 KB   238/238 KB   124/181 KB   12/12 KB   
35/35 KB   238/238 KB   128/181 KB   12/12 KB   
35/35 KB   238/238 KB   132/181 KB   12/12 KB   
35/35 KB   238/238 KB   136/181 KB   12/12 KB   
35/35 KB   238/238 KB   140/181 KB   12/12 KB   
35/35 KB   238/238 KB   4/57 KB   140/181 KB   12/12 KB   
35/35 KB   238/238 KB   8/57 KB   140/181 KB   12/12 KB   
35/35 KB   238/238 KB   12/57 KB   140/181 KB   12/12 KB   
35/35 KB   238/238 KB   16/57 KB   140/181 KB   12/12 KB   
35/35 KB   238/238 KB   20/57 KB   140/181 KB   12/12 KB   
35/35 KB   238/238 KB   24/57 KB   140/181 KB   12/12 KB   
35/35 KB   238/238 KB   28/57 KB   140/181 KB   12/12 KB   
35/35 KB   238/238 KB   30/57 KB   140/181 KB   12/12 KB   
35/35 KB   238/238 KB   30/57 KB   144/181 KB   12/12 KB   
35/35 KB   238/238 KB   30/57 KB   148/181 KB   12/12 KB   
35/35 KB   238/238 KB   30/57 KB   152/181 KB   12/12 KB   
35/35 KB   238/238 KB   30/57 KB   153/181 KB   12/12 KB   
35/35 KB   238/238 KB   30/57 KB   157/181 KB   12/12 KB   
35/35 KB   238/238 KB   30/57 KB   161/181 KB   12/12 KB   
35/35 KB   238/238 KB   30/57 KB   165/181 KB   12/12 KB   
35/35 KB   238/238 KB   30/57 KB   169/181 KB   12/12 KB   
35/35 KB   238/238 KB   30/57 KB   173/181 KB   12/12 KB   
35/35 KB   238/238 KB   30/57 KB   177/181 KB   12/12 KB   
35/35 KB   238/238 KB   30/57 KB   181/181 KB   12/12 KB   
35/35 KB   238/238 KB   30/57 KB   181/181 KB   12/12 KB   
                                                           
Downloaded: http://repo.maven.apache.org/maven2/org/codehaus/plexus/plexus-i18n/1.0-beta-6/plexus-i18n-1.0-beta-6.jar
(12 KB at 316.9 KB/sec)
Downloading: http://repo.maven.apache.org/maven2/junit/junit/4.11/junit-4.11.jar
                                                           
Downloaded: http://repo.maven.apache.org/maven2/org/codehaus/plexus/plexus-utils/3.0.20/plexus-utils-3.0.20.jar
(238 KB at 1637.4 KB/sec)
Downloading: http://repo.maven.apache.org/maven2/org/hamcrest/hamcrest-core/1.3/hamcrest-core-1.3.jar
                                                           
Downloaded: http://repo.maven.apache.org/maven2/org/apache/maven/plugin-testing/maven-plugin-testing-harness/1.3/maven-plugin-testing-harness-1.3.jar
(35 KB at 884.3 KB/sec)
34/57 KB   181/181 KB                                      
35/57 KB   181/181 KB   
39/57 KB   181/181 KB   
43/57 KB   181/181 KB   
47/57 KB   181/181 KB   
51/57 KB   181/181 KB   
55/57 KB   181/181 KB   
57/57 KB   181/181 KB   
                        
Downloaded: http://repo.maven.apache.org/maven2/org/codehaus/plexus/plexus-archiver/2.2/plexus-archiver-2.2.jar
(181 KB at 3612.8 KB/sec)
57/57 KB   4/240 KB     
57/57 KB   8/240 KB   
57/57 KB   12/240 KB   
57/57 KB   16/240 KB   
57/57 KB   20/240 KB   
57/57 KB   24/240 KB   
57/57 KB   28/240 KB   
57/57 KB   32/240 KB   
57/57 KB   36/240 KB   
57/57 KB   40/240 KB   
57/57 KB   44/240 KB   
57/57 KB   48/240 KB   
57/57 KB   51/240 KB   
4/44 KB   57/57 KB   51/240 KB   
8/44 KB   57/57 KB   51/240 KB   
12/44 KB   57/57 KB   51/240 KB   
16/44 KB   57/57 KB   51/240 KB   
20/44 KB   57/57 KB   51/240 KB   
23/44 KB   57/57 KB   51/240 KB   
                                  
Downloaded: http://repo.maven.apache.org/maven2/org/codehaus/plexus/plexus-io/2.0.4/plexus-io-2.0.4.jar
(57 KB at 1161.5 KB/sec)
23/44 KB   55/240 KB              
23/44 KB   59/240 KB   
23/44 KB   63/240 KB   
23/44 KB   67/240 KB   
23/44 KB   71/240 KB   
23/44 KB   75/240 KB   
23/44 KB   78/240 KB   
23/44 KB   82/240 KB   
23/44 KB   86/240 KB   
23/44 KB   90/240 KB   
23/44 KB   94/240 KB   
23/44 KB   98/240 KB   
23/44 KB   102/240 KB   
23/44 KB   105/240 KB   
27/44 KB   105/240 KB   
31/44 KB   105/240 KB   
34/44 KB   105/240 KB   
38/44 KB   105/240 KB   
42/44 KB   105/240 KB   
44/44 KB   105/240 KB   
44/44 KB   109/240 KB   
44/44 KB   113/240 KB   
44/44 KB   117/240 KB   
44/44 KB   121/240 KB   
44/44 KB   125/240 KB   
44/44 KB   129/240 KB   
44/44 KB   133/240 KB   
44/44 KB   137/240 KB   
44/44 KB   141/240 KB   
44/44 KB   145/240 KB   
44/44 KB   149/240 KB   
44/44 KB   153/240 KB   
44/44 KB   157/240 KB   
44/44 KB   161/240 KB   
44/44 KB   165/240 KB   
44/44 KB   166/240 KB   
                        
Downloaded: http://repo.maven.apache.org/maven2/org/hamcrest/hamcrest-core/1.3/hamcrest-core-1.3.jar
(44 KB at 845.6 KB/sec)
170/240 KB              
174/240 KB   
178/240 KB   
182/240 KB   
186/240 KB   
190/240 KB   
194/240 KB   
198/240 KB   
202/240 KB   
206/240 KB   
210/240 KB   
214/240 KB   
218/240 KB   
222/240 KB   
226/240 KB   
230/240 KB   
234/240 KB   
236/240 KB   
240/240 KB   
             
Downloaded: http://repo.maven.apache.org/maven2/junit/junit/4.11/junit-4.11.jar (240 KB at
2518.9 KB/sec)
[WARNING] Rule 1: org.apache.maven.plugins.enforcer.RequireMavenVersion failed with message:
Detected Maven Version: 3.0.4 is not in the allowed range [3.3.3,).
[INFO]                                                                         
[INFO] ------------------------------------------------------------------------
[INFO] Skipping Apache Mahout
[INFO] This project has been banned from the build due to previous failures.
[INFO] ------------------------------------------------------------------------
[INFO]                                                                         
[INFO] ------------------------------------------------------------------------
[INFO] Skipping Mahout Build Tools
[INFO] This project has been banned from the build due to previous failures.
[INFO] ------------------------------------------------------------------------
[INFO] ------------------------------------------------------------------------
[INFO] Reactor Summary:
[INFO] 
[INFO] Mahout Build Tools ................................ FAILURE [2.900s]
[INFO] Apache Mahout ..................................... SKIPPED
[INFO] Mahout Math ....................................... SKIPPED
[INFO] Mahout HDFS ....................................... SKIPPED
[INFO] Mahout Map-Reduce ................................. SKIPPED
[INFO] Mahout Integration ................................ SKIPPED
[INFO] Mahout Examples ................................... SKIPPED
[INFO] Mahout Math Scala bindings ........................ SKIPPED
[INFO] Mahout H2O backend ................................ SKIPPED
[INFO] Mahout Spark bindings ............................. SKIPPED
[INFO] Mahout Spark bindings shell ....................... SKIPPED
[INFO] Mahout Release Package ............................ SKIPPED
[INFO] ------------------------------------------------------------------------
[INFO] BUILD FAILURE
[INFO] ------------------------------------------------------------------------
[INFO] Total time: 9.010s
[INFO] Finished at: Thu Aug 06 04:48:21 UTC 2015
[INFO] Final Memory: 20M/308M
[INFO] ------------------------------------------------------------------------
[ERROR] Failed to execute goal org.apache.maven.plugins:maven-enforcer-plugin:1.4:enforce
(enforce-versions) on project mahout-buildtools: Some Enforcer rules have failed. Look above
for specific messages explaining why the rule failed. -> [Help 1]
[ERROR] 
[ERROR] To see the full stack trace of the errors, re-run Maven with the -e switch.
[ERROR] Re-run Maven using the -X switch to enable full debug logging.
[ERROR] 
[ERROR] For more information about the errors and possible solutions, please read the following
articles:
[ERROR] [Help 1] http://cwiki.apache.org/confluence/display/MAVEN/MojoExecutionException
Build step 'Invoke top-level Maven targets' marked build as failure
[PMD] Skipping publisher since build result is FAILURE
[TASKS] Skipping publisher since build result is FAILURE
Archiving artifacts
Recording test results
Publishing Javadoc

Mime
View raw message