mahout-dev mailing list archives

Site index · List index
Message view « Date » · « Thread »
Top « Date » · « Thread »
From Apache Jenkins Server <jenk...@builds.apache.org>
Subject Build failed in Jenkins: Mahout-Examples-Cluster-Reuters-II #1279
Date Sun, 16 Aug 2015 18:18:37 GMT
See <https://builds.apache.org/job/Mahout-Examples-Cluster-Reuters-II/1279/>

------------------------------------------
[...truncated 310 lines...]
	at org.tmatesoft.svn.core.internal.io.dav.DAVRepository.openConnection(DAVRepository.java:1020)
	at org.tmatesoft.svn.core.internal.io.dav.DAVRepository.getLatestRevision(DAVRepository.java:180)
	at org.tmatesoft.svn.core.internal.wc16.SVNBasicDelegate.getRevisionNumber(SVNBasicDelegate.java:480)
	at org.tmatesoft.svn.core.internal.wc16.SVNBasicDelegate.getLocations(SVNBasicDelegate.java:833)
	at org.tmatesoft.svn.core.internal.wc16.SVNBasicDelegate.createRepository(SVNBasicDelegate.java:527)
	at org.tmatesoft.svn.core.internal.wc16.SVNUpdateClient16.doCheckout(SVNUpdateClient16.java:875)
	at org.tmatesoft.svn.core.internal.wc2.old.SvnOldCheckout.run(SvnOldCheckout.java:19)
	at org.tmatesoft.svn.core.internal.wc2.old.SvnOldCheckout.run(SvnOldCheckout.java:8)
	at org.tmatesoft.svn.core.internal.wc2.SvnOperationRunner.run(SvnOperationRunner.java:20)
	at org.tmatesoft.svn.core.wc2.SvnOperationFactory.run(SvnOperationFactory.java:1238)
	at org.tmatesoft.svn.core.wc2.SvnOperation.run(SvnOperation.java:294)
	at org.tmatesoft.svn.core.wc.SVNUpdateClient.doCheckout(SVNUpdateClient.java:777)
	at hudson.scm.subversion.CheckoutUpdater$1.perform(CheckoutUpdater.java:99)
	... 14 more
Caused by: svn: E175002: OPTIONS /repos/asf/mahout/trunk failed
	at org.tmatesoft.svn.core.SVNErrorMessage.create(SVNErrorMessage.java:208)
	at org.tmatesoft.svn.core.SVNErrorMessage.create(SVNErrorMessage.java:154)
	at org.tmatesoft.svn.core.SVNErrorMessage.create(SVNErrorMessage.java:97)
	... 33 more
Caused by: org.tmatesoft.svn.core.SVNException: svn: E175002: OPTIONS request failed on '/repos/asf/mahout/trunk'
svn: E175002: java.lang.RuntimeException: Could not generate DH keypair
	at org.tmatesoft.svn.core.internal.wc.SVNErrorManager.error(SVNErrorManager.java:64)
	at org.tmatesoft.svn.core.internal.wc.SVNErrorManager.error(SVNErrorManager.java:51)
	at org.tmatesoft.svn.core.internal.io.dav.http.HTTPConnection._request(HTTPConnection.java:777)
	at org.tmatesoft.svn.core.internal.io.dav.http.HTTPConnection.request(HTTPConnection.java:382)
	... 32 more
Caused by: svn: E175002: OPTIONS request failed on '/repos/asf/mahout/trunk'
	at org.tmatesoft.svn.core.SVNErrorMessage.create(SVNErrorMessage.java:208)
	at org.tmatesoft.svn.core.internal.io.dav.http.HTTPConnection._request(HTTPConnection.java:775)
	... 33 more
Caused by: svn: E175002: java.lang.RuntimeException: Could not generate DH keypair
	at org.tmatesoft.svn.core.SVNErrorMessage.create(SVNErrorMessage.java:109)
	at org.tmatesoft.svn.core.internal.io.dav.http.HTTPConnection._request(HTTPConnection.java:526)
	... 33 more
Caused by: javax.net.ssl.SSLException: java.lang.RuntimeException: Could not generate DH keypair
	at com.sun.net.ssl.internal.ssl.Alerts.getSSLException(Alerts.java:190)
	at com.sun.net.ssl.internal.ssl.SSLSocketImpl.fatal(SSLSocketImpl.java:1649)
	at com.sun.net.ssl.internal.ssl.SSLSocketImpl.fatal(SSLSocketImpl.java:1612)
	at com.sun.net.ssl.internal.ssl.SSLSocketImpl.handleException(SSLSocketImpl.java:1595)
	at com.sun.net.ssl.internal.ssl.SSLSocketImpl.handleException(SSLSocketImpl.java:1521)
	at com.sun.net.ssl.internal.ssl.AppOutputStream.write(AppOutputStream.java:64)
	at java.io.BufferedOutputStream.flushBuffer(BufferedOutputStream.java:65)
	at java.io.BufferedOutputStream.flush(BufferedOutputStream.java:123)
	at org.tmatesoft.svn.core.internal.io.dav.http.HTTPConnection.sendData(HTTPConnection.java:323)
	at org.tmatesoft.svn.core.internal.io.dav.http.HTTPRequest.dispatch(HTTPRequest.java:170)
	at org.tmatesoft.svn.core.internal.io.dav.http.HTTPConnection._request(HTTPConnection.java:480)
	... 33 more
Caused by: java.lang.RuntimeException: Could not generate DH keypair
	at com.sun.net.ssl.internal.ssl.DHCrypt.<init>(DHCrypt.java:106)
	at com.sun.net.ssl.internal.ssl.ClientHandshaker.serverKeyExchange(ClientHandshaker.java:556)
	at com.sun.net.ssl.internal.ssl.ClientHandshaker.processMessage(ClientHandshaker.java:183)
	at com.sun.net.ssl.internal.ssl.Handshaker.processLoop(Handshaker.java:593)
	at com.sun.net.ssl.internal.ssl.Handshaker.process_record(Handshaker.java:529)
	at com.sun.net.ssl.internal.ssl.SSLSocketImpl.readRecord(SSLSocketImpl.java:893)
	at com.sun.net.ssl.internal.ssl.SSLSocketImpl.performInitialHandshake(SSLSocketImpl.java:1138)
	at com.sun.net.ssl.internal.ssl.SSLSocketImpl.writeRecord(SSLSocketImpl.java:632)
	at com.sun.net.ssl.internal.ssl.AppOutputStream.write(AppOutputStream.java:59)
	... 38 more
Caused by: java.security.InvalidAlgorithmParameterException: Prime size must be multiple of
64, and can only range from 512 to 1024 (inclusive)
	at com.sun.crypto.provider.DHKeyPairGenerator.initialize(DashoA13*..)
	at java.security.KeyPairGenerator$Delegate.initialize(KeyPairGenerator.java:627)
	at com.sun.net.ssl.internal.ssl.DHCrypt.<init>(DHCrypt.java:100)
	... 46 more
Retrying after 10 seconds
Cleaning local Directory trunk
Checking out https://svn.apache.org/repos/asf/mahout/trunk at revision '2015-08-16T18:15:54.720
+0000'
ERROR: Failed to check out https://svn.apache.org/repos/asf/mahout/trunk
org.tmatesoft.svn.core.SVNException: svn: E175002: OPTIONS /repos/asf/mahout/trunk failed
	at org.tmatesoft.svn.core.internal.io.dav.http.HTTPConnection.request(HTTPConnection.java:388)
	at org.tmatesoft.svn.core.internal.io.dav.http.HTTPConnection.request(HTTPConnection.java:373)
	at org.tmatesoft.svn.core.internal.io.dav.http.HTTPConnection.request(HTTPConnection.java:361)
	at org.tmatesoft.svn.core.internal.io.dav.DAVConnection.performHttpRequest(DAVConnection.java:707)
	at org.tmatesoft.svn.core.internal.io.dav.DAVConnection.exchangeCapabilities(DAVConnection.java:627)
	at org.tmatesoft.svn.core.internal.io.dav.DAVConnection.open(DAVConnection.java:102)
	at org.tmatesoft.svn.core.internal.io.dav.DAVRepository.openConnection(DAVRepository.java:1020)
	at org.tmatesoft.svn.core.internal.io.dav.DAVRepository.getLatestRevision(DAVRepository.java:180)
	at org.tmatesoft.svn.core.internal.wc16.SVNBasicDelegate.getRevisionNumber(SVNBasicDelegate.java:480)
	at org.tmatesoft.svn.core.internal.wc16.SVNBasicDelegate.getLocations(SVNBasicDelegate.java:833)
	at org.tmatesoft.svn.core.internal.wc16.SVNBasicDelegate.createRepository(SVNBasicDelegate.java:527)
	at org.tmatesoft.svn.core.internal.wc16.SVNUpdateClient16.doCheckout(SVNUpdateClient16.java:875)
	at org.tmatesoft.svn.core.internal.wc2.old.SvnOldCheckout.run(SvnOldCheckout.java:19)
	at org.tmatesoft.svn.core.internal.wc2.old.SvnOldCheckout.run(SvnOldCheckout.java:8)
	at org.tmatesoft.svn.core.internal.wc2.SvnOperationRunner.run(SvnOperationRunner.java:20)
	at org.tmatesoft.svn.core.wc2.SvnOperationFactory.run(SvnOperationFactory.java:1238)
	at org.tmatesoft.svn.core.wc2.SvnOperation.run(SvnOperation.java:294)
	at org.tmatesoft.svn.core.wc.SVNUpdateClient.doCheckout(SVNUpdateClient.java:777)
	at hudson.scm.subversion.CheckoutUpdater$1.perform(CheckoutUpdater.java:99)
	at hudson.scm.subversion.WorkspaceUpdater$UpdateTask.delegateTo(WorkspaceUpdater.java:161)
	at hudson.scm.SubversionSCM$CheckOutTask.perform(SubversionSCM.java:1030)
	at hudson.scm.SubversionSCM$CheckOutTask.invoke(SubversionSCM.java:1011)
	at hudson.scm.SubversionSCM$CheckOutTask.invoke(SubversionSCM.java:987)
	at hudson.FilePath$FileCallableWrapper.call(FilePath.java:2474)
	at hudson.remoting.UserRequest.perform(UserRequest.java:118)
	at hudson.remoting.UserRequest.perform(UserRequest.java:48)
	at hudson.remoting.Request$2.run(Request.java:328)
	at hudson.remoting.InterceptingExecutorService$1.call(InterceptingExecutorService.java:72)
	at java.util.concurrent.FutureTask$Sync.innerRun(FutureTask.java:303)
	at java.util.concurrent.FutureTask.run(FutureTask.java:138)
	at java.util.concurrent.ThreadPoolExecutor$Worker.runTask(ThreadPoolExecutor.java:886)
	at java.util.concurrent.ThreadPoolExecutor$Worker.run(ThreadPoolExecutor.java:908)
	at java.lang.Thread.run(Thread.java:662)
Caused by: svn: E175002: OPTIONS /repos/asf/mahout/trunk failed
	at org.tmatesoft.svn.core.SVNErrorMessage.create(SVNErrorMessage.java:208)
	at org.tmatesoft.svn.core.SVNErrorMessage.create(SVNErrorMessage.java:154)
	at org.tmatesoft.svn.core.SVNErrorMessage.create(SVNErrorMessage.java:97)
	... 33 more
Caused by: org.tmatesoft.svn.core.SVNException: svn: E175002: OPTIONS request failed on '/repos/asf/mahout/trunk'
svn: E175002: java.lang.RuntimeException: Could not generate DH keypair
	at org.tmatesoft.svn.core.internal.wc.SVNErrorManager.error(SVNErrorManager.java:64)
	at org.tmatesoft.svn.core.internal.wc.SVNErrorManager.error(SVNErrorManager.java:51)
	at org.tmatesoft.svn.core.internal.io.dav.http.HTTPConnection._request(HTTPConnection.java:777)
	at org.tmatesoft.svn.core.internal.io.dav.http.HTTPConnection.request(HTTPConnection.java:382)
	... 32 more
Caused by: svn: E175002: OPTIONS request failed on '/repos/asf/mahout/trunk'
	at org.tmatesoft.svn.core.SVNErrorMessage.create(SVNErrorMessage.java:208)
	at org.tmatesoft.svn.core.internal.io.dav.http.HTTPConnection._request(HTTPConnection.java:775)
	... 33 more
Caused by: svn: E175002: java.lang.RuntimeException: Could not generate DH keypair
	at org.tmatesoft.svn.core.SVNErrorMessage.create(SVNErrorMessage.java:109)
	at org.tmatesoft.svn.core.internal.io.dav.http.HTTPConnection._request(HTTPConnection.java:526)
	... 33 more
Caused by: javax.net.ssl.SSLException: java.lang.RuntimeException: Could not generate DH keypair
	at com.sun.net.ssl.internal.ssl.Alerts.getSSLException(Alerts.java:190)
	at com.sun.net.ssl.internal.ssl.SSLSocketImpl.fatal(SSLSocketImpl.java:1649)
	at com.sun.net.ssl.internal.ssl.SSLSocketImpl.fatal(SSLSocketImpl.java:1612)
	at com.sun.net.ssl.internal.ssl.SSLSocketImpl.handleException(SSLSocketImpl.java:1595)
	at com.sun.net.ssl.internal.ssl.SSLSocketImpl.handleException(SSLSocketImpl.java:1521)
	at com.sun.net.ssl.internal.ssl.AppOutputStream.write(AppOutputStream.java:64)
	at java.io.BufferedOutputStream.flushBuffer(BufferedOutputStream.java:65)
	at java.io.BufferedOutputStream.flush(BufferedOutputStream.java:123)
	at org.tmatesoft.svn.core.internal.io.dav.http.HTTPConnection.sendData(HTTPConnection.java:323)
	at org.tmatesoft.svn.core.internal.io.dav.http.HTTPRequest.dispatch(HTTPRequest.java:170)
	at org.tmatesoft.svn.core.internal.io.dav.http.HTTPConnection._request(HTTPConnection.java:480)
	... 33 more
Caused by: java.lang.RuntimeException: Could not generate DH keypair
	at com.sun.net.ssl.internal.ssl.DHCrypt.<init>(DHCrypt.java:106)
	at com.sun.net.ssl.internal.ssl.ClientHandshaker.serverKeyExchange(ClientHandshaker.java:556)
	at com.sun.net.ssl.internal.ssl.ClientHandshaker.processMessage(ClientHandshaker.java:183)
	at com.sun.net.ssl.internal.ssl.Handshaker.processLoop(Handshaker.java:593)
	at com.sun.net.ssl.internal.ssl.Handshaker.process_record(Handshaker.java:529)
	at com.sun.net.ssl.internal.ssl.SSLSocketImpl.readRecord(SSLSocketImpl.java:893)
	at com.sun.net.ssl.internal.ssl.SSLSocketImpl.performInitialHandshake(SSLSocketImpl.java:1138)
	at com.sun.net.ssl.internal.ssl.SSLSocketImpl.writeRecord(SSLSocketImpl.java:632)
	at com.sun.net.ssl.internal.ssl.AppOutputStream.write(AppOutputStream.java:59)
	... 38 more
Caused by: java.security.InvalidAlgorithmParameterException: Prime size must be multiple of
64, and can only range from 512 to 1024 (inclusive)
	at com.sun.crypto.provider.DHKeyPairGenerator.initialize(DashoA13*..)
	at java.security.KeyPairGenerator$Delegate.initialize(KeyPairGenerator.java:627)
	at com.sun.net.ssl.internal.ssl.DHCrypt.<init>(DHCrypt.java:100)
	... 46 more
java.io.IOException: remote file operation failed: <https://builds.apache.org/job/Mahout-Examples-Cluster-Reuters-II/ws/>
at hudson.remoting.Channel@1779fa19:solaris1
	at hudson.FilePath.act(FilePath.java:916)
	at hudson.FilePath.act(FilePath.java:893)
	at hudson.scm.SubversionSCM.checkout(SubversionSCM.java:936)
	at hudson.scm.SubversionSCM.checkout(SubversionSCM.java:871)
	at hudson.model.AbstractProject.checkout(AbstractProject.java:1252)
	at hudson.model.AbstractBuild$AbstractBuildExecution.defaultCheckout(AbstractBuild.java:615)
	at jenkins.scm.SCMCheckoutStrategy.checkout(SCMCheckoutStrategy.java:86)
	at hudson.model.AbstractBuild$AbstractBuildExecution.run(AbstractBuild.java:524)
	at hudson.model.Run.execute(Run.java:1706)
	at hudson.model.FreeStyleBuild.run(FreeStyleBuild.java:43)
	at hudson.model.ResourceController.execute(ResourceController.java:88)
	at hudson.model.Executor.run(Executor.java:232)
Caused by: java.io.IOException: Failed to check out https://svn.apache.org/repos/asf/mahout/trunk
	at hudson.scm.subversion.CheckoutUpdater$1.perform(CheckoutUpdater.java:110)
	at hudson.scm.subversion.WorkspaceUpdater$UpdateTask.delegateTo(WorkspaceUpdater.java:161)
	at hudson.scm.SubversionSCM$CheckOutTask.perform(SubversionSCM.java:1030)
	at hudson.scm.SubversionSCM$CheckOutTask.invoke(SubversionSCM.java:1011)
	at hudson.scm.SubversionSCM$CheckOutTask.invoke(SubversionSCM.java:987)
	at hudson.FilePath$FileCallableWrapper.call(FilePath.java:2474)
	at hudson.remoting.UserRequest.perform(UserRequest.java:118)
	at hudson.remoting.UserRequest.perform(UserRequest.java:48)
	at hudson.remoting.Request$2.run(Request.java:328)
	at hudson.remoting.InterceptingExecutorService$1.call(InterceptingExecutorService.java:72)
	at java.util.concurrent.FutureTask$Sync.innerRun(FutureTask.java:303)
	at java.util.concurrent.FutureTask.run(FutureTask.java:138)
	at java.util.concurrent.ThreadPoolExecutor$Worker.runTask(ThreadPoolExecutor.java:886)
	at java.util.concurrent.ThreadPoolExecutor$Worker.run(ThreadPoolExecutor.java:908)
	at java.lang.Thread.run(Thread.java:662)
Caused by: org.tmatesoft.svn.core.SVNException: svn: E175002: OPTIONS /repos/asf/mahout/trunk
failed
	at org.tmatesoft.svn.core.internal.io.dav.http.HTTPConnection.request(HTTPConnection.java:388)
	at org.tmatesoft.svn.core.internal.io.dav.http.HTTPConnection.request(HTTPConnection.java:373)
	at org.tmatesoft.svn.core.internal.io.dav.http.HTTPConnection.request(HTTPConnection.java:361)
	at org.tmatesoft.svn.core.internal.io.dav.DAVConnection.performHttpRequest(DAVConnection.java:707)
	at org.tmatesoft.svn.core.internal.io.dav.DAVConnection.exchangeCapabilities(DAVConnection.java:627)
	at org.tmatesoft.svn.core.internal.io.dav.DAVConnection.open(DAVConnection.java:102)
	at org.tmatesoft.svn.core.internal.io.dav.DAVRepository.openConnection(DAVRepository.java:1020)
	at org.tmatesoft.svn.core.internal.io.dav.DAVRepository.getLatestRevision(DAVRepository.java:180)
	at org.tmatesoft.svn.core.internal.wc16.SVNBasicDelegate.getRevisionNumber(SVNBasicDelegate.java:480)
	at org.tmatesoft.svn.core.internal.wc16.SVNBasicDelegate.getLocations(SVNBasicDelegate.java:833)
	at org.tmatesoft.svn.core.internal.wc16.SVNBasicDelegate.createRepository(SVNBasicDelegate.java:527)
	at org.tmatesoft.svn.core.internal.wc16.SVNUpdateClient16.doCheckout(SVNUpdateClient16.java:875)
	at org.tmatesoft.svn.core.internal.wc2.old.SvnOldCheckout.run(SvnOldCheckout.java:19)
	at org.tmatesoft.svn.core.internal.wc2.old.SvnOldCheckout.run(SvnOldCheckout.java:8)
	at org.tmatesoft.svn.core.internal.wc2.SvnOperationRunner.run(SvnOperationRunner.java:20)
	at org.tmatesoft.svn.core.wc2.SvnOperationFactory.run(SvnOperationFactory.java:1238)
	at org.tmatesoft.svn.core.wc2.SvnOperation.run(SvnOperation.java:294)
	at org.tmatesoft.svn.core.wc.SVNUpdateClient.doCheckout(SVNUpdateClient.java:777)
	at hudson.scm.subversion.CheckoutUpdater$1.perform(CheckoutUpdater.java:99)
	... 14 more
Caused by: svn: E175002: OPTIONS /repos/asf/mahout/trunk failed
	at org.tmatesoft.svn.core.SVNErrorMessage.create(SVNErrorMessage.java:208)
	at org.tmatesoft.svn.core.SVNErrorMessage.create(SVNErrorMessage.java:154)
	at org.tmatesoft.svn.core.SVNErrorMessage.create(SVNErrorMessage.java:97)
	... 33 more
Caused by: org.tmatesoft.svn.core.SVNException: svn: E175002: OPTIONS request failed on '/repos/asf/mahout/trunk'
svn: E175002: java.lang.RuntimeException: Could not generate DH keypair
	at org.tmatesoft.svn.core.internal.wc.SVNErrorManager.error(SVNErrorManager.java:64)
	at org.tmatesoft.svn.core.internal.wc.SVNErrorManager.error(SVNErrorManager.java:51)
	at org.tmatesoft.svn.core.internal.io.dav.http.HTTPConnection._request(HTTPConnection.java:777)
	at org.tmatesoft.svn.core.internal.io.dav.http.HTTPConnection.request(HTTPConnection.java:382)
	... 32 more
Caused by: svn: E175002: OPTIONS request failed on '/repos/asf/mahout/trunk'
	at org.tmatesoft.svn.core.SVNErrorMessage.create(SVNErrorMessage.java:208)
	at org.tmatesoft.svn.core.internal.io.dav.http.HTTPConnection._request(HTTPConnection.java:775)
	... 33 more
Caused by: svn: E175002: java.lang.RuntimeException: Could not generate DH keypair
	at org.tmatesoft.svn.core.SVNErrorMessage.create(SVNErrorMessage.java:109)
	at org.tmatesoft.svn.core.internal.io.dav.http.HTTPConnection._request(HTTPConnection.java:526)
	... 33 more
Caused by: javax.net.ssl.SSLException: java.lang.RuntimeException: Could not generate DH keypair
	at com.sun.net.ssl.internal.ssl.Alerts.getSSLException(Alerts.java:190)
	at com.sun.net.ssl.internal.ssl.SSLSocketImpl.fatal(SSLSocketImpl.java:1649)
	at com.sun.net.ssl.internal.ssl.SSLSocketImpl.fatal(SSLSocketImpl.java:1612)
	at com.sun.net.ssl.internal.ssl.SSLSocketImpl.handleException(SSLSocketImpl.java:1595)
	at com.sun.net.ssl.internal.ssl.SSLSocketImpl.handleException(SSLSocketImpl.java:1521)
	at com.sun.net.ssl.internal.ssl.AppOutputStream.write(AppOutputStream.java:64)
	at java.io.BufferedOutputStream.flushBuffer(BufferedOutputStream.java:65)
	at java.io.BufferedOutputStream.flush(BufferedOutputStream.java:123)
	at org.tmatesoft.svn.core.internal.io.dav.http.HTTPConnection.sendData(HTTPConnection.java:323)
	at org.tmatesoft.svn.core.internal.io.dav.http.HTTPRequest.dispatch(HTTPRequest.java:170)
	at org.tmatesoft.svn.core.internal.io.dav.http.HTTPConnection._request(HTTPConnection.java:480)
	... 33 more
Caused by: java.lang.RuntimeException: Could not generate DH keypair
	at com.sun.net.ssl.internal.ssl.DHCrypt.<init>(DHCrypt.java:106)
	at com.sun.net.ssl.internal.ssl.ClientHandshaker.serverKeyExchange(ClientHandshaker.java:556)
	at com.sun.net.ssl.internal.ssl.ClientHandshaker.processMessage(ClientHandshaker.java:183)
	at com.sun.net.ssl.internal.ssl.Handshaker.processLoop(Handshaker.java:593)
	at com.sun.net.ssl.internal.ssl.Handshaker.process_record(Handshaker.java:529)
	at com.sun.net.ssl.internal.ssl.SSLSocketImpl.readRecord(SSLSocketImpl.java:893)
	at com.sun.net.ssl.internal.ssl.SSLSocketImpl.performInitialHandshake(SSLSocketImpl.java:1138)
	at com.sun.net.ssl.internal.ssl.SSLSocketImpl.writeRecord(SSLSocketImpl.java:632)
	at com.sun.net.ssl.internal.ssl.AppOutputStream.write(AppOutputStream.java:59)
	... 38 more
Caused by: java.security.InvalidAlgorithmParameterException: Prime size must be multiple of
64, and can only range from 512 to 1024 (inclusive)
	at com.sun.crypto.provider.DHKeyPairGenerator.initialize(DashoA13*..)
	at java.security.KeyPairGenerator$Delegate.initialize(KeyPairGenerator.java:627)
	at com.sun.net.ssl.internal.ssl.DHCrypt.<init>(DHCrypt.java:100)
	... 46 more

Mime
View raw message