mahout-dev mailing list archives

Site index · List index
Message view « Date » · « Thread »
Top « Date » · « Thread »
From Apache Jenkins Server <jenk...@builds.apache.org>
Subject Build failed in Jenkins: mahout-nightly #1863
Date Sat, 14 Mar 2015 23:34:57 GMT
See <https://builds.apache.org/job/mahout-nightly/1863/>

------------------------------------------
[...truncated 4145 lines...]
[WARNING] No source files found.
[INFO] 
[INFO] --- maven-surefire-plugin:2.16:test (default-test) @ mahout-spark-shell_2.10 ---
[JENKINS] Recording test results
[INFO] 
[INFO] --- scalatest-maven-plugin:1.0-M2:test (test) @ mahout-spark-shell_2.10 ---
WARNING: -p has been deprecated and will be reused for a different (but still very cool) purpose
in ScalaTest 2.0. Please change all uses of -p to -R.
Discovery starting.
Discovery completed in 120 milliseconds.
Run starting. Expected test count is: 0
DiscoverySuite:
Run completed in 211 milliseconds.
Total number of tests run: 0
Suites: completed 1, aborted 0
Tests: succeeded 0, failed 0, canceled 0, ignored 0, pending 0
All tests passed.
[JENKINS] Recording test results
[INFO] 
[INFO] --- build-helper-maven-plugin:1.8:remove-project-artifact (remove-old-mahout-artifacts)
@ mahout-spark-shell_2.10 ---
[INFO] /home/jenkins/jenkins-slave/maven-repositories/0/org/apache/mahout/mahout-spark-shell_2.10
removed.
[INFO] 
[INFO] --- maven-jar-plugin:2.4:jar (default-jar) @ mahout-spark-shell_2.10 ---
[INFO] Building jar: <https://builds.apache.org/job/mahout-nightly/ws/spark-shell/target/mahout-spark-shell_2.10-1.0-SNAPSHOT.jar>
[INFO] 
[INFO] --- maven-jar-plugin:2.4:test-jar (default) @ mahout-spark-shell_2.10 ---
[INFO] Building jar: <https://builds.apache.org/job/mahout-nightly/ws/spark-shell/target/mahout-spark-shell_2.10-1.0-SNAPSHOT-tests.jar>
[INFO] 
[INFO] --- maven-source-plugin:2.2.1:jar-no-fork (attach-sources) @ mahout-spark-shell_2.10
---
[INFO] Building jar: <https://builds.apache.org/job/mahout-nightly/ws/spark-shell/target/mahout-spark-shell_2.10-1.0-SNAPSHOT-sources.jar>
[INFO] 
[INFO] --- maven-install-plugin:2.5.1:install (default-install) @ mahout-spark-shell_2.10
---
[INFO] Installing <https://builds.apache.org/job/mahout-nightly/ws/spark-shell/target/mahout-spark-shell_2.10-1.0-SNAPSHOT.jar>
to /home/jenkins/jenkins-slave/maven-repositories/0/org/apache/mahout/mahout-spark-shell_2.10/1.0-SNAPSHOT/mahout-spark-shell_2.10-1.0-SNAPSHOT.jar
[INFO] Installing <https://builds.apache.org/job/mahout-nightly/ws/spark-shell/pom.xml>
to /home/jenkins/jenkins-slave/maven-repositories/0/org/apache/mahout/mahout-spark-shell_2.10/1.0-SNAPSHOT/mahout-spark-shell_2.10-1.0-SNAPSHOT.pom
[INFO] Installing <https://builds.apache.org/job/mahout-nightly/ws/spark-shell/target/mahout-spark-shell_2.10-1.0-SNAPSHOT-tests.jar>
to /home/jenkins/jenkins-slave/maven-repositories/0/org/apache/mahout/mahout-spark-shell_2.10/1.0-SNAPSHOT/mahout-spark-shell_2.10-1.0-SNAPSHOT-tests.jar
[INFO] Installing <https://builds.apache.org/job/mahout-nightly/ws/spark-shell/target/mahout-spark-shell_2.10-1.0-SNAPSHOT-sources.jar>
to /home/jenkins/jenkins-slave/maven-repositories/0/org/apache/mahout/mahout-spark-shell_2.10/1.0-SNAPSHOT/mahout-spark-shell_2.10-1.0-SNAPSHOT-sources.jar
[INFO] 
[INFO] --- build-helper-maven-plugin:1.8:add-source (add-source) @ mahout-spark-shell_2.10
---
[INFO] Source directory: <https://builds.apache.org/job/mahout-nightly/ws/spark-shell/target/generated-sources/mahout>
added.
[INFO] 
[INFO] --- build-helper-maven-plugin:1.8:add-test-source (add-test-source) @ mahout-spark-shell_2.10
---
[INFO] Test Source directory: <https://builds.apache.org/job/mahout-nightly/ws/spark-shell/target/generated-test-sources/mahout>
added.
[INFO] 
[INFO] --- maven-resources-plugin:2.6:resources (default-resources) @ mahout-spark-shell_2.10
---
[INFO] Using 'UTF-8' encoding to copy filtered resources.
[INFO] skip non existing resourceDirectory <https://builds.apache.org/job/mahout-nightly/ws/spark-shell/src/main/resources>
[INFO] 
[INFO] --- maven-compiler-plugin:3.1:compile (default-compile) @ mahout-spark-shell_2.10 ---
[INFO] Nothing to compile - all classes are up to date
[INFO] 
[INFO] --- maven-scala-plugin:2.15.2:compile (default) @ mahout-spark-shell_2.10 ---
[INFO] Checking for multiple versions of scala
[WARNING]  Expected all dependencies to require Scala version: 2.10.4
[WARNING]  com.twitter:chill_2.10:0.3.6 requires scala version: 2.10.3
[WARNING] Multiple versions of scala libraries detected!
[INFO] includes = [**/*.scala,**/*.java,]
[INFO] excludes = []
[INFO] Nothing to compile - all classes are up to date
[INFO] 
[INFO] --- maven-resources-plugin:2.6:testResources (default-testResources) @ mahout-spark-shell_2.10
---
[INFO] Using 'UTF-8' encoding to copy filtered resources.
[INFO] skip non existing resourceDirectory <https://builds.apache.org/job/mahout-nightly/ws/spark-shell/src/test/resources>
[INFO] 
[INFO] --- maven-compiler-plugin:3.1:testCompile (default-testCompile) @ mahout-spark-shell_2.10
---
[INFO] No sources to compile
[INFO] 
[INFO] --- maven-scala-plugin:2.15.2:testCompile (default) @ mahout-spark-shell_2.10 ---
[INFO] Checking for multiple versions of scala
[WARNING]  Expected all dependencies to require Scala version: 2.10.4
[WARNING]  com.twitter:chill_2.10:0.3.6 requires scala version: 2.10.3
[WARNING] Multiple versions of scala libraries detected!
[INFO] includes = [**/*.scala,**/*.java,]
[INFO] excludes = []
[WARNING] No source files found.
[INFO] 
[INFO] --- maven-surefire-plugin:2.16:test (default-test) @ mahout-spark-shell_2.10 ---
[INFO] Skipping execution of surefire because it has already been run for this configuration
[JENKINS] Recording test results[INFO] 
[INFO] --- scalatest-maven-plugin:1.0-M2:test (test) @ mahout-spark-shell_2.10 ---

WARNING: -p has been deprecated and will be reused for a different (but still very cool) purpose
in ScalaTest 2.0. Please change all uses of -p to -R.
Discovery starting.
Discovery completed in 119 milliseconds.
Run starting. Expected test count is: 0
DiscoverySuite:
Run completed in 213 milliseconds.
Total number of tests run: 0
Suites: completed 1, aborted 0
Tests: succeeded 0, failed 0, canceled 0, ignored 0, pending 0
All tests passed.
[JENKINS] Recording test results
[INFO] 
[INFO] --- build-helper-maven-plugin:1.8:remove-project-artifact (remove-old-mahout-artifacts)
@ mahout-spark-shell_2.10 ---
[INFO] /home/jenkins/jenkins-slave/maven-repositories/0/org/apache/mahout/mahout-spark-shell_2.10
removed.
[INFO] 
[INFO] --- maven-jar-plugin:2.4:jar (default-jar) @ mahout-spark-shell_2.10 ---
[INFO] 
[INFO] --- maven-jar-plugin:2.4:test-jar (default) @ mahout-spark-shell_2.10 ---
[WARNING] Artifact org.apache.mahout:mahout-spark-shell_2.10:test-jar:tests:1.0-SNAPSHOT already
attached to project, ignoring duplicate
[INFO] 
[INFO] --- maven-source-plugin:2.2.1:jar-no-fork (attach-sources) @ mahout-spark-shell_2.10
---
[WARNING] Artifact org.apache.mahout:mahout-spark-shell_2.10:java-source:sources:1.0-SNAPSHOT
already attached to project, ignoring duplicate
[INFO] 
[INFO] --- maven-install-plugin:2.5.1:install (default-install) @ mahout-spark-shell_2.10
---
[INFO] Installing <https://builds.apache.org/job/mahout-nightly/ws/spark-shell/target/mahout-spark-shell_2.10-1.0-SNAPSHOT.jar>
to /home/jenkins/jenkins-slave/maven-repositories/0/org/apache/mahout/mahout-spark-shell_2.10/1.0-SNAPSHOT/mahout-spark-shell_2.10-1.0-SNAPSHOT.jar
[INFO] Installing <https://builds.apache.org/job/mahout-nightly/ws/spark-shell/pom.xml>
to /home/jenkins/jenkins-slave/maven-repositories/0/org/apache/mahout/mahout-spark-shell_2.10/1.0-SNAPSHOT/mahout-spark-shell_2.10-1.0-SNAPSHOT.pom
[INFO] Installing <https://builds.apache.org/job/mahout-nightly/ws/spark-shell/target/mahout-spark-shell_2.10-1.0-SNAPSHOT-tests.jar>
to /home/jenkins/jenkins-slave/maven-repositories/0/org/apache/mahout/mahout-spark-shell_2.10/1.0-SNAPSHOT/mahout-spark-shell_2.10-1.0-SNAPSHOT-tests.jar
[INFO] Installing <https://builds.apache.org/job/mahout-nightly/ws/spark-shell/target/mahout-spark-shell_2.10-1.0-SNAPSHOT-sources.jar>
to /home/jenkins/jenkins-slave/maven-repositories/0/org/apache/mahout/mahout-spark-shell_2.10/1.0-SNAPSHOT/mahout-spark-shell_2.10-1.0-SNAPSHOT-sources.jar
[INFO] 
[INFO] --- maven-deploy-plugin:2.5:deploy (default-deploy) @ mahout-spark-shell_2.10 ---
Downloading: https://repository.apache.org/content/repositories/snapshots/org/apache/mahout/mahout-spark-shell_2.10/1.0-SNAPSHOT/maven-metadata.xml
[WARNING] Could not transfer metadata org.apache.mahout:mahout-spark-shell_2.10:1.0-SNAPSHOT/maven-metadata.xml
from/to apache.snapshots.https (https://repository.apache.org/content/repositories/snapshots):
Failed to transfer file: https://repository.apache.org/content/repositories/snapshots/org/apache/mahout/mahout-spark-shell_2.10/1.0-SNAPSHOT/maven-metadata.xml.
Return code is: 502, ReasonPhrase:Proxy Error.
[INFO] ------------------------------------------------------------------------
[INFO] Reactor Summary:
[INFO] 
[INFO] Mahout Build Tools ................................ SUCCESS [23.355s]
[INFO] Apache Mahout ..................................... SUCCESS [17.316s]
[INFO] Mahout Math ....................................... SUCCESS [2:20.591s]
[INFO] Mahout MapReduce Legacy ........................... SUCCESS [10:49.509s]
[INFO] Mahout Integration ................................ SUCCESS [1:10.599s]
[INFO] Mahout Examples ................................... SUCCESS [1:33.912s]
[INFO] Mahout Release Package ............................ SUCCESS [2:47.791s]
[INFO] Mahout Math Scala bindings ........................ SUCCESS [2:42.814s]
[INFO] Mahout Spark bindings ............................. SUCCESS [8:53.340s]
[INFO] Mahout Spark bindings shell ....................... FAILURE [1:13.659s]
[INFO] Mahout H2O backend ................................ SKIPPED
[INFO] ------------------------------------------------------------------------
[INFO] BUILD FAILURE
[INFO] ------------------------------------------------------------------------
[INFO] Total time: 32:23.671s
[INFO] Finished at: Sat Mar 14 23:33:03 UTC 2015
[INFO] Final Memory: 61M/388M
[INFO] ------------------------------------------------------------------------
Waiting for Jenkins to finish collecting data
[ERROR] Failed to execute goal org.apache.maven.plugins:maven-deploy-plugin:2.5:deploy (default-deploy)
on project mahout-spark-shell_2.10: Failed to retrieve remote metadata org.apache.mahout:mahout-spark-shell_2.10:1.0-SNAPSHOT/maven-metadata.xml:
Could not transfer metadata org.apache.mahout:mahout-spark-shell_2.10:1.0-SNAPSHOT/maven-metadata.xml
from/to apache.snapshots.https (https://repository.apache.org/content/repositories/snapshots):
Failed to transfer file: https://repository.apache.org/content/repositories/snapshots/org/apache/mahout/mahout-spark-shell_2.10/1.0-SNAPSHOT/maven-metadata.xml.
Return code is: 502, ReasonPhrase:Proxy Error. -> [Help 1]
[ERROR] 
[ERROR] To see the full stack trace of the errors, re-run Maven with the -e switch.
[ERROR] Re-run Maven using the -X switch to enable full debug logging.
[ERROR] 
[ERROR] For more information about the errors and possible solutions, please read the following
articles:
[ERROR] [Help 1] http://cwiki.apache.org/confluence/display/MAVEN/MojoExecutionException
[ERROR] 
[ERROR] After correcting the problems, you can resume the build with the command
[ERROR]   mvn <goals> -rf :mahout-spark-shell_2.10
[JENKINS] Archiving <https://builds.apache.org/job/mahout-nightly/ws/math-scala/pom.xml>
to org.apache.mahout/mahout-math-scala_2.10/1.0-SNAPSHOT/mahout-math-scala_2.10-1.0-SNAPSHOT.pom
[JENKINS] Archiving <https://builds.apache.org/job/mahout-nightly/ws/math-scala/target/mahout-math-scala_2.10-1.0-SNAPSHOT.jar>
to org.apache.mahout/mahout-math-scala_2.10/1.0-20150314.232249-209/mahout-math-scala_2.10-1.0-20150314.232249-209.jar
[JENKINS] Archiving <https://builds.apache.org/job/mahout-nightly/ws/math-scala/target/mahout-math-scala_2.10-1.0-SNAPSHOT-tests.jar>
to org.apache.mahout/mahout-math-scala_2.10/1.0-20150314.232249-209/mahout-math-scala_2.10-1.0-20150314.232249-209-tests.jar
[JENKINS] Archiving <https://builds.apache.org/job/mahout-nightly/ws/math-scala/target/mahout-math-scala_2.10-1.0-SNAPSHOT-sources.jar>
to org.apache.mahout/mahout-math-scala_2.10/1.0-20150314.232249-209/mahout-math-scala_2.10-1.0-20150314.232249-209-sources.jar
Sending artifact delta relative to mahout-nightly » Mahout Math Scala bindings #1862
Archived 4 artifacts
Archive block size is 32768
Received 0 blocks and 953538 bytes
Compression is 0.0%
Took 0.5 sec
[JENKINS] Archiving <https://builds.apache.org/job/mahout-nightly/ws/h2o/pom.xml> to
org.apache.mahout/mahout-h2o/1.0-SNAPSHOT/mahout-h2o-1.0-SNAPSHOT.pom
Sending artifact delta relative to mahout-nightly » Mahout H2O backend #1862
Archived 1 artifacts
Archive block size is 32768
Received 0 blocks and 7487 bytes
Compression is 0.0%
Took 5.2 sec
[JENKINS] Archiving <https://builds.apache.org/job/mahout-nightly/ws/spark-shell/pom.xml>
to org.apache.mahout/mahout-spark-shell_2.10/1.0-SNAPSHOT/mahout-spark-shell_2.10-1.0-SNAPSHOT.pom
[JENKINS] Archiving <https://builds.apache.org/job/mahout-nightly/ws/spark-shell/target/mahout-spark-shell_2.10-1.0-SNAPSHOT.jar>
to org.apache.mahout/mahout-spark-shell_2.10/1.0-SNAPSHOT/mahout-spark-shell_2.10-1.0-SNAPSHOT.jar
[JENKINS] Archiving <https://builds.apache.org/job/mahout-nightly/ws/spark-shell/target/mahout-spark-shell_2.10-1.0-SNAPSHOT-tests.jar>
to org.apache.mahout/mahout-spark-shell_2.10/1.0-SNAPSHOT/mahout-spark-shell_2.10-1.0-SNAPSHOT-tests.jar
[JENKINS] Archiving <https://builds.apache.org/job/mahout-nightly/ws/spark-shell/target/mahout-spark-shell_2.10-1.0-SNAPSHOT-sources.jar>
to org.apache.mahout/mahout-spark-shell_2.10/1.0-SNAPSHOT/mahout-spark-shell_2.10-1.0-SNAPSHOT-sources.jar
Sending artifact delta relative to mahout-nightly » Mahout Spark bindings shell #1862
Archived 4 artifacts
Archive block size is 32768
Received 0 blocks and 27039 bytes
Compression is 0.0%
Took 0.16 sec
[JENKINS] Archiving <https://builds.apache.org/job/mahout-nightly/ws/distribution/pom.xml>
to org.apache.mahout/mahout-distribution/1.0-SNAPSHOT/mahout-distribution-1.0-SNAPSHOT.pom
[JENKINS] Archiving <https://builds.apache.org/job/mahout-nightly/ws/distribution/target/mahout-distribution-1.0-SNAPSHOT.tar.gz>
to org.apache.mahout/mahout-distribution/1.0-20150314.231834-365/mahout-distribution-1.0-20150314.231834-365.tar.gz
[JENKINS] Archiving <https://builds.apache.org/job/mahout-nightly/ws/distribution/target/mahout-distribution-1.0-SNAPSHOT.zip>
to org.apache.mahout/mahout-distribution/1.0-20150314.231834-365/mahout-distribution-1.0-20150314.231834-365.zip
[JENKINS] Archiving <https://builds.apache.org/job/mahout-nightly/ws/distribution/target/mahout-distribution-1.0-SNAPSHOT-src.tar.gz>
to org.apache.mahout/mahout-distribution/1.0-20150314.231834-365/mahout-distribution-1.0-20150314.231834-365-src.tar.gz
[JENKINS] Archiving <https://builds.apache.org/job/mahout-nightly/ws/distribution/target/mahout-distribution-1.0-SNAPSHOT-src.zip>
to org.apache.mahout/mahout-distribution/1.0-20150314.231834-365/mahout-distribution-1.0-20150314.231834-365-src.zip
Sending artifact delta relative to mahout-nightly » Mahout Release Package #1862
Archived 5 artifacts
Archive block size is 32768
Received 3793 blocks and 153217109 bytes
Compression is 44.8%
Took 1 min 19 sec
[JENKINS] Archiving <https://builds.apache.org/job/mahout-nightly/ws/integration/pom.xml>
to org.apache.mahout/mahout-integration/1.0-SNAPSHOT/mahout-integration-1.0-SNAPSHOT.pom
[JENKINS] Archiving <https://builds.apache.org/job/mahout-nightly/ws/integration/target/mahout-integration-1.0-SNAPSHOT.jar>
to org.apache.mahout/mahout-integration/1.0-20150314.231541-374/mahout-integration-1.0-20150314.231541-374.jar
[JENKINS] Archiving <https://builds.apache.org/job/mahout-nightly/ws/integration/target/mahout-integration-1.0-SNAPSHOT-sources.jar>
to org.apache.mahout/mahout-integration/1.0-20150314.231541-374/mahout-integration-1.0-20150314.231541-374-sources.jar
Sending artifact delta relative to mahout-nightly » Mahout Integration #1862
Archived 3 artifacts
Archive block size is 32768
Received 0 blocks and 697742 bytes
Compression is 0.0%
Took 0.53 sec
[JENKINS] Archiving <https://builds.apache.org/job/mahout-nightly/ws/pom.xml> to org.apache.mahout/mahout/1.0-SNAPSHOT/mahout-1.0-SNAPSHOT.pom
Sending artifact delta relative to mahout-nightly » Apache Mahout #1862
Archived 1 artifacts
Archive block size is 32768
Received 1 blocks and 8458 bytes
Compression is 79.5%
Took 0.16 sec
[JENKINS] Archiving <https://builds.apache.org/job/mahout-nightly/ws/spark/pom.xml>
to org.apache.mahout/mahout-spark_2.10/1.0-SNAPSHOT/mahout-spark_2.10-1.0-SNAPSHOT.pom
[JENKINS] Archiving <https://builds.apache.org/job/mahout-nightly/ws/spark/target/mahout-spark_2.10-1.0-SNAPSHOT.jar>
to org.apache.mahout/mahout-spark_2.10/1.0-20150314.232837-203/mahout-spark_2.10-1.0-20150314.232837-203.jar
[JENKINS] Archiving <https://builds.apache.org/job/mahout-nightly/ws/spark/target/mahout-spark_2.10-1.0-SNAPSHOT-tests.jar>
to org.apache.mahout/mahout-spark_2.10/1.0-20150314.232837-203/mahout-spark_2.10-1.0-20150314.232837-203-tests.jar
[JENKINS] Archiving <https://builds.apache.org/job/mahout-nightly/ws/spark/target/mahout-spark_2.10-1.0-SNAPSHOT-dependency-reduced.jar>
to org.apache.mahout/mahout-spark_2.10/1.0-20150314.232837-203/mahout-spark_2.10-1.0-20150314.232837-203-dependency-reduced.jar
[JENKINS] Archiving <https://builds.apache.org/job/mahout-nightly/ws/spark/target/mahout-spark_2.10-1.0-SNAPSHOT-sources.jar>
to org.apache.mahout/mahout-spark_2.10/1.0-20150314.232837-203/mahout-spark_2.10-1.0-20150314.232837-203-sources.jar
Sending artifact delta relative to mahout-nightly » Mahout Spark bindings #1862
Archived 5 artifacts
Archive block size is 32768
Received 68 blocks and 791524 bytes
Compression is 73.8%
Took 1.1 sec
[JENKINS] Archiving <https://builds.apache.org/job/mahout-nightly/ws/math/pom.xml> to
org.apache.mahout/mahout-math/1.0-SNAPSHOT/mahout-math-1.0-SNAPSHOT.pom
[JENKINS] Archiving <https://builds.apache.org/job/mahout-nightly/ws/math/target/mahout-math-1.0-SNAPSHOT.jar>
to org.apache.mahout/mahout-math/1.0-20150314.230325-380/mahout-math-1.0-20150314.230325-380.jar
[JENKINS] Archiving <https://builds.apache.org/job/mahout-nightly/ws/math/target/mahout-math-1.0-SNAPSHOT-tests.jar>
to org.apache.mahout/mahout-math/1.0-20150314.230325-380/mahout-math-1.0-20150314.230325-380-tests.jar
[JENKINS] Archiving <https://builds.apache.org/job/mahout-nightly/ws/math/target/mahout-math-1.0-SNAPSHOT-sources.jar>
to org.apache.mahout/mahout-math/1.0-20150314.230325-380/mahout-math-1.0-20150314.230325-380-sources.jar
Sending artifact delta relative to mahout-nightly » Mahout Math #1862
Archived 4 artifacts
Archive block size is 32768
Received 1 blocks and 3582600 bytes
Compression is 0.9%
Took 1.5 sec
[JENKINS] Archiving <https://builds.apache.org/job/mahout-nightly/ws/examples/pom.xml>
to org.apache.mahout/mahout-examples/1.0-SNAPSHOT/mahout-examples-1.0-SNAPSHOT.pom
[JENKINS] Archiving <https://builds.apache.org/job/mahout-nightly/ws/examples/target/mahout-examples-1.0-SNAPSHOT.jar>
to org.apache.mahout/mahout-examples/1.0-20150314.231639-373/mahout-examples-1.0-20150314.231639-373.jar
[JENKINS] Archiving <https://builds.apache.org/job/mahout-nightly/ws/examples/target/mahout-examples-1.0-SNAPSHOT-job.jar>
to org.apache.mahout/mahout-examples/1.0-20150314.231639-373/mahout-examples-1.0-20150314.231639-373-job.jar
[JENKINS] Archiving <https://builds.apache.org/job/mahout-nightly/ws/examples/target/mahout-examples-1.0-SNAPSHOT-sources.jar>
to org.apache.mahout/mahout-examples/1.0-20150314.231639-373/mahout-examples-1.0-20150314.231639-373-sources.jar
Sending artifact delta relative to mahout-nightly » Mahout Examples #1862
Archived 4 artifacts
Archive block size is 32768
Received 1372 blocks and 6934867 bytes
Compression is 86.6%
Took 7.3 sec
[JENKINS] Archiving <https://builds.apache.org/job/mahout-nightly/ws/mrlegacy/pom.xml>
to org.apache.mahout/mahout-mrlegacy/1.0-SNAPSHOT/mahout-mrlegacy-1.0-SNAPSHOT.pom
[JENKINS] Archiving <https://builds.apache.org/job/mahout-nightly/ws/mrlegacy/target/mahout-mrlegacy-1.0-SNAPSHOT.jar>
to org.apache.mahout/mahout-mrlegacy/1.0-20150314.231421-292/mahout-mrlegacy-1.0-20150314.231421-292.jar
[JENKINS] Archiving <https://builds.apache.org/job/mahout-nightly/ws/mrlegacy/target/mahout-mrlegacy-1.0-SNAPSHOT-tests.jar>
to org.apache.mahout/mahout-mrlegacy/1.0-20150314.231421-292/mahout-mrlegacy-1.0-20150314.231421-292-tests.jar
[JENKINS] Archiving <https://builds.apache.org/job/mahout-nightly/ws/mrlegacy/target/mahout-mrlegacy-1.0-SNAPSHOT-job.jar>
to org.apache.mahout/mahout-mrlegacy/1.0-20150314.231421-292/mahout-mrlegacy-1.0-20150314.231421-292-job.jar
[JENKINS] Archiving <https://builds.apache.org/job/mahout-nightly/ws/mrlegacy/target/mahout-mrlegacy-1.0-SNAPSHOT-sources.jar>
to org.apache.mahout/mahout-mrlegacy/1.0-20150314.231421-292/mahout-mrlegacy-1.0-20150314.231421-292-sources.jar
Sending artifact delta relative to mahout-nightly » Mahout MapReduce Legacy #1862
Archived 5 artifacts
Archive block size is 32768
Received 900 blocks and 7871310 bytes
Compression is 78.9%
Took 5 sec
[JENKINS] Archiving <https://builds.apache.org/job/mahout-nightly/ws/buildtools/pom.xml>
to org.apache.mahout/mahout-buildtools/1.0-SNAPSHOT/mahout-buildtools-1.0-SNAPSHOT.pom
[JENKINS] Archiving <https://builds.apache.org/job/mahout-nightly/ws/buildtools/target/mahout-buildtools-1.0-SNAPSHOT.jar>
to org.apache.mahout/mahout-buildtools/1.0-20150314.230050-383/mahout-buildtools-1.0-20150314.230050-383.jar
Sending artifact delta relative to mahout-nightly » Mahout Build Tools #1862
Archived 2 artifacts
Archive block size is 32768
Received 0 blocks and 19154 bytes
Compression is 0.0%
Took 0.16 sec
Sending e-mails to: dev@mahout.apache.org
channel stopped

Mime
View raw message