mahout-dev mailing list archives

Site index · List index
Message view « Date » · « Thread »
Top « Date » · « Thread »
From Apache Jenkins Server <jenk...@builds.apache.org>
Subject Build failed in Jenkins: mahout-nightly #1812
Date Wed, 21 Jan 2015 23:21:08 GMT
See <https://builds.apache.org/job/mahout-nightly/1812/>

------------------------------------------
[...truncated 3149 lines...]
- assignments
{
  0  =>	{1:3.0}
  1  =>	{0:2.0,1:2.5}
}
- sparse
- colSums, rowSums, colMeans, rowMeans, numNonZeroElementsPerColumn
- numNonZeroElementsPerColumn and Row
Average assignment seqSparse2seqSparse time: 67.531 ms
Average assignment seqSparse2seqSparse via Random Access Sparse time: 967.592 ms
- Vector Assignment performance
Run completed in 54 seconds, 280 milliseconds.
Total number of tests run: 30
Suites: completed 8, aborted 0
Tests: succeeded 30, failed 0, canceled 0, ignored 0, pending 0
All tests passed.
[JENKINS] Recording test results
[INFO] 
[INFO] --- build-helper-maven-plugin:1.8:remove-project-artifact (remove-old-mahout-artifacts)
@ mahout-math-scala_2.10 ---
[INFO] /home/jenkins/jenkins-slave/maven-repositories/1/org/apache/mahout/mahout-math-scala_2.10
removed.
[INFO] 
[INFO] --- maven-jar-plugin:2.4:jar (default-jar) @ mahout-math-scala_2.10 ---
[INFO] 
[INFO] --- maven-jar-plugin:2.4:test-jar (default) @ mahout-math-scala_2.10 ---
[WARNING] Artifact org.apache.mahout:mahout-math-scala_2.10:test-jar:tests:1.0-SNAPSHOT already
attached to project, ignoring duplicate
[INFO] 
[INFO] --- maven-source-plugin:2.2.1:jar-no-fork (attach-sources) @ mahout-math-scala_2.10
---
[WARNING] Artifact org.apache.mahout:mahout-math-scala_2.10:java-source:sources:1.0-SNAPSHOT
already attached to project, ignoring duplicate
[INFO] 
[INFO] --- maven-install-plugin:2.5.1:install (default-install) @ mahout-math-scala_2.10 ---
[INFO] Installing <https://builds.apache.org/job/mahout-nightly/ws/math-scala/target/mahout-math-scala_2.10-1.0-SNAPSHOT.jar>
to /home/jenkins/jenkins-slave/maven-repositories/1/org/apache/mahout/mahout-math-scala_2.10/1.0-SNAPSHOT/mahout-math-scala_2.10-1.0-SNAPSHOT.jar
[INFO] Installing <https://builds.apache.org/job/mahout-nightly/ws/math-scala/pom.xml>
to /home/jenkins/jenkins-slave/maven-repositories/1/org/apache/mahout/mahout-math-scala_2.10/1.0-SNAPSHOT/mahout-math-scala_2.10-1.0-SNAPSHOT.pom
[INFO] Installing <https://builds.apache.org/job/mahout-nightly/ws/math-scala/target/mahout-math-scala_2.10-1.0-SNAPSHOT-tests.jar>
to /home/jenkins/jenkins-slave/maven-repositories/1/org/apache/mahout/mahout-math-scala_2.10/1.0-SNAPSHOT/mahout-math-scala_2.10-1.0-SNAPSHOT-tests.jar
[INFO] Installing <https://builds.apache.org/job/mahout-nightly/ws/math-scala/target/mahout-math-scala_2.10-1.0-SNAPSHOT-sources.jar>
to /home/jenkins/jenkins-slave/maven-repositories/1/org/apache/mahout/mahout-math-scala_2.10/1.0-SNAPSHOT/mahout-math-scala_2.10-1.0-SNAPSHOT-sources.jar
[INFO] 
[INFO] --- maven-deploy-plugin:2.5:deploy (default-deploy) @ mahout-math-scala_2.10 ---
Downloading: https://repository.apache.org/content/repositories/snapshots/org/apache/mahout/mahout-math-scala_2.10/1.0-SNAPSHOT/maven-metadata.xml
Downloaded: https://repository.apache.org/content/repositories/snapshots/org/apache/mahout/mahout-math-scala_2.10/1.0-SNAPSHOT/maven-metadata.xml
(2 KB at 1.6 KB/sec)
Uploading: https://repository.apache.org/content/repositories/snapshots/org/apache/mahout/mahout-math-scala_2.10/1.0-SNAPSHOT/mahout-math-scala_2.10-1.0-20150121.231957-158.jar
Uploaded: https://repository.apache.org/content/repositories/snapshots/org/apache/mahout/mahout-math-scala_2.10/1.0-SNAPSHOT/mahout-math-scala_2.10-1.0-20150121.231957-158.jar
(516 KB at 2365.6 KB/sec)
Uploading: https://repository.apache.org/content/repositories/snapshots/org/apache/mahout/mahout-math-scala_2.10/1.0-SNAPSHOT/mahout-math-scala_2.10-1.0-20150121.231957-158.pom
Uploaded: https://repository.apache.org/content/repositories/snapshots/org/apache/mahout/mahout-math-scala_2.10/1.0-SNAPSHOT/mahout-math-scala_2.10-1.0-20150121.231957-158.pom
(6 KB at 29.0 KB/sec)
Downloading: https://repository.apache.org/content/repositories/snapshots/org/apache/mahout/mahout-math-scala_2.10/maven-metadata.xml
Downloaded: https://repository.apache.org/content/repositories/snapshots/org/apache/mahout/mahout-math-scala_2.10/maven-metadata.xml
(297 B at 2.1 KB/sec)
Uploading: https://repository.apache.org/content/repositories/snapshots/org/apache/mahout/mahout-math-scala_2.10/1.0-SNAPSHOT/maven-metadata.xml
Uploaded: https://repository.apache.org/content/repositories/snapshots/org/apache/mahout/mahout-math-scala_2.10/1.0-SNAPSHOT/maven-metadata.xml
(2 KB at 4.5 KB/sec)
Uploading: https://repository.apache.org/content/repositories/snapshots/org/apache/mahout/mahout-math-scala_2.10/maven-metadata.xml
Uploaded: https://repository.apache.org/content/repositories/snapshots/org/apache/mahout/mahout-math-scala_2.10/maven-metadata.xml
(297 B at 1.7 KB/sec)
Uploading: https://repository.apache.org/content/repositories/snapshots/org/apache/mahout/mahout-math-scala_2.10/1.0-SNAPSHOT/mahout-math-scala_2.10-1.0-20150121.231957-158-tests.jar
Uploaded: https://repository.apache.org/content/repositories/snapshots/org/apache/mahout/mahout-math-scala_2.10/1.0-SNAPSHOT/mahout-math-scala_2.10-1.0-20150121.231957-158-tests.jar
(290 KB at 1373.0 KB/sec)
Uploading: https://repository.apache.org/content/repositories/snapshots/org/apache/mahout/mahout-math-scala_2.10/1.0-SNAPSHOT/maven-metadata.xml
Uploaded: https://repository.apache.org/content/repositories/snapshots/org/apache/mahout/mahout-math-scala_2.10/1.0-SNAPSHOT/maven-metadata.xml
(2 KB at 8.7 KB/sec)
Uploading: https://repository.apache.org/content/repositories/snapshots/org/apache/mahout/mahout-math-scala_2.10/1.0-SNAPSHOT/mahout-math-scala_2.10-1.0-20150121.231957-158-sources.jar
Uploaded: https://repository.apache.org/content/repositories/snapshots/org/apache/mahout/mahout-math-scala_2.10/1.0-SNAPSHOT/mahout-math-scala_2.10-1.0-20150121.231957-158-sources.jar
(90 KB at 475.2 KB/sec)
Uploading: https://repository.apache.org/content/repositories/snapshots/org/apache/mahout/mahout-math-scala_2.10/1.0-SNAPSHOT/maven-metadata.xml
Uploaded: https://repository.apache.org/content/repositories/snapshots/org/apache/mahout/mahout-math-scala_2.10/1.0-SNAPSHOT/maven-metadata.xml
(2 KB at 8.7 KB/sec)
[INFO]                                                                         
[INFO] ------------------------------------------------------------------------
[INFO] Building Mahout Spark bindings 1.0-SNAPSHOT
[INFO] ------------------------------------------------------------------------
[INFO] 
[INFO] --- maven-clean-plugin:2.4.1:clean (default-clean) @ mahout-spark_2.10 ---
[INFO] 
[INFO] --- build-helper-maven-plugin:1.8:add-source (add-source) @ mahout-spark_2.10 ---
[INFO] Source directory: <https://builds.apache.org/job/mahout-nightly/ws/spark/target/generated-sources/mahout>
added.
[INFO] 
[INFO] --- build-helper-maven-plugin:1.8:add-test-source (add-test-source) @ mahout-spark_2.10
---
[INFO] Test Source directory: <https://builds.apache.org/job/mahout-nightly/ws/spark/target/generated-test-sources/mahout>
added.
[INFO] 
[INFO] --- maven-resources-plugin:2.6:resources (default-resources) @ mahout-spark_2.10 ---
[INFO] Using 'UTF-8' encoding to copy filtered resources.
[INFO] skip non existing resourceDirectory <https://builds.apache.org/job/mahout-nightly/ws/spark/src/main/resources>
[INFO] 
[INFO] --- maven-compiler-plugin:3.1:compile (default-compile) @ mahout-spark_2.10 ---
[INFO] No sources to compile
[INFO] 
[INFO] --- maven-scala-plugin:2.15.2:compile (default) @ mahout-spark_2.10 ---
[INFO] Checking for multiple versions of scala
[WARNING]  Expected all dependencies to require Scala version: 2.10.4
[WARNING]  com.twitter:chill_2.10:0.3.6 requires scala version: 2.10.3
[WARNING] Multiple versions of scala libraries detected!
[INFO] includes = [**/*.scala,**/*.java,]
[INFO] excludes = []
[INFO] <https://builds.apache.org/job/mahout-nightly/ws/spark/src/main/scala>:-1: info:
compiling
[INFO] Compiling 37 source files to <https://builds.apache.org/job/mahout-nightly/ws/spark/target/classes>
at 1421882401381
[ERROR] error: error while loading <root>, error in opening zip file
[ERROR] error: scala.reflect.internal.MissingRequirementError: object scala.runtime in compiler
mirror not found.
[ERROR] 	at scala.reflect.internal.MissingRequirementError$.signal(MissingRequirementError.scala:16)
[ERROR] 	at scala.reflect.internal.MissingRequirementError$.notFound(MissingRequirementError.scala:17)
[INFO] 	at scala.reflect.internal.Mirrors$RootsBase.getModuleOrClass(Mirrors.scala:48)
[INFO] 	at scala.reflect.internal.Mirrors$RootsBase.getModuleOrClass(Mirrors.scala:40)
[INFO] 	at scala.reflect.internal.Mirrors$RootsBase.getModuleOrClass(Mirrors.scala:61)
[INFO] 	at scala.reflect.internal.Mirrors$RootsBase.getPackage(Mirrors.scala:172)
[INFO] 	at scala.reflect.internal.Mirrors$RootsBase.getRequiredPackage(Mirrors.scala:175)
[INFO] 	at scala.reflect.internal.Definitions$DefinitionsClass.RuntimePackage$lzycompute(Definitions.scala:183)
[INFO] 	at scala.reflect.internal.Definitions$DefinitionsClass.RuntimePackage(Definitions.scala:183)
[INFO] 	at scala.reflect.internal.Definitions$DefinitionsClass.RuntimePackageClass$lzycompute(Definitions.scala:184)
[INFO] 	at scala.reflect.internal.Definitions$DefinitionsClass.RuntimePackageClass(Definitions.scala:184)
[INFO] 	at scala.reflect.internal.Definitions$DefinitionsClass.AnnotationDefaultAttr$lzycompute(Definitions.scala:1024)
[INFO] 	at scala.reflect.internal.Definitions$DefinitionsClass.AnnotationDefaultAttr(Definitions.scala:1023)
[INFO] 	at scala.reflect.internal.Definitions$DefinitionsClass.syntheticCoreClasses$lzycompute(Definitions.scala:1153)
[INFO] 	at scala.reflect.internal.Definitions$DefinitionsClass.syntheticCoreClasses(Definitions.scala:1152)
[INFO] 	at scala.reflect.internal.Definitions$DefinitionsClass.symbolsNotPresentInBytecode$lzycompute(Definitions.scala:1196)
[INFO] 	at scala.reflect.internal.Definitions$DefinitionsClass.symbolsNotPresentInBytecode(Definitions.scala:1196)
[INFO] 	at scala.reflect.internal.Definitions$DefinitionsClass.init(Definitions.scala:1261)
[INFO] 	at scala.tools.nsc.Global$Run.<init>(Global.scala:1290)
[INFO] 	at scala.tools.nsc.Driver.doCompile(Driver.scala:32)
[INFO] 	at scala.tools.nsc.Main$.doCompile(Main.scala:79)
[INFO] 	at scala.tools.nsc.Driver.process(Driver.scala:54)
[INFO] 	at scala.tools.nsc.Driver.main(Driver.scala:67)
[INFO] 	at scala.tools.nsc.Main.main(Main.scala)
[INFO] 	at sun.reflect.NativeMethodAccessorImpl.invoke0(Native Method)
[INFO] 	at sun.reflect.NativeMethodAccessorImpl.invoke(NativeMethodAccessorImpl.java:39)
[INFO] 	at sun.reflect.DelegatingMethodAccessorImpl.invoke(DelegatingMethodAccessorImpl.java:25)
[INFO] 	at java.lang.reflect.Method.invoke(Method.java:597)
[INFO] 	at org_scala_tools_maven_executions.MainHelper.runMain(MainHelper.java:161)
[INFO] 	at org_scala_tools_maven_executions.MainWithArgsInFile.main(MainWithArgsInFile.java:26)
[INFO] 
[INFO] ------------------------------------------------------------------------
[INFO] Reactor Summary:
[INFO] 
[INFO] Mahout Build Tools ................................ SUCCESS [11.777s]
[INFO] Apache Mahout ..................................... SUCCESS [3.039s]
[INFO] Mahout Math ....................................... SUCCESS [1:26.939s]
[INFO] Mahout MapReduce Legacy ........................... SUCCESS [10:48.642s]
[INFO] Mahout Integration ................................ SUCCESS [1:00.876s]
[INFO] Mahout Examples ................................... SUCCESS [54.949s]
[INFO] Mahout Release Package ............................ SUCCESS [2:03.007s]
[INFO] Mahout Math Scala bindings ........................ SUCCESS [2:39.351s]
[INFO] Mahout Spark bindings ............................. FAILURE [3.077s]
[INFO] Mahout Spark bindings shell ....................... SKIPPED
[INFO] Mahout H2O backend ................................ SKIPPED
[INFO] ------------------------------------------------------------------------
[INFO] BUILD FAILURE
[INFO] ------------------------------------------------------------------------
[INFO] Total time: 19:18.267s
[INFO] Finished at: Wed Jan 21 23:20:02 UTC 2015
[INFO] Final Memory: 58M/306M
[INFO] ------------------------------------------------------------------------
Waiting for Jenkins to finish collecting data
[ERROR] Failed to execute goal org.scala-tools:maven-scala-plugin:2.15.2:compile (default)
on project mahout-spark_2.10: wrap: org.apache.commons.exec.ExecuteException: Process exited
with an error: 1(Exit value: 1) -> [Help 1]
[ERROR] 
[ERROR] To see the full stack trace of the errors, re-run Maven with the -e switch.
[ERROR] Re-run Maven using the -X switch to enable full debug logging.
[ERROR] 
[ERROR] For more information about the errors and possible solutions, please read the following
articles:
[ERROR] [Help 1] http://cwiki.apache.org/confluence/display/MAVEN/MojoExecutionException
[ERROR] 
[ERROR] After correcting the problems, you can resume the build with the command
[ERROR]   mvn <goals> -rf :mahout-spark_2.10
[JENKINS] Archiving <https://builds.apache.org/job/mahout-nightly/ws/math-scala/pom.xml>
to org.apache.mahout/mahout-math-scala_2.10/1.0-SNAPSHOT/mahout-math-scala_2.10-1.0-SNAPSHOT.pom
[JENKINS] Archiving <https://builds.apache.org/job/mahout-nightly/ws/math-scala/target/mahout-math-scala_2.10-1.0-SNAPSHOT.jar>
to org.apache.mahout/mahout-math-scala_2.10/1.0-20150121.231957-158/mahout-math-scala_2.10-1.0-20150121.231957-158.jar
[JENKINS] Archiving <https://builds.apache.org/job/mahout-nightly/ws/math-scala/target/mahout-math-scala_2.10-1.0-SNAPSHOT-tests.jar>
to org.apache.mahout/mahout-math-scala_2.10/1.0-20150121.231957-158/mahout-math-scala_2.10-1.0-20150121.231957-158-tests.jar
[JENKINS] Archiving <https://builds.apache.org/job/mahout-nightly/ws/math-scala/target/mahout-math-scala_2.10-1.0-SNAPSHOT-sources.jar>
to org.apache.mahout/mahout-math-scala_2.10/1.0-20150121.231957-158/mahout-math-scala_2.10-1.0-20150121.231957-158-sources.jar
Sending artifact delta relative to mahout-nightly » Mahout Math Scala bindings #1811
Archived 4 artifacts
Archive block size is 32768
Received 0 blocks and 922669 bytes
Compression is 0.0%
Took 0.61 sec
[JENKINS] Archiving <https://builds.apache.org/job/mahout-nightly/ws/h2o/pom.xml> to
org.apache.mahout/mahout-h2o/1.0-SNAPSHOT/mahout-h2o-1.0-SNAPSHOT.pom
Sending artifact delta relative to mahout-nightly » Mahout H2O backend #1811
Archived 1 artifacts
Archive block size is 32768
Received 0 blocks and 7487 bytes
Compression is 0.0%
Took 1 sec
[JENKINS] Archiving <https://builds.apache.org/job/mahout-nightly/ws/spark-shell/pom.xml>
to org.apache.mahout/mahout-spark-shell_2.10/1.0-SNAPSHOT/mahout-spark-shell_2.10-1.0-SNAPSHOT.pom
Sending artifact delta relative to mahout-nightly » Mahout Spark bindings shell #1811
Archived 1 artifacts
Archive block size is 32768
Received 0 blocks and 5930 bytes
Compression is 0.0%
Took 63 ms
[JENKINS] Archiving <https://builds.apache.org/job/mahout-nightly/ws/distribution/pom.xml>
to org.apache.mahout/mahout-distribution/1.0-SNAPSHOT/mahout-distribution-1.0-SNAPSHOT.pom
[JENKINS] Archiving <https://builds.apache.org/job/mahout-nightly/ws/distribution/target/mahout-distribution-1.0-SNAPSHOT.tar.gz>
to org.apache.mahout/mahout-distribution/1.0-20150121.231604-314/mahout-distribution-1.0-20150121.231604-314.tar.gz
[JENKINS] Archiving <https://builds.apache.org/job/mahout-nightly/ws/distribution/target/mahout-distribution-1.0-SNAPSHOT.zip>
to org.apache.mahout/mahout-distribution/1.0-20150121.231604-314/mahout-distribution-1.0-20150121.231604-314.zip
[JENKINS] Archiving <https://builds.apache.org/job/mahout-nightly/ws/distribution/target/mahout-distribution-1.0-SNAPSHOT-src.tar.gz>
to org.apache.mahout/mahout-distribution/1.0-20150121.231604-314/mahout-distribution-1.0-20150121.231604-314-src.tar.gz
[JENKINS] Archiving <https://builds.apache.org/job/mahout-nightly/ws/distribution/target/mahout-distribution-1.0-SNAPSHOT-src.zip>
to org.apache.mahout/mahout-distribution/1.0-20150121.231604-314/mahout-distribution-1.0-20150121.231604-314-src.zip
Sending artifact delta relative to mahout-nightly » Mahout Release Package #1811
Archived 5 artifacts
Archive block size is 32768
Received 3853 blocks and 147951631 bytes
Compression is 46.0%
Took 46 sec
[JENKINS] Archiving <https://builds.apache.org/job/mahout-nightly/ws/integration/pom.xml>
to org.apache.mahout/mahout-integration/1.0-SNAPSHOT/mahout-integration-1.0-SNAPSHOT.pom
[JENKINS] Archiving <https://builds.apache.org/job/mahout-nightly/ws/integration/target/mahout-integration-1.0-SNAPSHOT.jar>
to org.apache.mahout/mahout-integration/1.0-20150121.231416-323/mahout-integration-1.0-20150121.231416-323.jar
[JENKINS] Archiving <https://builds.apache.org/job/mahout-nightly/ws/integration/target/mahout-integration-1.0-SNAPSHOT-sources.jar>
to org.apache.mahout/mahout-integration/1.0-20150121.231416-323/mahout-integration-1.0-20150121.231416-323-sources.jar
Sending artifact delta relative to mahout-nightly » Mahout Integration #1811
Archived 3 artifacts
Archive block size is 32768
Received 0 blocks and 697741 bytes
Compression is 0.0%
Took 0.59 sec
[JENKINS] Archiving <https://builds.apache.org/job/mahout-nightly/ws/pom.xml> to org.apache.mahout/mahout/1.0-SNAPSHOT/mahout-1.0-SNAPSHOT.pom
Sending artifact delta relative to mahout-nightly » Apache Mahout #1811
Archived 1 artifacts
Archive block size is 32768
Received 1 blocks and 8458 bytes
Compression is 79.5%
Took 88 ms
[JENKINS] Archiving <https://builds.apache.org/job/mahout-nightly/ws/spark/pom.xml>
to org.apache.mahout/mahout-spark_2.10/1.0-SNAPSHOT/mahout-spark_2.10-1.0-SNAPSHOT.pom
Sending artifact delta relative to mahout-nightly » Mahout Spark bindings #1811
Archived 1 artifacts
Archive block size is 32768
Received 0 blocks and 10267 bytes
Compression is 0.0%
Took 1.8 sec
[JENKINS] Archiving <https://builds.apache.org/job/mahout-nightly/ws/math/pom.xml> to
org.apache.mahout/mahout-math/1.0-SNAPSHOT/mahout-math-1.0-SNAPSHOT.pom
[JENKINS] Archiving <https://builds.apache.org/job/mahout-nightly/ws/math/target/mahout-math-1.0-SNAPSHOT.jar>
to org.apache.mahout/mahout-math/1.0-20150121.230225-329/mahout-math-1.0-20150121.230225-329.jar
[JENKINS] Archiving <https://builds.apache.org/job/mahout-nightly/ws/math/target/mahout-math-1.0-SNAPSHOT-tests.jar>
to org.apache.mahout/mahout-math/1.0-20150121.230225-329/mahout-math-1.0-20150121.230225-329-tests.jar
[JENKINS] Archiving <https://builds.apache.org/job/mahout-nightly/ws/math/target/mahout-math-1.0-SNAPSHOT-sources.jar>
to org.apache.mahout/mahout-math/1.0-20150121.230225-329/mahout-math-1.0-20150121.230225-329-sources.jar
Sending artifact delta relative to mahout-nightly » Mahout Math #1811
Archived 4 artifacts
Archive block size is 32768
Received 1 blocks and 3582602 bytes
Compression is 0.9%
Took 0.96 sec
[JENKINS] Archiving <https://builds.apache.org/job/mahout-nightly/ws/examples/pom.xml>
to org.apache.mahout/mahout-examples/1.0-SNAPSHOT/mahout-examples-1.0-SNAPSHOT.pom
[JENKINS] Archiving <https://builds.apache.org/job/mahout-nightly/ws/examples/target/mahout-examples-1.0-SNAPSHOT.jar>
to org.apache.mahout/mahout-examples/1.0-20150121.231502-322/mahout-examples-1.0-20150121.231502-322.jar
[JENKINS] Archiving <https://builds.apache.org/job/mahout-nightly/ws/examples/target/mahout-examples-1.0-SNAPSHOT-job.jar>
to org.apache.mahout/mahout-examples/1.0-20150121.231502-322/mahout-examples-1.0-20150121.231502-322-job.jar
[JENKINS] Archiving <https://builds.apache.org/job/mahout-nightly/ws/examples/target/mahout-examples-1.0-SNAPSHOT-sources.jar>
to org.apache.mahout/mahout-examples/1.0-20150121.231502-322/mahout-examples-1.0-20150121.231502-322-sources.jar
Sending artifact delta relative to mahout-nightly » Mahout Examples #1811
Archived 4 artifacts
Archive block size is 32768
Received 1427 blocks and 5132627 bytes
Compression is 90.1%
Took 3.2 sec
[JENKINS] Archiving <https://builds.apache.org/job/mahout-nightly/ws/mrlegacy/pom.xml>
to org.apache.mahout/mahout-mrlegacy/1.0-SNAPSHOT/mahout-mrlegacy-1.0-SNAPSHOT.pom
[JENKINS] Archiving <https://builds.apache.org/job/mahout-nightly/ws/mrlegacy/target/mahout-mrlegacy-1.0-SNAPSHOT.jar>
to org.apache.mahout/mahout-mrlegacy/1.0-20150121.231307-241/mahout-mrlegacy-1.0-20150121.231307-241.jar
[JENKINS] Archiving <https://builds.apache.org/job/mahout-nightly/ws/mrlegacy/target/mahout-mrlegacy-1.0-SNAPSHOT-tests.jar>
to org.apache.mahout/mahout-mrlegacy/1.0-20150121.231307-241/mahout-mrlegacy-1.0-20150121.231307-241-tests.jar
[JENKINS] Archiving <https://builds.apache.org/job/mahout-nightly/ws/mrlegacy/target/mahout-mrlegacy-1.0-SNAPSHOT-job.jar>
to org.apache.mahout/mahout-mrlegacy/1.0-20150121.231307-241/mahout-mrlegacy-1.0-20150121.231307-241-job.jar
[JENKINS] Archiving <https://builds.apache.org/job/mahout-nightly/ws/mrlegacy/target/mahout-mrlegacy-1.0-SNAPSHOT-sources.jar>
to org.apache.mahout/mahout-mrlegacy/1.0-20150121.231307-241/mahout-mrlegacy-1.0-20150121.231307-241-sources.jar
Sending artifact delta relative to mahout-nightly » Mahout MapReduce Legacy #1811
Archived 5 artifacts
Archive block size is 32768
Received 954 blocks and 6101839 bytes
Compression is 83.7%
Took 2.9 sec
[JENKINS] Archiving <https://builds.apache.org/job/mahout-nightly/ws/buildtools/pom.xml>
to org.apache.mahout/mahout-buildtools/1.0-SNAPSHOT/mahout-buildtools-1.0-SNAPSHOT.pom
[JENKINS] Archiving <https://builds.apache.org/job/mahout-nightly/ws/buildtools/target/mahout-buildtools-1.0-SNAPSHOT.jar>
to org.apache.mahout/mahout-buildtools/1.0-20150121.230055-332/mahout-buildtools-1.0-20150121.230055-332.jar
Sending artifact delta relative to mahout-nightly » Mahout Build Tools #1811
Archived 2 artifacts
Archive block size is 32768
Received 0 blocks and 19154 bytes
Compression is 0.0%
Took 0.11 sec
Sending e-mails to: dev@mahout.apache.org
channel stopped

Mime
View raw message