mahout-dev mailing list archives

Site index · List index
Message view « Date » · « Thread »
Top « Date » · « Thread »
From Apache Jenkins Server <jenk...@builds.apache.org>
Subject Build failed in Jenkins: mahout-nightly #1733
Date Mon, 03 Nov 2014 23:29:23 GMT
See <https://builds.apache.org/job/mahout-nightly/1733/>

------------------------------------------
[...truncated 3560 lines...]
Downloaded: http://repo.maven.apache.org/maven2/com/typesafe/config/1.0.2/config-1.0.2.jar
(184 KB at 12206.8 KB/sec)
Downloading: http://repo.maven.apache.org/maven2/org/spark-project/protobuf/protobuf-java/2.4.1-shaded/protobuf-java-2.4.1-shaded.jar
Downloaded: http://repo.maven.apache.org/maven2/org/spark-project/protobuf/protobuf-java/2.4.1-shaded/protobuf-java-2.4.1-shaded.jar
(445 KB at 20208.6 KB/sec)
Downloading: http://repo.maven.apache.org/maven2/org/uncommons/maths/uncommons-maths/1.2.2a/uncommons-maths-1.2.2a.jar
Downloaded: http://repo.maven.apache.org/maven2/org/uncommons/maths/uncommons-maths/1.2.2a/uncommons-maths-1.2.2a.jar
(48 KB at 2393.5 KB/sec)
Downloading: http://repo.maven.apache.org/maven2/org/spark-project/akka/akka-slf4j_2.10/2.2.3-shaded-protobuf/akka-slf4j_2.10-2.2.3-shaded-protobuf.jar
Downloaded: http://repo.maven.apache.org/maven2/io/netty/netty/3.6.6.Final/netty-3.6.6.Final.jar
(1178 KB at 21812.0 KB/sec)
Downloading: http://repo.maven.apache.org/maven2/org/json4s/json4s-jackson_2.10/3.2.10/json4s-jackson_2.10-3.2.10.jar
Downloaded: http://repo.maven.apache.org/maven2/org/apache/spark/spark-core_2.10/1.1.0/spark-core_2.10-1.1.0.jar
(6296 KB at 35565.6 KB/sec)
Downloading: http://repo.maven.apache.org/maven2/org/json4s/json4s-core_2.10/3.2.10/json4s-core_2.10-3.2.10.jar
Downloaded: http://repo.maven.apache.org/maven2/org/spark-project/akka/akka-slf4j_2.10/2.2.3-shaded-protobuf/akka-slf4j_2.10-2.2.3-shaded-protobuf.jar
(14 KB at 1731.7 KB/sec)
Downloading: http://repo.maven.apache.org/maven2/org/json4s/json4s-ast_2.10/3.2.10/json4s-ast_2.10-3.2.10.jar
Downloaded: http://repo.maven.apache.org/maven2/org/json4s/json4s-jackson_2.10/3.2.10/json4s-jackson_2.10-3.2.10.jar
(40 KB at 4877.1 KB/sec)
Downloading: http://repo.maven.apache.org/maven2/com/thoughtworks/paranamer/paranamer/2.6/paranamer-2.6.jar
Downloaded: http://repo.maven.apache.org/maven2/org/json4s/json4s-ast_2.10/3.2.10/json4s-ast_2.10-3.2.10.jar
(82 KB at 9092.7 KB/sec)
Downloading: http://repo.maven.apache.org/maven2/org/scala-lang/scalap/2.10.0/scalap-2.10.0.jar
Downloaded: http://repo.maven.apache.org/maven2/com/thoughtworks/paranamer/paranamer/2.6/paranamer-2.6.jar
(33 KB at 3559.7 KB/sec)
Downloading: http://repo.maven.apache.org/maven2/org/scala-lang/scala-compiler/2.10.0/scala-compiler-2.10.0.jar
Downloaded: http://repo.maven.apache.org/maven2/org/json4s/json4s-core_2.10/3.2.10/json4s-core_2.10-3.2.10.jar
(571 KB at 28549.4 KB/sec)
Downloading: http://repo.maven.apache.org/maven2/com/fasterxml/jackson/core/jackson-databind/2.3.1/jackson-databind-2.3.1.jar
Downloaded: http://repo.maven.apache.org/maven2/org/spark-project/akka/akka-remote_2.10/2.2.3-shaded-protobuf/akka-remote_2.10-2.2.3-shaded-protobuf.jar
(1247 KB at 11232.7 KB/sec)
Downloading: http://repo.maven.apache.org/maven2/com/fasterxml/jackson/core/jackson-annotations/2.3.0/jackson-annotations-2.3.0.jar
Downloaded: http://repo.maven.apache.org/maven2/com/fasterxml/jackson/core/jackson-annotations/2.3.0/jackson-annotations-2.3.0.jar
(35 KB at 4890.9 KB/sec)
Downloading: http://repo.maven.apache.org/maven2/com/fasterxml/jackson/core/jackson-core/2.3.1/jackson-core-2.3.1.jar
Downloaded: http://repo.maven.apache.org/maven2/org/scala-lang/scalap/2.10.0/scalap-2.10.0.jar
(835 KB at 22566.8 KB/sec)
Downloading: http://repo.maven.apache.org/maven2/colt/colt/1.2.0/colt-1.2.0.jar
Downloaded: http://repo.maven.apache.org/maven2/com/fasterxml/jackson/core/jackson-databind/2.3.1/jackson-databind-2.3.1.jar
(893 KB at 33069.7 KB/sec)
Downloading: http://repo.maven.apache.org/maven2/concurrent/concurrent/1.3.4/concurrent-1.3.4.jar
Downloaded: http://repo.maven.apache.org/maven2/com/fasterxml/jackson/core/jackson-core/2.3.1/jackson-core-2.3.1.jar
(194 KB at 16112.1 KB/sec)
Downloaded: http://repo.maven.apache.org/maven2/concurrent/concurrent/1.3.4/concurrent-1.3.4.jar
(185 KB at 16804.3 KB/sec)
Downloading: http://repo.maven.apache.org/maven2/org/apache/mesos/mesos/0.18.1/mesos-0.18.1-shaded-protobuf.jar
Downloading: http://repo.maven.apache.org/maven2/io/netty/netty-all/4.0.23.Final/netty-all-4.0.23.Final.jar
Downloaded: http://repo.maven.apache.org/maven2/colt/colt/1.2.0/colt-1.2.0.jar (569 KB at
27062.2 KB/sec)
Downloading: http://repo.maven.apache.org/maven2/com/clearspring/analytics/stream/2.7.0/stream-2.7.0.jar
Downloaded: http://repo.maven.apache.org/maven2/com/clearspring/analytics/stream/2.7.0/stream-2.7.0.jar
(171 KB at 13097.3 KB/sec)
Downloading: http://repo.maven.apache.org/maven2/com/codahale/metrics/metrics-core/3.0.0/metrics-core-3.0.0.jar
Downloaded: http://repo.maven.apache.org/maven2/org/apache/mesos/mesos/0.18.1/mesos-0.18.1-shaded-protobuf.jar
(933 KB at 33298.1 KB/sec)
Downloading: http://repo.maven.apache.org/maven2/com/codahale/metrics/metrics-jvm/3.0.0/metrics-jvm-3.0.0.jar
Downloaded: http://repo.maven.apache.org/maven2/com/codahale/metrics/metrics-core/3.0.0/metrics-core-3.0.0.jar
(84 KB at 6942.5 KB/sec)
Downloading: http://repo.maven.apache.org/maven2/com/codahale/metrics/metrics-json/3.0.0/metrics-json-3.0.0.jar
Downloaded: http://repo.maven.apache.org/maven2/com/codahale/metrics/metrics-jvm/3.0.0/metrics-jvm-3.0.0.jar
(31 KB at 3349.1 KB/sec)
Downloading: http://repo.maven.apache.org/maven2/com/codahale/metrics/metrics-graphite/3.0.0/metrics-graphite-3.0.0.jar
Downloaded: http://repo.maven.apache.org/maven2/com/codahale/metrics/metrics-json/3.0.0/metrics-json-3.0.0.jar
(16 KB at 1928.3 KB/sec)
Downloading: http://repo.maven.apache.org/maven2/org/tachyonproject/tachyon-client/0.5.0/tachyon-client-0.5.0.jar
Downloaded: http://repo.maven.apache.org/maven2/com/codahale/metrics/metrics-graphite/3.0.0/metrics-graphite-3.0.0.jar
(10 KB at 1193.7 KB/sec)
Downloading: http://repo.maven.apache.org/maven2/org/tachyonproject/tachyon/0.5.0/tachyon-0.5.0.jar
Downloaded: http://repo.maven.apache.org/maven2/org/tachyonproject/tachyon-client/0.5.0/tachyon-client-0.5.0.jar
(3 KB at 321.8 KB/sec)
Downloading: http://repo.maven.apache.org/maven2/org/spark-project/pyrolite/2.0.1/pyrolite-2.0.1.jar
Downloaded: http://repo.maven.apache.org/maven2/io/netty/netty-all/4.0.23.Final/netty-all-4.0.23.Final.jar
(1739 KB at 32190.2 KB/sec)
Downloading: http://repo.maven.apache.org/maven2/net/sf/py4j/py4j/0.8.2.1/py4j-0.8.2.1.jar
Downloaded: http://repo.maven.apache.org/maven2/org/spark-project/pyrolite/2.0.1/pyrolite-2.0.1.jar
(67 KB at 7404.6 KB/sec)
Downloaded: http://repo.maven.apache.org/maven2/net/sf/py4j/py4j/0.8.2.1/py4j-0.8.2.1.jar
(79 KB at 7895.5 KB/sec)
Downloaded: http://repo.maven.apache.org/maven2/org/spark-project/akka/akka-actor_2.10/2.2.3-shaded-protobuf/akka-actor_2.10-2.2.3-shaded-protobuf.jar
(2607 KB at 12355.1 KB/sec)
Downloaded: http://repo.maven.apache.org/maven2/org/tachyonproject/tachyon/0.5.0/tachyon-0.5.0.jar
(2058 KB at 31649.6 KB/sec)
Downloaded: http://repo.maven.apache.org/maven2/org/scala-lang/scala-compiler/2.10.0/scala-compiler-2.10.0.jar
(13818 KB at 41745.6 KB/sec)
[INFO] 
[INFO] --- maven-clean-plugin:2.4.1:clean (default-clean) @ mahout-spark_2.10 ---
[INFO] 
[INFO] --- build-helper-maven-plugin:1.8:add-source (add-source) @ mahout-spark_2.10 ---
[INFO] Source directory: <https://builds.apache.org/job/mahout-nightly/ws/spark/target/generated-sources/mahout>
added.
[INFO] 
[INFO] --- build-helper-maven-plugin:1.8:add-test-source (add-test-source) @ mahout-spark_2.10
---
[INFO] Test Source directory: <https://builds.apache.org/job/mahout-nightly/ws/spark/target/generated-test-sources/mahout>
added.
[INFO] 
[INFO] --- maven-resources-plugin:2.6:resources (default-resources) @ mahout-spark_2.10 ---
[INFO] Using 'UTF-8' encoding to copy filtered resources.
[INFO] skip non existing resourceDirectory <https://builds.apache.org/job/mahout-nightly/ws/spark/src/main/resources>
[INFO] 
[INFO] --- maven-compiler-plugin:3.1:compile (default-compile) @ mahout-spark_2.10 ---
[INFO] No sources to compile
[INFO] 
[INFO] --- maven-scala-plugin:2.15.2:compile (default) @ mahout-spark_2.10 ---
[INFO] Checking for multiple versions of scala
[WARNING] Invalid POM for org.codehaus.jettison:jettison:jar:1.1, transitive dependencies
(if any) will not be available, enable debug logging for more details
[WARNING] Invalid POM for javax.activation:activation:jar:1.1, transitive dependencies (if
any) will not be available, enable debug logging for more details
[WARNING] Invalid POM for asm:asm:jar:3.1, transitive dependencies (if any) will not be available,
enable debug logging for more details
[WARNING] Invalid POM for org.codehaus.jettison:jettison:jar:1.1, transitive dependencies
(if any) will not be available, enable debug logging for more details
[WARNING] Invalid POM for javax.activation:activation:jar:1.1, transitive dependencies (if
any) will not be available, enable debug logging for more details
[WARNING]  Expected all dependencies to require Scala version: 2.10.4
[WARNING]  com.twitter:chill_2.10:0.3.6 requires scala version: 2.10.3
[WARNING] Multiple versions of scala libraries detected!
[INFO] includes = [**/*.scala,**/*.java,]
[INFO] excludes = []
[INFO] <https://builds.apache.org/job/mahout-nightly/ws/spark/src/main/scala>:-1: info:
compiling
[INFO] Compiling 33 source files to <https://builds.apache.org/job/mahout-nightly/ws/spark/target/classes>
at 1415057219312
[ERROR] error: error while loading <root>, error in opening zip file
[ERROR] error: scala.reflect.internal.MissingRequirementError: object scala.runtime in compiler
mirror not found.
[ERROR] 	at scala.reflect.internal.MissingRequirementError$.signal(MissingRequirementError.scala:16)
[ERROR] 	at scala.reflect.internal.MissingRequirementError$.notFound(MissingRequirementError.scala:17)
[INFO] 	at scala.reflect.internal.Mirrors$RootsBase.getModuleOrClass(Mirrors.scala:48)
[INFO] 	at scala.reflect.internal.Mirrors$RootsBase.getModuleOrClass(Mirrors.scala:40)
[INFO] 	at scala.reflect.internal.Mirrors$RootsBase.getModuleOrClass(Mirrors.scala:61)
[INFO] 	at scala.reflect.internal.Mirrors$RootsBase.getPackage(Mirrors.scala:172)
[INFO] 	at scala.reflect.internal.Mirrors$RootsBase.getRequiredPackage(Mirrors.scala:175)
[INFO] 	at scala.reflect.internal.Definitions$DefinitionsClass.RuntimePackage$lzycompute(Definitions.scala:183)
[INFO] 	at scala.reflect.internal.Definitions$DefinitionsClass.RuntimePackage(Definitions.scala:183)
[INFO] 	at scala.reflect.internal.Definitions$DefinitionsClass.RuntimePackageClass$lzycompute(Definitions.scala:184)
[INFO] 	at scala.reflect.internal.Definitions$DefinitionsClass.RuntimePackageClass(Definitions.scala:184)
[INFO] 	at scala.reflect.internal.Definitions$DefinitionsClass.AnnotationDefaultAttr$lzycompute(Definitions.scala:1024)
[INFO] 	at scala.reflect.internal.Definitions$DefinitionsClass.AnnotationDefaultAttr(Definitions.scala:1023)
[INFO] 	at scala.reflect.internal.Definitions$DefinitionsClass.syntheticCoreClasses$lzycompute(Definitions.scala:1153)
[INFO] 	at scala.reflect.internal.Definitions$DefinitionsClass.syntheticCoreClasses(Definitions.scala:1152)
[INFO] 	at scala.reflect.internal.Definitions$DefinitionsClass.symbolsNotPresentInBytecode$lzycompute(Definitions.scala:1196)
[INFO] 	at scala.reflect.internal.Definitions$DefinitionsClass.symbolsNotPresentInBytecode(Definitions.scala:1196)
[INFO] 	at scala.reflect.internal.Definitions$DefinitionsClass.init(Definitions.scala:1261)
[INFO] 	at scala.tools.nsc.Global$Run.<init>(Global.scala:1290)
[INFO] 	at scala.tools.nsc.Driver.doCompile(Driver.scala:32)
[INFO] 	at scala.tools.nsc.Main$.doCompile(Main.scala:79)
[INFO] 	at scala.tools.nsc.Driver.process(Driver.scala:54)
[INFO] 	at scala.tools.nsc.Driver.main(Driver.scala:67)
[INFO] 	at scala.tools.nsc.Main.main(Main.scala)
[INFO] 	at sun.reflect.NativeMethodAccessorImpl.invoke0(Native Method)
[INFO] 	at sun.reflect.NativeMethodAccessorImpl.invoke(NativeMethodAccessorImpl.java:39)
[INFO] 	at sun.reflect.DelegatingMethodAccessorImpl.invoke(DelegatingMethodAccessorImpl.java:25)
[INFO] 	at java.lang.reflect.Method.invoke(Method.java:597)
[INFO] 	at org_scala_tools_maven_executions.MainHelper.runMain(MainHelper.java:161)
[INFO] 	at org_scala_tools_maven_executions.MainWithArgsInFile.main(MainWithArgsInFile.java:26)
[INFO] 
[INFO] ------------------------------------------------------------------------
[INFO] Reactor Summary:
[INFO] 
[INFO] Mahout Build Tools ................................ SUCCESS [29.960s]
[INFO] Apache Mahout ..................................... SUCCESS [6.278s]
[INFO] Mahout Math ....................................... SUCCESS [4:20.514s]
[INFO] Mahout MapReduce Legacy ........................... SUCCESS [11:46.992s]
[INFO] Mahout Integration ................................ SUCCESS [1:15.279s]
[INFO] Mahout Examples ................................... SUCCESS [56.668s]
[INFO] Mahout Release Package ............................ SUCCESS [1:29.359s]
[INFO] Mahout Math Scala bindings ........................ SUCCESS [2:29.174s]
[INFO] Mahout Spark bindings ............................. FAILURE [5.795s]
[INFO] Mahout Spark bindings shell ....................... SKIPPED
[INFO] Mahout H2O backend ................................ SKIPPED
[INFO] ------------------------------------------------------------------------
[INFO] BUILD FAILURE
[INFO] ------------------------------------------------------------------------
[INFO] Total time: 23:46.720s
[INFO] Finished at: Mon Nov 03 23:27:03 UTC 2014
[INFO] Final Memory: 49M/396M
[INFO] ------------------------------------------------------------------------
Waiting for Jenkins to finish collecting data
[ERROR] Failed to execute goal org.scala-tools:maven-scala-plugin:2.15.2:compile (default)
on project mahout-spark_2.10: wrap: org.apache.commons.exec.ExecuteException: Process exited
with an error: 1(Exit value: 1) -> [Help 1]
[ERROR] 
[ERROR] To see the full stack trace of the errors, re-run Maven with the -e switch.
[ERROR] Re-run Maven using the -X switch to enable full debug logging.
[ERROR] 
[ERROR] For more information about the errors and possible solutions, please read the following
articles:
[ERROR] [Help 1] http://cwiki.apache.org/confluence/display/MAVEN/MojoExecutionException
[ERROR] 
[ERROR] After correcting the problems, you can resume the build with the command
[ERROR]   mvn <goals> -rf :mahout-spark_2.10
[JENKINS] Archiving <https://builds.apache.org/job/mahout-nightly/ws/math-scala/pom.xml>
to org.apache.mahout/mahout-math-scala_2.10/1.0-SNAPSHOT/mahout-math-scala_2.10-1.0-SNAPSHOT.pom
[JENKINS] Archiving <https://builds.apache.org/job/mahout-nightly/ws/math-scala/target/mahout-math-scala_2.10-1.0-SNAPSHOT.jar>
to org.apache.mahout/mahout-math-scala_2.10/1.0-20141103.232643-80/mahout-math-scala_2.10-1.0-20141103.232643-80.jar
[JENKINS] Archiving <https://builds.apache.org/job/mahout-nightly/ws/math-scala/target/mahout-math-scala_2.10-1.0-SNAPSHOT-tests.jar>
to org.apache.mahout/mahout-math-scala_2.10/1.0-20141103.232643-80/mahout-math-scala_2.10-1.0-20141103.232643-80-tests.jar
[JENKINS] Archiving <https://builds.apache.org/job/mahout-nightly/ws/math-scala/target/mahout-math-scala_2.10-1.0-SNAPSHOT-sources.jar>
to org.apache.mahout/mahout-math-scala_2.10/1.0-20141103.232643-80/mahout-math-scala_2.10-1.0-20141103.232643-80-sources.jar
Sending artifact delta relative to mahout-nightly » Mahout Math Scala bindings #1732
Archived 4 artifacts
Archive block size is 32768
Received 0 blocks and 734593 bytes
Compression is 0.0%
Took 2.4 sec
[JENKINS] Archiving <https://builds.apache.org/job/mahout-nightly/ws/h2o/pom.xml> to
org.apache.mahout/mahout-h2o/1.0-SNAPSHOT/mahout-h2o-1.0-SNAPSHOT.pom
Sending artifact delta relative to mahout-nightly » Mahout H2O backend #1732
Archived 1 artifacts
Archive block size is 32768
Received 0 blocks and 7311 bytes
Compression is 0.0%
Took 2.9 sec
[JENKINS] Archiving <https://builds.apache.org/job/mahout-nightly/ws/spark-shell/pom.xml>
to org.apache.mahout/mahout-spark-shell_2.10/1.0-SNAPSHOT/mahout-spark-shell_2.10-1.0-SNAPSHOT.pom
Sending artifact delta relative to mahout-nightly » Mahout Spark bindings shell #1732
Archived 1 artifacts
Archive block size is 32768
Received 0 blocks and 5930 bytes
Compression is 0.0%
Took 1.8 sec
[JENKINS] Archiving <https://builds.apache.org/job/mahout-nightly/ws/distribution/pom.xml>
to org.apache.mahout/mahout-distribution/1.0-SNAPSHOT/mahout-distribution-1.0-SNAPSHOT.pom
[JENKINS] Archiving <https://builds.apache.org/job/mahout-nightly/ws/distribution/target/mahout-distribution-1.0-SNAPSHOT.tar.gz>
to org.apache.mahout/mahout-distribution/1.0-20141103.232334-236/mahout-distribution-1.0-20141103.232334-236.tar.gz
[JENKINS] Archiving <https://builds.apache.org/job/mahout-nightly/ws/distribution/target/mahout-distribution-1.0-SNAPSHOT.zip>
to org.apache.mahout/mahout-distribution/1.0-20141103.232334-236/mahout-distribution-1.0-20141103.232334-236.zip
[JENKINS] Archiving <https://builds.apache.org/job/mahout-nightly/ws/distribution/target/mahout-distribution-1.0-SNAPSHOT-src.tar.gz>
to org.apache.mahout/mahout-distribution/1.0-20141103.232334-236/mahout-distribution-1.0-20141103.232334-236-src.tar.gz
[JENKINS] Archiving <https://builds.apache.org/job/mahout-nightly/ws/distribution/target/mahout-distribution-1.0-SNAPSHOT-src.zip>
to org.apache.mahout/mahout-distribution/1.0-20141103.232334-236/mahout-distribution-1.0-20141103.232334-236-src.zip
Sending artifact delta relative to mahout-nightly » Mahout Release Package #1732
Archived 5 artifacts
Archive block size is 32768
Received 1932 blocks and 87732644 bytes
Compression is 41.9%
Took 1 min 5 sec
[JENKINS] Archiving <https://builds.apache.org/job/mahout-nightly/ws/integration/pom.xml>
to org.apache.mahout/mahout-integration/1.0-SNAPSHOT/mahout-integration-1.0-SNAPSHOT.pom
[JENKINS] Archiving <https://builds.apache.org/job/mahout-nightly/ws/integration/target/mahout-integration-1.0-SNAPSHOT.jar>
to org.apache.mahout/mahout-integration/1.0-20141103.232134-244/mahout-integration-1.0-20141103.232134-244.jar
[JENKINS] Archiving <https://builds.apache.org/job/mahout-nightly/ws/integration/target/mahout-integration-1.0-SNAPSHOT-sources.jar>
to org.apache.mahout/mahout-integration/1.0-20141103.232134-244/mahout-integration-1.0-20141103.232134-244-sources.jar
Sending artifact delta relative to mahout-nightly » Mahout Integration #1732
Archived 3 artifacts
Archive block size is 32768
Received 0 blocks and 698621 bytes
Compression is 0.0%
Took 2.3 sec
[JENKINS] Archiving <https://builds.apache.org/job/mahout-nightly/ws/pom.xml> to org.apache.mahout/mahout/1.0-SNAPSHOT/mahout-1.0-SNAPSHOT.pom
Sending artifact delta relative to mahout-nightly » Apache Mahout #1732
Archived 1 artifacts
Archive block size is 32768
Received 1 blocks and 11335 bytes
Compression is 74.3%
Took 0.22 sec
[JENKINS] Archiving <https://builds.apache.org/job/mahout-nightly/ws/spark/pom.xml>
to org.apache.mahout/mahout-spark_2.10/1.0-SNAPSHOT/mahout-spark_2.10-1.0-SNAPSHOT.pom
Sending artifact delta relative to mahout-nightly » Mahout Spark bindings #1732
Archived 1 artifacts
Archive block size is 32768
Received 0 blocks and 10259 bytes
Compression is 0.0%
Took 5.2 sec
[JENKINS] Archiving <https://builds.apache.org/job/mahout-nightly/ws/math/pom.xml> to
org.apache.mahout/mahout-math/1.0-SNAPSHOT/mahout-math-1.0-SNAPSHOT.pom
[JENKINS] Archiving <https://builds.apache.org/job/mahout-nightly/ws/math/target/mahout-math-1.0-SNAPSHOT.jar>
to org.apache.mahout/mahout-math/1.0-20141103.230819-250/mahout-math-1.0-20141103.230819-250.jar
[JENKINS] Archiving <https://builds.apache.org/job/mahout-nightly/ws/math/target/mahout-math-1.0-SNAPSHOT-tests.jar>
to org.apache.mahout/mahout-math/1.0-20141103.230819-250/mahout-math-1.0-20141103.230819-250-tests.jar
[JENKINS] Archiving <https://builds.apache.org/job/mahout-nightly/ws/math/target/mahout-math-1.0-SNAPSHOT-sources.jar>
to org.apache.mahout/mahout-math/1.0-20141103.230819-250/mahout-math-1.0-20141103.230819-250-sources.jar
Sending artifact delta relative to mahout-nightly » Mahout Math #1732
Archived 4 artifacts
Archive block size is 32768
Received 1 blocks and 3582604 bytes
Compression is 0.9%
Took 3 sec
[JENKINS] Archiving <https://builds.apache.org/job/mahout-nightly/ws/examples/pom.xml>
to org.apache.mahout/mahout-examples/1.0-SNAPSHOT/mahout-examples-1.0-SNAPSHOT.pom
[JENKINS] Archiving <https://builds.apache.org/job/mahout-nightly/ws/examples/target/mahout-examples-1.0-SNAPSHOT.jar>
to org.apache.mahout/mahout-examples/1.0-20141103.232228-244/mahout-examples-1.0-20141103.232228-244.jar
[JENKINS] Archiving <https://builds.apache.org/job/mahout-nightly/ws/examples/target/mahout-examples-1.0-SNAPSHOT-job.jar>
to org.apache.mahout/mahout-examples/1.0-20141103.232228-244/mahout-examples-1.0-20141103.232228-244-job.jar
[JENKINS] Archiving <https://builds.apache.org/job/mahout-nightly/ws/examples/target/mahout-examples-1.0-SNAPSHOT-sources.jar>
to org.apache.mahout/mahout-examples/1.0-20141103.232228-244/mahout-examples-1.0-20141103.232228-244-sources.jar
Sending artifact delta relative to mahout-nightly » Mahout Examples #1732
Archived 4 artifacts
Archive block size is 32768
Received 663 blocks and 4949118 bytes
Compression is 81.4%
Took 5.7 sec
[JENKINS] Archiving <https://builds.apache.org/job/mahout-nightly/ws/mrlegacy/pom.xml>
to org.apache.mahout/mahout-mrlegacy/1.0-SNAPSHOT/mahout-mrlegacy-1.0-SNAPSHOT.pom
[JENKINS] Archiving <https://builds.apache.org/job/mahout-nightly/ws/mrlegacy/target/mahout-mrlegacy-1.0-SNAPSHOT.jar>
to org.apache.mahout/mahout-mrlegacy/1.0-20141103.231959-162/mahout-mrlegacy-1.0-20141103.231959-162.jar
[JENKINS] Archiving <https://builds.apache.org/job/mahout-nightly/ws/mrlegacy/target/mahout-mrlegacy-1.0-SNAPSHOT-tests.jar>
to org.apache.mahout/mahout-mrlegacy/1.0-20141103.231959-162/mahout-mrlegacy-1.0-20141103.231959-162-tests.jar
[JENKINS] Archiving <https://builds.apache.org/job/mahout-nightly/ws/mrlegacy/target/mahout-mrlegacy-1.0-SNAPSHOT-job.jar>
to org.apache.mahout/mahout-mrlegacy/1.0-20141103.231959-162/mahout-mrlegacy-1.0-20141103.231959-162-job.jar
[JENKINS] Archiving <https://builds.apache.org/job/mahout-nightly/ws/mrlegacy/target/mahout-mrlegacy-1.0-SNAPSHOT-sources.jar>
to org.apache.mahout/mahout-mrlegacy/1.0-20141103.231959-162/mahout-mrlegacy-1.0-20141103.231959-162-sources.jar
Sending artifact delta relative to mahout-nightly » Mahout MapReduce Legacy #1732
Archived 5 artifacts
Archive block size is 32768
Received 351 blocks and 6130473 bytes
Compression is 65.2%
Took 5.8 sec
[JENKINS] Archiving <https://builds.apache.org/job/mahout-nightly/ws/buildtools/pom.xml>
to org.apache.mahout/mahout-buildtools/1.0-SNAPSHOT/mahout-buildtools-1.0-SNAPSHOT.pom
[JENKINS] Archiving <https://builds.apache.org/job/mahout-nightly/ws/buildtools/target/mahout-buildtools-1.0-SNAPSHOT.jar>
to org.apache.mahout/mahout-buildtools/1.0-20141103.230347-253/mahout-buildtools-1.0-20141103.230347-253.jar
Sending artifact delta relative to mahout-nightly » Mahout Build Tools #1732
Archived 2 artifacts
Archive block size is 32768
Received 0 blocks and 19153 bytes
Compression is 0.0%
Took 2 sec
Sending e-mails to: dev@mahout.apache.org
channel stopped

Mime
View raw message