mahout-dev mailing list archives

Site index · List index
Message view « Date » · « Thread »
Top « Date » · « Thread »
From Apache Jenkins Server <jenk...@builds.apache.org>
Subject Build failed in Jenkins: Mahout-Quality #2477
Date Sun, 16 Feb 2014 06:25:26 GMT
See <https://builds.apache.org/job/Mahout-Quality/2477/changes>

Changes:

[smarthi] MAHOUT-1417: Random decision forest implementation fails in Hadoop 2

------------------------------------------
[...truncated 4335 lines...]
Running org.apache.mahout.clustering.TestGaussianAccumulators
Running org.apache.mahout.cf.taste.impl.common.FastByIDMapTest
Running org.apache.mahout.cf.taste.common.CommonTest
Running org.apache.mahout.clustering.classify.ClusterClassificationDriverTest
Tests run: 8, Failures: 0, Errors: 0, Skipped: 0, Time elapsed: 0.823 sec - in org.apache.mahout.cf.taste.impl.common.InvertedRunningAverageTest
Tests run: 3, Failures: 0, Errors: 0, Skipped: 0, Time elapsed: 0.436 sec - in org.apache.mahout.cf.taste.common.CommonTest
Running org.apache.mahout.clustering.lda.cvb.TestCVBModelTrainer
Running org.apache.mahout.clustering.canopy.TestCanopyCreation
Tests run: 9, Failures: 0, Errors: 0, Skipped: 0, Time elapsed: 1.386 sec - in org.apache.mahout.cf.taste.impl.common.FastByIDMapTest
Running org.apache.mahout.clustering.kmeans.TestEigenSeedGenerator
Tests run: 1, Failures: 0, Errors: 0, Skipped: 0, Time elapsed: 2.1 sec - in org.apache.mahout.clustering.kmeans.TestEigenSeedGenerator
Running org.apache.mahout.clustering.kmeans.TestRandomSeedGenerator
Tests run: 3, Failures: 0, Errors: 0, Skipped: 0, Time elapsed: 5.815 sec - in org.apache.mahout.clustering.classify.ClusterClassificationDriverTest
Tests run: 6, Failures: 0, Errors: 0, Skipped: 0, Time elapsed: 6.067 sec - in org.apache.mahout.clustering.TestGaussianAccumulators
Running org.apache.mahout.clustering.kmeans.TestKmeansClustering
Running org.apache.mahout.clustering.TestClusterInterface
Tests run: 8, Failures: 0, Errors: 0, Skipped: 0, Time elapsed: 0.873 sec - in org.apache.mahout.clustering.TestClusterInterface
Tests run: 1, Failures: 0, Errors: 0, Skipped: 0, Time elapsed: 2.307 sec - in org.apache.mahout.clustering.kmeans.TestRandomSeedGenerator
Running org.apache.mahout.clustering.topdown.PathDirectoryTest
Tests run: 21, Failures: 0, Errors: 0, Skipped: 0, Time elapsed: 35.493 sec - in org.apache.mahout.cf.taste.hadoop.item.RecommenderJobTest
Running org.apache.mahout.clustering.topdown.postprocessor.ClusterOutputPostProcessorTest
Tests run: 5, Failures: 0, Errors: 0, Skipped: 0, Time elapsed: 0.756 sec - in org.apache.mahout.clustering.topdown.PathDirectoryTest
Running org.apache.mahout.clustering.streaming.cluster.StreamingKMeansTest
Running org.apache.mahout.clustering.topdown.postprocessor.ClusterCountReaderTest
Tests run: 1, Failures: 0, Errors: 0, Skipped: 0, Time elapsed: 3.273 sec - in org.apache.mahout.clustering.topdown.postprocessor.ClusterCountReaderTest
Tests run: 1, Failures: 0, Errors: 0, Skipped: 0, Time elapsed: 4.259 sec - in org.apache.mahout.clustering.topdown.postprocessor.ClusterOutputPostProcessorTest
Running org.apache.mahout.clustering.streaming.cluster.BallKMeansTest
Running org.apache.mahout.clustering.spectral.TestVectorMatrixMultiplicationJob
Tests run: 1, Failures: 0, Errors: 0, Skipped: 0, Time elapsed: 1.736 sec - in org.apache.mahout.clustering.spectral.TestVectorMatrixMultiplicationJob
Running org.apache.mahout.clustering.spectral.TestAffinityMatrixInputJob
Tests run: 2, Failures: 0, Errors: 0, Skipped: 0, Time elapsed: 1.822 sec - in org.apache.mahout.clustering.spectral.TestAffinityMatrixInputJob
Running org.apache.mahout.clustering.spectral.TestMatrixDiagonalizeJob
Tests run: 17, Failures: 0, Errors: 0, Skipped: 0, Time elapsed: 17.625 sec - in org.apache.mahout.clustering.canopy.TestCanopyCreation
Running org.apache.mahout.clustering.spectral.TestUnitVectorizerJob
Tests run: 2, Failures: 0, Errors: 0, Skipped: 0, Time elapsed: 1.793 sec - in org.apache.mahout.clustering.spectral.TestMatrixDiagonalizeJob
Running org.apache.mahout.clustering.spectral.TestVectorCache
Tests run: 1, Failures: 0, Errors: 0, Skipped: 0, Time elapsed: 1.714 sec - in org.apache.mahout.clustering.spectral.TestUnitVectorizerJob
Running org.apache.mahout.clustering.fuzzykmeans.TestFuzzyKmeansClustering
Tests run: 3, Failures: 0, Errors: 0, Skipped: 0, Time elapsed: 2.142 sec - in org.apache.mahout.clustering.spectral.TestVectorCache
Running org.apache.mahout.clustering.iterator.TestClusterClassifier
Tests run: 6, Failures: 0, Errors: 0, Skipped: 0, Time elapsed: 69.694 sec - in org.apache.mahout.vectorizer.SparseVectorsFromSequenceFilesTest
Running org.apache.mahout.ep.EvolutionaryProcessTest
Tests run: 1, Failures: 0, Errors: 0, Skipped: 0, Time elapsed: 1.608 sec - in org.apache.mahout.ep.EvolutionaryProcessTest
Running org.apache.mahout.fpm.pfpgrowth.PFPGrowthRetailDataTest
Tests run: 12, Failures: 0, Errors: 0, Skipped: 0, Time elapsed: 8.794 sec - in org.apache.mahout.clustering.iterator.TestClusterClassifier
Running org.apache.mahout.fpm.pfpgrowth.fpgrowth.FrequentPatternMaxHeapTest
Tests run: 4, Failures: 0, Errors: 0, Skipped: 0, Time elapsed: 28.446 sec - in org.apache.mahout.clustering.kmeans.TestKmeansClustering
Tests run: 1, Failures: 0, Errors: 0, Skipped: 0, Time elapsed: 0.956 sec - in org.apache.mahout.fpm.pfpgrowth.fpgrowth.FrequentPatternMaxHeapTest
Running org.apache.mahout.fpm.pfpgrowth.FPGrowthTest
Running org.apache.mahout.fpm.pfpgrowth.TransactionTreeTest
Tests run: 4, Failures: 0, Errors: 0, Skipped: 0, Time elapsed: 2.332 sec - in org.apache.mahout.fpm.pfpgrowth.FPGrowthTest
Running org.apache.mahout.fpm.pfpgrowth.FPGrowthRetailDataTest
Tests run: 1, Failures: 0, Errors: 0, Skipped: 0, Time elapsed: 7.634 sec - in org.apache.mahout.fpm.pfpgrowth.TransactionTreeTest
Running org.apache.mahout.fpm.pfpgrowth.PFPGrowthTest
Tests run: 1, Failures: 0, Errors: 0, Skipped: 0, Time elapsed: 6.03 sec - in org.apache.mahout.fpm.pfpgrowth.FPGrowthRetailDataTest
Running org.apache.mahout.fpm.pfpgrowth.FPGrowthSyntheticDataTest
Tests run: 2, Failures: 0, Errors: 0, Skipped: 0, Time elapsed: 12.74 sec - in org.apache.mahout.fpm.pfpgrowth.PFPGrowthTest
Running org.apache.mahout.classifier.evaluation.AucTest
Tests run: 3, Failures: 0, Errors: 0, Skipped: 0, Time elapsed: 1.546 sec - in org.apache.mahout.classifier.evaluation.AucTest
Tests run: 2, Failures: 0, Errors: 0, Skipped: 0, Time elapsed: 38.113 sec - in org.apache.mahout.clustering.fuzzykmeans.TestFuzzyKmeansClustering
Running org.apache.mahout.classifier.sequencelearning.hmm.HMMModelTest
Running org.apache.mahout.classifier.sequencelearning.hmm.HMMEvaluatorTest
Tests run: 1, Failures: 0, Errors: 0, Skipped: 0, Time elapsed: 0.739 sec - in org.apache.mahout.classifier.sequencelearning.hmm.HMMModelTest
Tests run: 2, Failures: 0, Errors: 0, Skipped: 0, Time elapsed: 0.779 sec - in org.apache.mahout.classifier.sequencelearning.hmm.HMMEvaluatorTest
Running org.apache.mahout.classifier.sequencelearning.hmm.HMMUtilsTest
Tests run: 7, Failures: 0, Errors: 0, Skipped: 0, Time elapsed: 0.574 sec - in org.apache.mahout.classifier.sequencelearning.hmm.HMMUtilsTest
Running org.apache.mahout.classifier.sequencelearning.hmm.HMMTrainerTest
Running org.apache.mahout.classifier.sequencelearning.hmm.HMMAlgorithmsTest
Tests run: 4, Failures: 0, Errors: 0, Skipped: 0, Time elapsed: 0.82 sec - in org.apache.mahout.classifier.sequencelearning.hmm.HMMTrainerTest
Running org.apache.mahout.classifier.naivebayes.NaiveBayesModelTest
Tests run: 6, Failures: 0, Errors: 0, Skipped: 0, Time elapsed: 0.856 sec - in org.apache.mahout.classifier.sequencelearning.hmm.HMMAlgorithmsTest
Tests run: 1, Failures: 0, Errors: 0, Skipped: 0, Time elapsed: 0.671 sec - in org.apache.mahout.classifier.naivebayes.NaiveBayesModelTest
Running org.apache.mahout.classifier.naivebayes.training.IndexInstancesMapperTest
Running org.apache.mahout.classifier.naivebayes.training.WeightsMapperTest
Tests run: 2, Failures: 0, Errors: 0, Skipped: 0, Time elapsed: 1.251 sec - in org.apache.mahout.classifier.naivebayes.training.IndexInstancesMapperTest
Tests run: 1, Failures: 0, Errors: 0, Skipped: 0, Time elapsed: 1.059 sec - in org.apache.mahout.classifier.naivebayes.training.WeightsMapperTest
Running org.apache.mahout.classifier.naivebayes.training.ThetaMapperTest
Running org.apache.mahout.classifier.naivebayes.ComplementaryNaiveBayesClassifierTest
Tests run: 1, Failures: 0, Errors: 0, Skipped: 0, Time elapsed: 0.731 sec - in org.apache.mahout.classifier.naivebayes.training.ThetaMapperTest
Tests run: 1, Failures: 0, Errors: 0, Skipped: 0, Time elapsed: 0.377 sec - in org.apache.mahout.classifier.naivebayes.ComplementaryNaiveBayesClassifierTest
Running org.apache.mahout.classifier.naivebayes.StandardNaiveBayesClassifierTest
Running org.apache.mahout.classifier.naivebayes.NaiveBayesTest
Tests run: 1, Failures: 0, Errors: 0, Skipped: 0, Time elapsed: 0.401 sec - in org.apache.mahout.classifier.naivebayes.StandardNaiveBayesClassifierTest
Running org.apache.mahout.classifier.RegressionResultAnalyzerTest
Tests run: 2, Failures: 0, Errors: 0, Skipped: 0, Time elapsed: 0.641 sec - in org.apache.mahout.classifier.RegressionResultAnalyzerTest
Running org.apache.mahout.classifier.mlp.TestMultilayerPerceptron
Tests run: 1, Failures: 0, Errors: 0, Skipped: 0, Time elapsed: 4.154 sec - in org.apache.mahout.classifier.mlp.TestMultilayerPerceptron
Running org.apache.mahout.classifier.mlp.TestNeuralNetwork
Tests run: 2, Failures: 0, Errors: 0, Skipped: 0, Time elapsed: 8.958 sec - in org.apache.mahout.classifier.naivebayes.NaiveBayesTest
Running org.apache.mahout.classifier.ConfusionMatrixTest
Tests run: 2, Failures: 0, Errors: 0, Skipped: 0, Time elapsed: 0.772 sec - in org.apache.mahout.classifier.ConfusionMatrixTest
Running org.apache.mahout.classifier.sgd.ModelSerializerTest
Tests run: 2, Failures: 0, Errors: 0, Skipped: 0, Time elapsed: 80.751 sec - in org.apache.mahout.clustering.lda.cvb.TestCVBModelTrainer
Running org.apache.mahout.classifier.sgd.CsvRecordFactoryTest
Tests run: 4, Failures: 0, Errors: 0, Skipped: 0, Time elapsed: 3.246 sec - in org.apache.mahout.classifier.sgd.ModelSerializerTest
Tests run: 2, Failures: 0, Errors: 0, Skipped: 0, Time elapsed: 0.941 sec - in org.apache.mahout.classifier.sgd.CsvRecordFactoryTest
Running org.apache.mahout.classifier.sgd.PassiveAggressiveTest
Running org.apache.mahout.classifier.sgd.OnlineLogisticRegressionTest
Tests run: 1, Failures: 0, Errors: 0, Skipped: 0, Time elapsed: 0.864 sec - in org.apache.mahout.classifier.sgd.PassiveAggressiveTest
Running org.apache.mahout.classifier.sgd.AdaptiveLogisticRegressionTest
Tests run: 3, Failures: 0, Errors: 0, Skipped: 0, Time elapsed: 73.503 sec - in org.apache.mahout.clustering.streaming.cluster.BallKMeansTest
Running org.apache.mahout.classifier.sgd.GradientMachineTest
Tests run: 1, Failures: 0, Errors: 0, Skipped: 0, Time elapsed: 0.61 sec - in org.apache.mahout.classifier.sgd.GradientMachineTest
Running org.apache.mahout.classifier.df.DecisionForestTest
Tests run: 3, Failures: 0, Errors: 0, Skipped: 0, Time elapsed: 2.803 sec - in org.apache.mahout.classifier.df.DecisionForestTest
Running org.apache.mahout.classifier.df.builder.DefaultTreeBuilderTest
Tests run: 1, Failures: 0, Errors: 0, Skipped: 0, Time elapsed: 1.234 sec - in org.apache.mahout.classifier.df.builder.DefaultTreeBuilderTest
Running org.apache.mahout.classifier.df.builder.InfiniteRecursionTest
Tests run: 1, Failures: 0, Errors: 0, Skipped: 0, Time elapsed: 1.863 sec - in org.apache.mahout.classifier.df.builder.InfiniteRecursionTest
Tests run: 6, Failures: 0, Errors: 0, Skipped: 0, Time elapsed: 122.495 sec - in org.apache.mahout.cf.taste.hadoop.als.ParallelALSFactorizationJobTest
Running org.apache.mahout.classifier.df.builder.DecisionTreeBuilderTest
Running org.apache.mahout.classifier.df.mapreduce.partial.PartialBuilderTest
Tests run: 5, Failures: 0, Errors: 0, Skipped: 0, Time elapsed: 13.017 sec - in org.apache.mahout.classifier.sgd.AdaptiveLogisticRegressionTest
Tests run: 1, Failures: 0, Errors: 0, Skipped: 0, Time elapsed: 1.194 sec - in org.apache.mahout.classifier.df.builder.DecisionTreeBuilderTest
Tests run: 2, Failures: 0, Errors: 0, Skipped: 0, Time elapsed: 153.711 sec - in org.apache.mahout.math.neighborhood.LocalitySensitiveHashSearchTest
Running org.apache.mahout.classifier.df.mapreduce.partial.TreeIDTest
Running org.apache.mahout.classifier.df.mapreduce.partial.Step1MapperTest
Running org.apache.mahout.classifier.df.mapreduce.inmem.InMemInputSplitTest
Tests run: 2, Failures: 0, Errors: 0, Skipped: 0, Time elapsed: 0.633 sec - in org.apache.mahout.classifier.df.mapreduce.inmem.InMemInputSplitTest
Tests run: 2, Failures: 0, Errors: 0, Skipped: 0, Time elapsed: 2.784 sec - in org.apache.mahout.classifier.df.mapreduce.partial.PartialBuilderTest
Running org.apache.mahout.classifier.df.split.DefaultIgSplitTest
Running org.apache.mahout.classifier.df.mapreduce.inmem.InMemInputFormatTest
Tests run: 1, Failures: 1, Errors: 0, Skipped: 0, Time elapsed: 2.213 sec <<< FAILURE!
- in org.apache.mahout.classifier.df.mapreduce.partial.Step1MapperTest
testMapper(org.apache.mahout.classifier.df.mapreduce.partial.Step1MapperTest)  Time elapsed:
1.538 sec  <<< FAILURE!
java.lang.AssertionError: 
  Unexpected method call Context.progress():
	at __randomizedtesting.SeedInfo.seed([74A25C19E9BA63F5:BED62C1582852A84]:0)
	at org.easymock.internal.MockInvocationHandler.invoke(MockInvocationHandler.java:44)
	at org.easymock.internal.ObjectMethodsFilter.invoke(ObjectMethodsFilter.java:94)
	at org.easymock.internal.ClassProxyFactory$MockMethodInterceptor.intercept(ClassProxyFactory.java:97)
	at org.apache.hadoop.mapreduce.Mapper$Context$$EnhancerByCGLIB$$8b5a9281.progress(<generated>)
	at org.apache.mahout.classifier.df.mapreduce.partial.Step1Mapper.cleanup(Step1Mapper.java:163)
	at org.apache.mahout.classifier.df.mapreduce.partial.Step1MapperTest.testMapper(Step1MapperTest.java:146)

Tests run: 2, Failures: 0, Errors: 0, Skipped: 0, Time elapsed: 0.837 sec - in org.apache.mahout.classifier.df.mapreduce.inmem.InMemInputFormatTest
Running org.apache.mahout.classifier.df.split.OptIgSplitTest
Tests run: 1, Failures: 0, Errors: 0, Skipped: 0, Time elapsed: 3.496 sec - in org.apache.mahout.classifier.df.mapreduce.partial.TreeIDTest
Running org.apache.mahout.classifier.df.split.RegressionSplitTest
Tests run: 1, Failures: 0, Errors: 0, Skipped: 0, Time elapsed: 1.822 sec - in org.apache.mahout.classifier.df.split.DefaultIgSplitTest
Running org.apache.mahout.classifier.df.tools.VisualizerTest
Running org.apache.mahout.classifier.df.data.DataTest
Tests run: 1, Failures: 0, Errors: 0, Skipped: 0, Time elapsed: 1.408 sec - in org.apache.mahout.classifier.df.split.RegressionSplitTest
Tests run: 1, Failures: 0, Errors: 0, Skipped: 0, Time elapsed: 2.773 sec - in org.apache.mahout.classifier.df.split.OptIgSplitTest
Tests run: 5, Failures: 0, Errors: 0, Skipped: 0, Time elapsed: 1.633 sec - in org.apache.mahout.classifier.df.tools.VisualizerTest
Running org.apache.mahout.classifier.df.data.DataLoaderTest
Running org.apache.mahout.classifier.df.data.DescriptorUtilsTest
Running org.apache.mahout.classifier.df.data.DatasetTest
Tests run: 2, Failures: 0, Errors: 0, Skipped: 0, Time elapsed: 0.672 sec - in org.apache.mahout.classifier.df.data.DescriptorUtilsTest
Running org.apache.mahout.classifier.df.data.DataConverterTest
Tests run: 10, Failures: 0, Errors: 0, Skipped: 0, Time elapsed: 3.947 sec - in org.apache.mahout.classifier.df.data.DataTest
Tests run: 2, Failures: 0, Errors: 0, Skipped: 0, Time elapsed: 2.006 sec - in org.apache.mahout.classifier.df.data.DatasetTest
Running org.apache.mahout.classifier.df.node.NodeTest
Running org.apache.mahout.common.lucene.AnalyzerUtilsTest
Tests run: 4, Failures: 0, Errors: 0, Skipped: 0, Time elapsed: 3.85 sec - in org.apache.mahout.classifier.df.data.DataLoaderTest
Tests run: 2, Failures: 0, Errors: 0, Skipped: 0, Time elapsed: 0.301 sec - in org.apache.mahout.common.lucene.AnalyzerUtilsTest
Tests run: 4, Failures: 0, Errors: 0, Skipped: 0, Time elapsed: 0.584 sec - in org.apache.mahout.classifier.df.node.NodeTest
Tests run: 1, Failures: 0, Errors: 0, Skipped: 0, Time elapsed: 2.056 sec - in org.apache.mahout.classifier.df.data.DataConverterTest
Running org.apache.mahout.common.distance.TestEuclideanDistanceMeasure
Running org.apache.mahout.common.distance.TestChebyshevMeasure
Running org.apache.mahout.common.distance.TestManhattanDistanceMeasure
Running org.apache.mahout.common.distance.TestWeightedEuclideanDistanceMeasureTest
Tests run: 1, Failures: 0, Errors: 0, Skipped: 0, Time elapsed: 0.728 sec - in org.apache.mahout.common.distance.TestEuclideanDistanceMeasure
Tests run: 1, Failures: 0, Errors: 0, Skipped: 0, Time elapsed: 0.536 sec - in org.apache.mahout.common.distance.TestChebyshevMeasure
Tests run: 1, Failures: 0, Errors: 0, Skipped: 0, Time elapsed: 0.878 sec - in org.apache.mahout.common.distance.TestManhattanDistanceMeasure
Running org.apache.mahout.common.distance.TestWeightedManhattanDistanceMeasure
Tests run: 2, Failures: 0, Errors: 0, Skipped: 0, Time elapsed: 1.127 sec - in org.apache.mahout.common.distance.TestWeightedEuclideanDistanceMeasureTest
Running org.apache.mahout.common.distance.TestTanimotoDistanceMeasure
Running org.apache.mahout.common.distance.CosineDistanceMeasureTest
Tests run: 2, Failures: 0, Errors: 0, Skipped: 0, Time elapsed: 0.673 sec - in org.apache.mahout.common.distance.TestTanimotoDistanceMeasure
Tests run: 2, Failures: 0, Errors: 0, Skipped: 0, Time elapsed: 0.733 sec - in org.apache.mahout.common.distance.TestWeightedManhattanDistanceMeasure
Running org.apache.mahout.common.distance.TestMinkowskiMeasure
Tests run: 1, Failures: 0, Errors: 0, Skipped: 0, Time elapsed: 0.731 sec - in org.apache.mahout.common.distance.CosineDistanceMeasureTest
Running org.apache.mahout.common.IntPairWritableTest
Tests run: 1, Failures: 0, Errors: 0, Skipped: 0, Time elapsed: 0.547 sec - in org.apache.mahout.common.distance.TestMinkowskiMeasure
Running org.apache.mahout.common.distance.TestMahalanobisDistanceMeasure
Running org.apache.mahout.common.AbstractJobTest
Running org.apache.mahout.common.DummyRecordWriterTest
Tests run: 3, Failures: 0, Errors: 0, Skipped: 0, Time elapsed: 0.884 sec - in org.apache.mahout.common.IntPairWritableTest
Tests run: 1, Failures: 0, Errors: 0, Skipped: 0, Time elapsed: 0.246 sec - in org.apache.mahout.common.DummyRecordWriterTest
Tests run: 1, Failures: 0, Errors: 0, Skipped: 0, Time elapsed: 0.77 sec - in org.apache.mahout.common.distance.TestMahalanobisDistanceMeasure
Running org.apache.mahout.common.StringUtilsTest
Running org.apache.mahout.common.iterator.TestFixedSizeSampler
Running org.apache.mahout.common.MahoutTestCase
Tests run: 0, Failures: 0, Errors: 0, Skipped: 0, Time elapsed: 0.469 sec - in org.apache.mahout.common.MahoutTestCase
Tests run: 3, Failures: 0, Errors: 0, Skipped: 0, Time elapsed: 2.105 sec - in org.apache.mahout.common.AbstractJobTest
Tests run: 5, Failures: 0, Errors: 0, Skipped: 0, Time elapsed: 1.072 sec - in org.apache.mahout.common.iterator.TestFixedSizeSampler
Running org.apache.mahout.common.iterator.TestSamplingIterator
Tests run: 2, Failures: 0, Errors: 0, Skipped: 0, Time elapsed: 1.551 sec - in org.apache.mahout.common.StringUtilsTest
Running org.apache.mahout.common.iterator.TestStableFixedSizeSampler
Running org.apache.mahout.common.iterator.CountingIteratorTest
Tests run: 5, Failures: 0, Errors: 0, Skipped: 0, Time elapsed: 0.805 sec - in org.apache.mahout.common.iterator.TestStableFixedSizeSampler
Tests run: 2, Failures: 0, Errors: 0, Skipped: 0, Time elapsed: 0.552 sec - in org.apache.mahout.common.iterator.CountingIteratorTest
Tests run: 6, Failures: 0, Errors: 0, Skipped: 0, Time elapsed: 2.603 sec - in org.apache.mahout.common.iterator.TestSamplingIterator
Tests run: 8, Failures: 0, Errors: 0, Skipped: 0, Time elapsed: 114.618 sec - in org.apache.mahout.clustering.streaming.cluster.StreamingKMeansTest
Tests run: 6, Failures: 0, Errors: 0, Skipped: 0, Time elapsed: 49.812 sec - in org.apache.mahout.classifier.sgd.OnlineLogisticRegressionTest
Tests run: 5, Failures: 0, Errors: 0, Skipped: 0, Time elapsed: 73.054 sec - in org.apache.mahout.classifier.mlp.TestNeuralNetwork
Tests run: 5, Failures: 0, Errors: 0, Skipped: 0, Time elapsed: 170.911 sec - in org.apache.mahout.cf.taste.impl.recommender.svd.ParallelSGDFactorizerTest
Tests run: 8, Failures: 0, Errors: 0, Skipped: 0, Time elapsed: 242.347 sec - in org.apache.mahout.math.neighborhood.SearchQualityTest
Tests run: 2, Failures: 0, Errors: 0, Skipped: 0, Time elapsed: 186.262 sec - in org.apache.mahout.fpm.pfpgrowth.FPGrowthSyntheticDataTest
Tests run: 2, Failures: 0, Errors: 0, Skipped: 0, Time elapsed: 243.982 sec - in org.apache.mahout.fpm.pfpgrowth.PFPGrowthRetailDataTest
Tests run: 21, Failures: 0, Errors: 0, Skipped: 0, Time elapsed: 353.712 sec - in org.apache.mahout.math.neighborhood.SearchSanityTest

Results :

Failed tests: 
  Step1MapperTest.testMapper:146 
  Unexpected method call Context.progress():

Tests run: 761, Failures: 1, Errors: 0, Skipped: 0

[INFO] ------------------------------------------------------------------------
[INFO] Reactor Summary:
[INFO] 
[INFO] Mahout Build Tools ................................ SUCCESS [11.990s]
[INFO] Apache Mahout ..................................... SUCCESS [3.298s]
[INFO] Mahout Math ....................................... SUCCESS [2:46.573s]
[INFO] Mahout Core ....................................... FAILURE [6:05.222s]
[INFO] Mahout Integration ................................ SKIPPED
[INFO] Mahout Examples ................................... SKIPPED
[INFO] Mahout Release Package ............................ SKIPPED
[INFO] Mahout Math/Scala wrappers ........................ SKIPPED
[INFO] ------------------------------------------------------------------------
[INFO] BUILD FAILURE
[INFO] ------------------------------------------------------------------------
[INFO] Total time: 9:11.682s
[INFO] Finished at: Sun Feb 16 06:25:08 UTC 2014
[INFO] Final Memory: 50M/345M
[INFO] ------------------------------------------------------------------------
[ERROR] Failed to execute goal org.apache.maven.plugins:maven-surefire-plugin:2.16:test (default-test)
on project mahout-core: There are test failures.
[ERROR] 
[ERROR] Please refer to /home/hudson/jenkins-slave/workspace/Mahout-Quality/trunk/core/target/surefire-reports
for the individual test results.
[ERROR] -> [Help 1]
[ERROR] 
[ERROR] To see the full stack trace of the errors, re-run Maven with the -e switch.
[ERROR] Re-run Maven using the -X switch to enable full debug logging.
[ERROR] 
[ERROR] For more information about the errors and possible solutions, please read the following
articles:
[ERROR] [Help 1] http://cwiki.apache.org/confluence/display/MAVEN/MojoFailureException
[ERROR] 
[ERROR] After correcting the problems, you can resume the build with the command
[ERROR]   mvn <goals> -rf :mahout-core
Build step 'Invoke top-level Maven targets' marked build as failure
[FINDBUGS] Skipping publisher since build result is FAILURE
[PMD] Skipping publisher since build result is FAILURE
[TASKS] Skipping publisher since build result is FAILURE
Archiving artifacts
Recording test results
Publishing Javadoc
Updating MAHOUT-1417

Mime
View raw message