mahout-dev mailing list archives

Site index · List index
Message view « Date » · « Thread »
Top « Date » · « Thread »
From Apache Jenkins Server <jenk...@builds.apache.org>
Subject Build failed in Jenkins: mahout-nightly #1476
Date Sat, 25 Jan 2014 23:04:14 GMT
See <https://builds.apache.org/job/mahout-nightly/1476/changes>

Changes:

[tdunning] MAHOUT-1409 - bad index checking in viewColumn or viewRow.

[tdunning] MAHOUT-1390 - Fixed extraneous commit.

------------------------------------------
[...truncated 2465 lines...]
Running org.apache.mahout.math.map.OpenFloatDoubleHashMapTest
Running org.apache.mahout.math.map.OpenByteIntHashMapTest
Tests run: 17, Failures: 0, Errors: 0, Skipped: 0, Time elapsed: 0.207 sec - in org.apache.mahout.math.map.OpenByteByteHashMapTest
Tests run: 17, Failures: 0, Errors: 0, Skipped: 0, Time elapsed: 0.229 sec - in org.apache.mahout.math.map.OpenByteCharHashMapTest
Tests run: 17, Failures: 0, Errors: 0, Skipped: 0, Time elapsed: 0.259 sec - in org.apache.mahout.math.map.OpenShortFloatHashMapTest
Running org.apache.mahout.math.map.OpenIntByteHashMapTest
Tests run: 17, Failures: 0, Errors: 0, Skipped: 0, Time elapsed: 0.259 sec - in org.apache.mahout.math.map.OpenFloatDoubleHashMapTest
Running org.apache.mahout.math.map.OpenLongByteHashMapTest
Tests run: 17, Failures: 0, Errors: 0, Skipped: 0, Time elapsed: 0.283 sec - in org.apache.mahout.math.map.OpenByteIntHashMapTest
Running org.apache.mahout.math.map.OpenByteObjectHashMapTest
Tests run: 17, Failures: 0, Errors: 0, Skipped: 0, Time elapsed: 0.187 sec - in org.apache.mahout.math.map.OpenIntByteHashMapTest
Tests run: 17, Failures: 0, Errors: 0, Skipped: 0, Time elapsed: 0.243 sec - in org.apache.mahout.math.map.OpenLongByteHashMapTest
Tests run: 17, Failures: 0, Errors: 0, Skipped: 0, Time elapsed: 0.324 sec - in org.apache.mahout.math.map.OpenByteObjectHashMapTest
Running org.apache.mahout.math.map.OpenIntIntHashMapTest
Tests run: 59, Failures: 0, Errors: 0, Skipped: 0, Time elapsed: 3.313 sec - in org.apache.mahout.math.TestSparseRowMatrix
Running org.apache.mahout.math.map.OpenCharCharHashMapTest
Tests run: 17, Failures: 0, Errors: 0, Skipped: 0, Time elapsed: 0.06 sec - in org.apache.mahout.math.map.OpenIntIntHashMapTest
Running org.apache.mahout.math.map.OpenDoubleIntHashMapTest
Running org.apache.mahout.math.map.OpenIntObjectHashMapTest
Running org.apache.mahout.math.map.OpenIntCharHashMapTest
Tests run: 17, Failures: 0, Errors: 0, Skipped: 0, Time elapsed: 0.174 sec - in org.apache.mahout.math.map.OpenCharCharHashMapTest
Tests run: 17, Failures: 0, Errors: 0, Skipped: 0, Time elapsed: 0.105 sec - in org.apache.mahout.math.map.OpenDoubleIntHashMapTest
Tests run: 17, Failures: 0, Errors: 0, Skipped: 0, Time elapsed: 0.166 sec - in org.apache.mahout.math.map.OpenIntObjectHashMapTest
Running org.apache.mahout.math.map.OpenLongCharHashMapTest
Tests run: 17, Failures: 0, Errors: 0, Skipped: 0, Time elapsed: 0.24 sec - in org.apache.mahout.math.map.OpenIntCharHashMapTest
Tests run: 17, Failures: 0, Errors: 0, Skipped: 0, Time elapsed: 0.133 sec - in org.apache.mahout.math.map.OpenLongCharHashMapTest
Running org.apache.mahout.math.map.OpenObjectFloatHashMapTest
Running org.apache.mahout.math.map.OpenDoubleShortHashMapTest
Running org.apache.mahout.math.map.OpenObjectShortHashMapTest
Running org.apache.mahout.math.map.OpenIntLongHashMapTest
Running org.apache.mahout.math.map.OpenDoubleLongHashMapTest
Running org.apache.mahout.math.map.OpenFloatLongHashMapTest
Tests run: 17, Failures: 0, Errors: 0, Skipped: 0, Time elapsed: 0.182 sec - in org.apache.mahout.math.map.OpenDoubleShortHashMapTest
Running org.apache.mahout.math.map.OpenByteFloatHashMapTest
Tests run: 19, Failures: 0, Errors: 0, Skipped: 0, Time elapsed: 0.304 sec - in org.apache.mahout.math.map.OpenObjectFloatHashMapTest
Tests run: 19, Failures: 0, Errors: 0, Skipped: 0, Time elapsed: 0.259 sec - in org.apache.mahout.math.map.OpenObjectShortHashMapTest
Running org.apache.mahout.math.map.OpenObjectByteHashMapTest
Tests run: 17, Failures: 0, Errors: 0, Skipped: 0, Time elapsed: 0.218 sec - in org.apache.mahout.math.map.OpenFloatLongHashMapTest
Tests run: 17, Failures: 0, Errors: 0, Skipped: 0, Time elapsed: 0.245 sec - in org.apache.mahout.math.map.OpenIntLongHashMapTest
Running org.apache.mahout.math.map.OpenDoubleCharHashMapTest
Tests run: 17, Failures: 0, Errors: 0, Skipped: 0, Time elapsed: 0.284 sec - in org.apache.mahout.math.map.OpenDoubleLongHashMapTest
Tests run: 17, Failures: 0, Errors: 0, Skipped: 0, Time elapsed: 0.264 sec - in org.apache.mahout.math.map.OpenByteFloatHashMapTest
Tests run: 19, Failures: 0, Errors: 0, Skipped: 0, Time elapsed: 0.18 sec - in org.apache.mahout.math.map.OpenObjectByteHashMapTest
Running org.apache.mahout.math.map.OpenLongIntHashMapTest
Tests run: 17, Failures: 0, Errors: 0, Skipped: 0, Time elapsed: 0.31 sec - in org.apache.mahout.math.map.OpenDoubleCharHashMapTest
Running org.apache.mahout.math.map.OpenLongObjectHashMapTest
Running org.apache.mahout.math.map.OpenLongLongHashMapTest
Running org.apache.mahout.math.map.OpenFloatCharHashMapTest
Tests run: 17, Failures: 0, Errors: 0, Skipped: 0, Time elapsed: 0.216 sec - in org.apache.mahout.math.map.OpenLongIntHashMapTest
Running org.apache.mahout.math.map.OpenObjectLongHashMapTest
Tests run: 17, Failures: 0, Errors: 0, Skipped: 0, Time elapsed: 0.189 sec - in org.apache.mahout.math.map.OpenLongObjectHashMapTest
Running org.apache.mahout.math.map.OpenShortCharHashMapTest
Tests run: 17, Failures: 0, Errors: 0, Skipped: 0, Time elapsed: 0.17 sec - in org.apache.mahout.math.map.OpenFloatCharHashMapTest
Running org.apache.mahout.math.map.OpenObjectDoubleHashMapTest
Tests run: 17, Failures: 0, Errors: 0, Skipped: 0, Time elapsed: 0.31 sec - in org.apache.mahout.math.map.OpenLongLongHashMapTest
Tests run: 19, Failures: 0, Errors: 0, Skipped: 0, Time elapsed: 0.272 sec - in org.apache.mahout.math.map.OpenObjectLongHashMapTest
Tests run: 17, Failures: 0, Errors: 0, Skipped: 0, Time elapsed: 0.269 sec - in org.apache.mahout.math.map.OpenShortCharHashMapTest
Running org.apache.mahout.math.map.OpenIntDoubleHashMapTest
Tests run: 19, Failures: 0, Errors: 0, Skipped: 0, Time elapsed: 0.185 sec - in org.apache.mahout.math.map.OpenObjectDoubleHashMapTest
Running org.apache.mahout.math.map.OpenFloatObjectHashMapTest
Running org.apache.mahout.math.map.OpenFloatShortHashMapTest
Running org.apache.mahout.math.map.OpenDoubleObjectHashMapTest
Tests run: 17, Failures: 0, Errors: 0, Skipped: 0, Time elapsed: 0.257 sec - in org.apache.mahout.math.map.OpenIntDoubleHashMapTest
Tests run: 17, Failures: 0, Errors: 0, Skipped: 0, Time elapsed: 0.209 sec - in org.apache.mahout.math.map.OpenFloatObjectHashMapTest
Running org.apache.mahout.math.map.OpenShortByteHashMapTest
Tests run: 17, Failures: 0, Errors: 0, Skipped: 0, Time elapsed: 0.218 sec - in org.apache.mahout.math.map.OpenDoubleObjectHashMapTest
Tests run: 17, Failures: 0, Errors: 0, Skipped: 0, Time elapsed: 0.232 sec - in org.apache.mahout.math.map.OpenFloatShortHashMapTest
Running org.apache.mahout.math.map.OpenCharShortHashMapTest
Tests run: 17, Failures: 0, Errors: 0, Skipped: 0, Time elapsed: 0.144 sec - in org.apache.mahout.math.map.OpenShortByteHashMapTest
Running org.apache.mahout.math.map.OpenIntShortHashMapTest
Running org.apache.mahout.math.map.OpenDoubleByteHashMapTest
Running org.apache.mahout.math.map.OpenFloatIntHashMapTest
Tests run: 17, Failures: 0, Errors: 0, Skipped: 0, Time elapsed: 0.199 sec - in org.apache.mahout.math.map.OpenCharShortHashMapTest
Tests run: 17, Failures: 0, Errors: 0, Skipped: 0, Time elapsed: 0.169 sec - in org.apache.mahout.math.map.OpenIntShortHashMapTest
Tests run: 17, Failures: 0, Errors: 0, Skipped: 0, Time elapsed: 0.155 sec - in org.apache.mahout.math.map.OpenFloatIntHashMapTest
Running org.apache.mahout.math.map.OpenShortIntHashMapTest
Running org.apache.mahout.math.map.OpenShortLongHashMapTest
Tests run: 17, Failures: 0, Errors: 0, Skipped: 0, Time elapsed: 0.335 sec - in org.apache.mahout.math.map.OpenDoubleByteHashMapTest
Running org.apache.mahout.math.map.OpenShortDoubleHashMapTest
Tests run: 17, Failures: 0, Errors: 0, Skipped: 0, Time elapsed: 0.149 sec - in org.apache.mahout.math.map.OpenShortLongHashMapTest
Running org.apache.mahout.math.map.OpenShortObjectHashMapTest
Tests run: 17, Failures: 0, Errors: 0, Skipped: 0, Time elapsed: 0.302 sec - in org.apache.mahout.math.map.OpenShortIntHashMapTest
Tests run: 17, Failures: 0, Errors: 0, Skipped: 0, Time elapsed: 0.193 sec - in org.apache.mahout.math.map.OpenShortDoubleHashMapTest
Running org.apache.mahout.math.map.OpenObjectCharHashMapTest
Running org.apache.mahout.math.map.OpenByteLongHashMapTest
Running org.apache.mahout.math.map.OpenFloatFloatHashMapTest
Tests run: 17, Failures: 0, Errors: 0, Skipped: 0, Time elapsed: 0.198 sec - in org.apache.mahout.math.map.OpenShortObjectHashMapTest
Tests run: 3, Failures: 0, Errors: 0, Skipped: 0, Time elapsed: 8.266 sec - in org.apache.mahout.math.set.HashUtilsTest
Tests run: 19, Failures: 0, Errors: 0, Skipped: 0, Time elapsed: 0.173 sec - in org.apache.mahout.math.map.OpenObjectCharHashMapTest
Running org.apache.mahout.math.map.OpenCharObjectHashMapTest
Running org.apache.mahout.math.map.OpenLongDoubleHashMapTest
Tests run: 17, Failures: 0, Errors: 0, Skipped: 0, Time elapsed: 0.181 sec - in org.apache.mahout.math.map.OpenByteLongHashMapTest
Tests run: 17, Failures: 0, Errors: 0, Skipped: 0, Time elapsed: 0.169 sec - in org.apache.mahout.math.map.OpenFloatFloatHashMapTest
Running org.apache.mahout.math.map.OpenShortShortHashMapTest
Tests run: 17, Failures: 0, Errors: 0, Skipped: 0, Time elapsed: 0.18 sec - in org.apache.mahout.math.map.OpenLongDoubleHashMapTest
Running org.apache.mahout.math.map.OpenCharByteHashMapTest
Running org.apache.mahout.math.map.OpenLongShortHashMapTest
Tests run: 17, Failures: 0, Errors: 0, Skipped: 0, Time elapsed: 0.246 sec - in org.apache.mahout.math.map.OpenShortShortHashMapTest
Tests run: 17, Failures: 0, Errors: 0, Skipped: 0, Time elapsed: 0.29 sec - in org.apache.mahout.math.map.OpenCharObjectHashMapTest
Tests run: 17, Failures: 0, Errors: 0, Skipped: 0, Time elapsed: 0.181 sec - in org.apache.mahout.math.map.OpenCharByteHashMapTest
Running org.apache.mahout.math.FileBasedMatrixTest
Running org.apache.mahout.math.VectorTest
Running org.apache.mahout.math.map.OpenCharFloatHashMapTest
Tests run: 17, Failures: 0, Errors: 0, Skipped: 0, Time elapsed: 0.262 sec - in org.apache.mahout.math.map.OpenLongShortHashMapTest
Running org.apache.mahout.math.map.OpenDoubleDoubleHashMapTest
Tests run: 17, Failures: 0, Errors: 0, Skipped: 0, Time elapsed: 0.223 sec - in org.apache.mahout.math.map.OpenCharFloatHashMapTest
Running org.apache.mahout.math.MatrixVectorViewTest
Tests run: 17, Failures: 0, Errors: 0, Skipped: 0, Time elapsed: 0.159 sec - in org.apache.mahout.math.map.OpenDoubleDoubleHashMapTest
Running org.apache.mahout.math.MatricesTest
Running org.apache.mahout.math.WeightedVectorTest
Running org.apache.mahout.math.solver.TestConjugateGradientSolver
Running org.apache.mahout.math.TestRandomAccessSparseVector
Running org.apache.mahout.math.DenseSymmetricTest
Running org.apache.mahout.math.solver.EigenDecompositionTest
Tests run: 2, Failures: 0, Errors: 0, Skipped: 0, Time elapsed: 0.519 sec - in org.apache.mahout.math.MatrixVectorViewTest
Running org.apache.mahout.math.solver.LSMRTest
Tests run: 3, Failures: 0, Errors: 0, Skipped: 0, Time elapsed: 0.516 sec - in org.apache.mahout.math.solver.TestConjugateGradientSolver
Tests run: 4, Failures: 0, Errors: 0, Skipped: 0, Time elapsed: 0.38 sec - in org.apache.mahout.math.solver.EigenDecompositionTest
Tests run: 5, Failures: 0, Errors: 0, Skipped: 0, Time elapsed: 0.876 sec - in org.apache.mahout.math.MatricesTest
Tests run: 2, Failures: 0, Errors: 0, Skipped: 0, Time elapsed: 0.598 sec - in org.apache.mahout.math.DenseSymmetricTest
Tests run: 23, Failures: 0, Errors: 0, Skipped: 0, Time elapsed: 1.251 sec - in org.apache.mahout.math.VectorTest
Running org.apache.mahout.math.CholeskyDecompositionTest
Running org.apache.mahout.math.UpperTriangularTest
Running org.apache.mahout.math.random.MultinomialTest
Running org.apache.mahout.math.random.EmpiricalTest
Tests run: 2, Failures: 0, Errors: 0, Skipped: 0, Time elapsed: 0.817 sec - in org.apache.mahout.math.solver.LSMRTest
Tests run: 1, Failures: 0, Errors: 0, Skipped: 0, Time elapsed: 0.367 sec - in org.apache.mahout.math.UpperTriangularTest
Running org.apache.mahout.math.random.PoissonSamplerTest
Running org.apache.mahout.math.random.NormalTest
Running org.apache.mahout.math.random.ChineseRestaurantTest
Tests run: 3, Failures: 0, Errors: 0, Skipped: 0, Time elapsed: 0.863 sec - in org.apache.mahout.math.random.EmpiricalTest
Running org.apache.mahout.math.random.IndianBuffetTest
Tests run: 8, Failures: 0, Errors: 0, Skipped: 0, Time elapsed: 0.999 sec - in org.apache.mahout.math.random.MultinomialTest
Tests run: 1, Failures: 0, Errors: 0, Skipped: 0, Time elapsed: 0.887 sec - in org.apache.mahout.math.random.PoissonSamplerTest
Tests run: 4, Failures: 0, Errors: 0, Skipped: 0, Time elapsed: 1.603 sec - in org.apache.mahout.math.CholeskyDecompositionTest
Running org.apache.mahout.math.random.MultiNormalTest
Tests run: 1, Failures: 0, Errors: 0, Skipped: 0, Time elapsed: 0.653 sec - in org.apache.mahout.math.random.IndianBuffetTest
Running org.apache.mahout.math.jet.random.GammaTest
Running org.apache.mahout.math.jet.random.NormalTest
Running org.apache.mahout.math.jet.random.engine.MersenneTwisterTest
Running org.apache.mahout.math.jet.random.NegativeBinomialTest
Tests run: 2, Failures: 0, Errors: 0, Skipped: 0, Time elapsed: 1.507 sec - in org.apache.mahout.math.random.NormalTest
Tests run: 4, Failures: 0, Errors: 0, Skipped: 0, Time elapsed: 0.948 sec - in org.apache.mahout.math.jet.random.NormalTest
Tests run: 3, Failures: 0, Errors: 0, Skipped: 0, Time elapsed: 0.607 sec - in org.apache.mahout.math.jet.random.engine.MersenneTwisterTest
Running org.apache.mahout.math.jet.random.ExponentialTest
Tests run: 1, Failures: 0, Errors: 0, Skipped: 0, Time elapsed: 0.661 sec - in org.apache.mahout.math.jet.random.NegativeBinomialTest
Running org.apache.mahout.math.jet.stat.ProbabilityTest
Running org.apache.mahout.math.jet.stat.GammaTest
Running org.apache.mahout.math.DiagonalMatrixTest
Tests run: 3, Failures: 0, Errors: 0, Skipped: 0, Time elapsed: 0.974 sec - in org.apache.mahout.math.jet.stat.ProbabilityTest
Tests run: 1, Failures: 0, Errors: 0, Skipped: 0, Time elapsed: 0.702 sec - in org.apache.mahout.math.DiagonalMatrixTest
Tests run: 2, Failures: 0, Errors: 0, Skipped: 1, Time elapsed: 6.084 sec - in org.apache.mahout.math.FileBasedMatrixTest
Tests run: 5, Failures: 0, Errors: 0, Skipped: 0, Time elapsed: 1.171 sec - in org.apache.mahout.math.jet.stat.GammaTest
Tests run: 3, Failures: 0, Errors: 0, Skipped: 0, Time elapsed: 3.23 sec - in org.apache.mahout.math.jet.random.GammaTest
Running org.apache.mahout.math.list.DoubleArrayListTest
Running org.apache.mahout.math.ssvd.SequentialBigSvdTest
Tests run: 18, Failures: 0, Errors: 0, Skipped: 0, Time elapsed: 0.143 sec - in org.apache.mahout.math.list.DoubleArrayListTest
Running org.apache.mahout.math.list.ObjectArrayListTest
Running org.apache.mahout.math.list.ByteArrayListTest
Tests run: 18, Failures: 0, Errors: 0, Skipped: 0, Time elapsed: 0.167 sec - in org.apache.mahout.math.list.ByteArrayListTest
Tests run: 6, Failures: 0, Errors: 0, Skipped: 0, Time elapsed: 2.394 sec - in org.apache.mahout.math.jet.random.ExponentialTest
Tests run: 2, Failures: 0, Errors: 0, Skipped: 0, Time elapsed: 3.684 sec - in org.apache.mahout.math.random.MultiNormalTest
Running org.apache.mahout.math.list.LongArrayListTest
Tests run: 45, Failures: 0, Errors: 0, Skipped: 0, Time elapsed: 6.632 sec - in org.apache.mahout.math.WeightedVectorTest
Running org.apache.mahout.math.list.ShortArrayListTest
Tests run: 3, Failures: 0, Errors: 0, Skipped: 0, Time elapsed: 0.539 sec - in org.apache.mahout.math.list.ObjectArrayListTest
Tests run: 3, Failures: 0, Errors: 0, Skipped: 0, Time elapsed: 0.736 sec - in org.apache.mahout.math.ssvd.SequentialBigSvdTest
Tests run: 18, Failures: 0, Errors: 0, Skipped: 0, Time elapsed: 0.258 sec - in org.apache.mahout.math.list.LongArrayListTest
Tests run: 18, Failures: 0, Errors: 0, Skipped: 0, Time elapsed: 0.154 sec - in org.apache.mahout.math.list.ShortArrayListTest
Running org.apache.mahout.math.list.CharArrayListTest
Running org.apache.mahout.math.list.FloatArrayListTest
Running org.apache.mahout.math.list.IntArrayListTest
Tests run: 18, Failures: 0, Errors: 0, Skipped: 0, Time elapsed: 0.142 sec - in org.apache.mahout.math.list.FloatArrayListTest
Tests run: 18, Failures: 0, Errors: 0, Skipped: 0, Time elapsed: 0.287 sec - in org.apache.mahout.math.list.CharArrayListTest
Tests run: 44, Failures: 0, Errors: 0, Skipped: 0, Time elapsed: 16.086 sec - in org.apache.mahout.math.TestSequentialAccessSparseVector
Running org.apache.mahout.math.TestOrderedIntDoubleMapping
Tests run: 18, Failures: 0, Errors: 0, Skipped: 0, Time elapsed: 0.235 sec - in org.apache.mahout.math.list.IntArrayListTest
Running org.apache.mahout.math.CentroidTest
Running org.apache.mahout.math.TestDenseMatrix
Running org.apache.mahout.math.decomposer.hebbian.TestHebbianSolver
Running org.apache.mahout.math.decomposer.lanczos.TestLanczosSolver
Running org.apache.mahout.math.PermutedVectorViewTest
Tests run: 4, Failures: 0, Errors: 0, Skipped: 0, Time elapsed: 0.447 sec - in org.apache.mahout.math.TestOrderedIntDoubleMapping
Running org.apache.mahout.math.VectorBinaryAssignCostTest
Running org.apache.mahout.math.TestDenseVector
Running org.apache.mahout.math.VectorBinaryAggregateCostTest
Tests run: 2, Failures: 0, Errors: 0, Skipped: 0, Time elapsed: 0.548 sec - in org.apache.mahout.math.PermutedVectorViewTest
Tests run: 9, Failures: 0, Errors: 0, Skipped: 0, Time elapsed: 0.572 sec - in org.apache.mahout.math.VectorBinaryAssignCostTest
Tests run: 9, Failures: 0, Errors: 0, Skipped: 0, Time elapsed: 0.425 sec - in org.apache.mahout.math.VectorBinaryAggregateCostTest
Tests run: 59, Failures: 0, Errors: 0, Skipped: 0, Time elapsed: 2.084 sec - in org.apache.mahout.math.TestDenseMatrix
Tests run: 1, Failures: 0, Errors: 0, Skipped: 0, Time elapsed: 2.334 sec - in org.apache.mahout.math.decomposer.hebbian.TestHebbianSolver
Tests run: 3, Failures: 0, Errors: 0, Skipped: 0, Time elapsed: 3.65 sec - in org.apache.mahout.math.decomposer.lanczos.TestLanczosSolver
Tests run: 43, Failures: 0, Errors: 0, Skipped: 0, Time elapsed: 4.2 sec - in org.apache.mahout.math.CentroidTest
Tests run: 3, Failures: 0, Errors: 0, Skipped: 0, Time elapsed: 9.944 sec - in org.apache.mahout.math.random.ChineseRestaurantTest
Tests run: 43, Failures: 0, Errors: 0, Skipped: 0, Time elapsed: 4.232 sec - in org.apache.mahout.math.TestDenseVector
Tests run: 43, Failures: 0, Errors: 0, Skipped: 0, Time elapsed: 12.809 sec - in org.apache.mahout.math.TestRandomAccessSparseVector
Tests run: 9, Failures: 0, Errors: 0, Skipped: 0, Time elapsed: 74.388 sec - in org.apache.mahout.math.stats.TDigestTest

Results :

Tests in error: 
  TestSingularValueDecomposition.testSvdHang ?  Test timeout exceeded (>= 1000 m...

Tests run: 2541, Failures: 0, Errors: 1, Skipped: 1

[JENKINS] Recording test results
[INFO] ------------------------------------------------------------------------
[INFO] Reactor Summary:
[INFO] 
[INFO] Mahout Build Tools ................................ SUCCESS [23.191s]
[INFO] Apache Mahout ..................................... SUCCESS [3.564s]
[INFO] Mahout Math ....................................... FAILURE [1:42.037s]
[INFO] Mahout Core ....................................... SKIPPED
[INFO] Mahout Integration ................................ SKIPPED
[INFO] Mahout Examples ................................... SKIPPED
[INFO] Mahout Release Package ............................ SKIPPED
[INFO] Mahout Math/Scala wrappers ........................ SKIPPED
[INFO] ------------------------------------------------------------------------
[INFO] BUILD FAILURE
[INFO] ------------------------------------------------------------------------
[INFO] Total time: 2:15.038s
[INFO] Finished at: Sat Jan 25 23:04:03 UTC 2014
[INFO] Final Memory: 28M/178M
[INFO] ------------------------------------------------------------------------
Waiting for Jenkins to finish collecting data[ERROR] Failed to execute goal org.apache.maven.plugins:maven-surefire-plugin:2.16:test
(default-test) on project mahout-math: There are test failures.
[ERROR] 
[ERROR] Please refer to <https://builds.apache.org/job/mahout-nightly/ws/trunk/math/target/surefire-reports>
for the individual test results.
[ERROR] -> [Help 1]
[ERROR] 
[ERROR] To see the full stack trace of the errors, re-run Maven with the -e switch.
[ERROR] Re-run Maven using the -X switch to enable full debug logging.
[ERROR] 
[ERROR] For more information about the errors and possible solutions, please read the following
articles:
[ERROR] [Help 1] http://cwiki.apache.org/confluence/display/MAVEN/MojoFailureException
[ERROR] 
[ERROR] After correcting the problems, you can resume the build with the command
[ERROR]   mvn <goals> -rf :mahout-math

[JENKINS] Archiving <https://builds.apache.org/job/mahout-nightly/ws/trunk/core/pom.xml>
to org.apache.mahout/mahout-core/1.0-SNAPSHOT/mahout-core-1.0-SNAPSHOT.pom
[JENKINS] Archiving <https://builds.apache.org/job/mahout-nightly/ws/trunk/math-scala/pom.xml>
to org.apache.mahout/mahout-math-scala/1.0-SNAPSHOT/mahout-math-scala-1.0-SNAPSHOT.pom
[JENKINS] Archiving <https://builds.apache.org/job/mahout-nightly/ws/trunk/distribution/pom.xml>
to org.apache.mahout/mahout-distribution/1.0-SNAPSHOT/mahout-distribution-1.0-SNAPSHOT.pom
[JENKINS] Archiving <https://builds.apache.org/job/mahout-nightly/ws/trunk/integration/pom.xml>
to org.apache.mahout/mahout-integration/1.0-SNAPSHOT/mahout-integration-1.0-SNAPSHOT.pom
[JENKINS] Archiving <https://builds.apache.org/job/mahout-nightly/ws/trunk/pom.xml>
to org.apache.mahout/mahout/1.0-SNAPSHOT/mahout-1.0-SNAPSHOT.pom
[JENKINS] Archiving <https://builds.apache.org/job/mahout-nightly/ws/trunk/math/pom.xml>
to org.apache.mahout/mahout-math/1.0-SNAPSHOT/mahout-math-1.0-SNAPSHOT.pom
[JENKINS] Archiving <https://builds.apache.org/job/mahout-nightly/ws/trunk/examples/pom.xml>
to org.apache.mahout/mahout-examples/1.0-SNAPSHOT/mahout-examples-1.0-SNAPSHOT.pom
[JENKINS] Archiving <https://builds.apache.org/job/mahout-nightly/ws/trunk/buildtools/pom.xml>
to org.apache.mahout/mahout-buildtools/1.0-SNAPSHOT/mahout-buildtools-1.0-SNAPSHOT.pom
[JENKINS] Archiving <https://builds.apache.org/job/mahout-nightly/ws/trunk/buildtools/target/mahout-buildtools-1.0-SNAPSHOT.jar>
to org.apache.mahout/mahout-buildtools/1.0-20140125.230210-12/mahout-buildtools-1.0-20140125.230210-12.jar
Sending e-mails to: dev@mahout.apache.org tdunning@apache.org
channel stopped

Mime
View raw message