mahout-dev mailing list archives

Site index · List index
Message view « Date » · « Thread »
Top « Date » · « Thread »
From Apache Jenkins Server <jenk...@builds.apache.org>
Subject Build failed in Jenkins: mahout-nightly #1395
Date Sat, 26 Oct 2013 23:05:36 GMT
See <https://builds.apache.org/job/mahout-nightly/1395/>

------------------------------------------
[...truncated 3563 lines...]
[INFO] /home/jenkins/jenkins-slave/maven-repositories/1/org/apache/mahout/mahout-core removed.
Oct 26, 2013 11:04:34 PM org.apache.maven.cli.event.ExecutionEventLogger mojoStarted
INFO: 
Oct 26, 2013 11:04:34 PM org.apache.maven.cli.event.ExecutionEventLogger mojoStarted
INFO: --- maven-jar-plugin:2.4:jar (default-jar) @ mahout-core ---
[INFO] Building jar: <https://builds.apache.org/job/mahout-nightly/ws/trunk/core/target/mahout-core-0.9-SNAPSHOT.jar>
Oct 26, 2013 11:04:35 PM org.apache.maven.cli.event.ExecutionEventLogger mojoStarted
INFO: 
Oct 26, 2013 11:04:35 PM org.apache.maven.cli.event.ExecutionEventLogger mojoStarted
INFO: --- maven-jar-plugin:2.4:test-jar (default) @ mahout-core ---
[WARNING] Artifact org.apache.mahout:mahout-core:test-jar:tests:0.9-SNAPSHOT already attached
to project, ignoring duplicate
Oct 26, 2013 11:04:35 PM org.apache.maven.cli.event.ExecutionEventLogger mojoStarted
INFO: 
Oct 26, 2013 11:04:35 PM org.apache.maven.cli.event.ExecutionEventLogger mojoStarted
INFO: --- maven-assembly-plugin:2.4:single (job) @ mahout-core ---
[INFO] Reading assembly descriptor: src/main/assembly/job.xml
[INFO] Building jar: <https://builds.apache.org/job/mahout-nightly/ws/trunk/core/target/mahout-core-0.9-SNAPSHOT-job.jar>
[WARNING] Artifact org.apache.mahout:mahout-core:jar:job:0.9-SNAPSHOT already attached to
project, ignoring duplicate
Oct 26, 2013 11:04:41 PM org.apache.maven.cli.event.ExecutionEventLogger mojoStarted
INFO: 
Oct 26, 2013 11:04:41 PM org.apache.maven.cli.event.ExecutionEventLogger mojoStarted
INFO: --- maven-source-plugin:2.2.1:jar-no-fork (attach-sources) @ mahout-core ---
[WARNING] Artifact org.apache.mahout:mahout-core:java-source:sources:0.9-SNAPSHOT already
attached to project, ignoring duplicate
Oct 26, 2013 11:04:42 PM org.apache.maven.cli.event.ExecutionEventLogger mojoStarted
INFO: 
Oct 26, 2013 11:04:42 PM org.apache.maven.cli.event.ExecutionEventLogger mojoStarted
INFO: --- maven-install-plugin:2.5:install (default-install) @ mahout-core ---
[INFO] Installing <https://builds.apache.org/job/mahout-nightly/ws/trunk/core/target/mahout-core-0.9-SNAPSHOT.jar>
to /home/jenkins/jenkins-slave/maven-repositories/1/org/apache/mahout/mahout-core/0.9-SNAPSHOT/mahout-core-0.9-SNAPSHOT.jar
[INFO] Installing <https://builds.apache.org/job/mahout-nightly/ws/trunk/core/pom.xml>
to /home/jenkins/jenkins-slave/maven-repositories/1/org/apache/mahout/mahout-core/0.9-SNAPSHOT/mahout-core-0.9-SNAPSHOT.pom
[INFO] Installing <https://builds.apache.org/job/mahout-nightly/ws/trunk/core/target/mahout-core-0.9-SNAPSHOT-tests.jar>
to /home/jenkins/jenkins-slave/maven-repositories/1/org/apache/mahout/mahout-core/0.9-SNAPSHOT/mahout-core-0.9-SNAPSHOT-tests.jar
[INFO] Installing <https://builds.apache.org/job/mahout-nightly/ws/trunk/core/target/mahout-core-0.9-SNAPSHOT-job.jar>
to /home/jenkins/jenkins-slave/maven-repositories/1/org/apache/mahout/mahout-core/0.9-SNAPSHOT/mahout-core-0.9-SNAPSHOT-job.jar
[INFO] Installing <https://builds.apache.org/job/mahout-nightly/ws/trunk/core/target/mahout-core-0.9-SNAPSHOT-sources.jar>
to /home/jenkins/jenkins-slave/maven-repositories/1/org/apache/mahout/mahout-core/0.9-SNAPSHOT/mahout-core-0.9-SNAPSHOT-sources.jar
Oct 26, 2013 11:04:42 PM org.apache.maven.cli.event.ExecutionEventLogger mojoStarted
INFO: 
Oct 26, 2013 11:04:42 PM org.apache.maven.cli.event.ExecutionEventLogger mojoStarted
INFO: --- maven-deploy-plugin:2.5:deploy (default-deploy) @ mahout-core ---
Downloading: https://repository.apache.org/content/repositories/snapshots/org/apache/mahout/mahout-core/0.9-SNAPSHOT/maven-metadata.xml
Downloaded: https://repository.apache.org/content/repositories/snapshots/org/apache/mahout/mahout-core/0.9-SNAPSHOT/maven-metadata.xml
(2 KB at 5.0 KB/sec)
Uploading: https://repository.apache.org/content/repositories/snapshots/org/apache/mahout/mahout-core/0.9-SNAPSHOT/mahout-core-0.9-20131026.230442-83.jar
Uploaded: https://repository.apache.org/content/repositories/snapshots/org/apache/mahout/mahout-core/0.9-SNAPSHOT/mahout-core-0.9-20131026.230442-83.jar
(1333 KB at 7280.2 KB/sec)
Uploading: https://repository.apache.org/content/repositories/snapshots/org/apache/mahout/mahout-core/0.9-SNAPSHOT/mahout-core-0.9-20131026.230442-83.pom
Uploaded: https://repository.apache.org/content/repositories/snapshots/org/apache/mahout/mahout-core/0.9-SNAPSHOT/mahout-core-0.9-20131026.230442-83.pom
(7 KB at 98.9 KB/sec)
Downloading: https://repository.apache.org/content/repositories/snapshots/org/apache/mahout/mahout-core/maven-metadata.xml
Downloaded: https://repository.apache.org/content/repositories/snapshots/org/apache/mahout/mahout-core/maven-metadata.xml
(344 B at 1.4 KB/sec)
Uploading: https://repository.apache.org/content/repositories/snapshots/org/apache/mahout/mahout-core/0.9-SNAPSHOT/maven-metadata.xml
Uploaded: https://repository.apache.org/content/repositories/snapshots/org/apache/mahout/mahout-core/0.9-SNAPSHOT/maven-metadata.xml
(2 KB at 14.3 KB/sec)
Uploading: https://repository.apache.org/content/repositories/snapshots/org/apache/mahout/mahout-core/maven-metadata.xml
Uploaded: https://repository.apache.org/content/repositories/snapshots/org/apache/mahout/mahout-core/maven-metadata.xml
(344 B at 2.7 KB/sec)
Uploading: https://repository.apache.org/content/repositories/snapshots/org/apache/mahout/mahout-core/0.9-SNAPSHOT/mahout-core-0.9-20131026.230442-83-tests.jar
Uploaded: https://repository.apache.org/content/repositories/snapshots/org/apache/mahout/mahout-core/0.9-SNAPSHOT/mahout-core-0.9-20131026.230442-83-tests.jar
(2329 KB at 10213.3 KB/sec)
Uploading: https://repository.apache.org/content/repositories/snapshots/org/apache/mahout/mahout-core/0.9-SNAPSHOT/maven-metadata.xml
Uploaded: https://repository.apache.org/content/repositories/snapshots/org/apache/mahout/mahout-core/0.9-SNAPSHOT/maven-metadata.xml
(2 KB at 19.9 KB/sec)
Uploading: https://repository.apache.org/content/repositories/snapshots/org/apache/mahout/mahout-core/0.9-SNAPSHOT/mahout-core-0.9-20131026.230442-83-job.jar
Uploaded: https://repository.apache.org/content/repositories/snapshots/org/apache/mahout/mahout-core/0.9-SNAPSHOT/mahout-core-0.9-20131026.230442-83-job.jar
(17740 KB at 17651.3 KB/sec)
Uploading: https://repository.apache.org/content/repositories/snapshots/org/apache/mahout/mahout-core/0.9-SNAPSHOT/maven-metadata.xml
Uploaded: https://repository.apache.org/content/repositories/snapshots/org/apache/mahout/mahout-core/0.9-SNAPSHOT/maven-metadata.xml
(2 KB at 24.1 KB/sec)
Uploading: https://repository.apache.org/content/repositories/snapshots/org/apache/mahout/mahout-core/0.9-SNAPSHOT/mahout-core-0.9-20131026.230442-83-sources.jar
Uploaded: https://repository.apache.org/content/repositories/snapshots/org/apache/mahout/mahout-core/0.9-SNAPSHOT/mahout-core-0.9-20131026.230442-83-sources.jar
(964 KB at 7081.2 KB/sec)
Uploading: https://repository.apache.org/content/repositories/snapshots/org/apache/mahout/mahout-core/0.9-SNAPSHOT/maven-metadata.xml
Uploaded: https://repository.apache.org/content/repositories/snapshots/org/apache/mahout/mahout-core/0.9-SNAPSHOT/maven-metadata.xml
(2 KB at 21.2 KB/sec)
Oct 26, 2013 11:04:51 PM org.apache.maven.cli.event.ExecutionEventLogger projectStarted
INFO:                                                                         
Oct 26, 2013 11:04:51 PM org.apache.maven.cli.event.ExecutionEventLogger projectStarted
INFO: ------------------------------------------------------------------------
Oct 26, 2013 11:04:51 PM org.apache.maven.cli.event.ExecutionEventLogger projectStarted
INFO: Building Mahout Integration 0.9-SNAPSHOT
Oct 26, 2013 11:04:51 PM org.apache.maven.cli.event.ExecutionEventLogger projectStarted
INFO: ------------------------------------------------------------------------
Oct 26, 2013 11:04:52 PM org.apache.maven.cli.event.ExecutionEventLogger mojoStarted
INFO: 
Oct 26, 2013 11:04:52 PM org.apache.maven.cli.event.ExecutionEventLogger mojoStarted
INFO: --- maven-clean-plugin:2.4.1:clean (default-clean) @ mahout-integration ---
Oct 26, 2013 11:04:52 PM org.apache.maven.cli.event.ExecutionEventLogger mojoStarted
INFO: 
Oct 26, 2013 11:04:52 PM org.apache.maven.cli.event.ExecutionEventLogger mojoStarted
INFO: --- maven-resources-plugin:2.6:resources (default-resources) @ mahout-integration ---
[INFO] Using 'UTF-8' encoding to copy filtered resources.
[INFO] Copying 0 resource
Oct 26, 2013 11:04:52 PM org.apache.maven.cli.event.ExecutionEventLogger mojoStarted
INFO: 
Oct 26, 2013 11:04:52 PM org.apache.maven.cli.event.ExecutionEventLogger mojoStarted
INFO: --- maven-compiler-plugin:3.1:compile (default-compile) @ mahout-integration ---
[INFO] Changes detected - recompiling the module!
[INFO] Compiling 127 source files to <https://builds.apache.org/job/mahout-nightly/ws/trunk/integration/target/classes>
[WARNING] Note: <https://builds.apache.org/job/mahout-nightly/ws/trunk/integration/src/main/java/org/apache/mahout/cf/taste/impl/model/mongodb/MongoDBDataModel.java>
uses or overrides a deprecated API.
[WARNING] Note: Recompile with -Xlint:deprecation for details.
[WARNING] Note: <https://builds.apache.org/job/mahout-nightly/ws/trunk/integration/src/main/java/org/apache/mahout/cf/taste/impl/model/mongodb/MongoDBDataModel.java>
uses unchecked or unsafe operations.
[WARNING] Note: Recompile with -Xlint:unchecked for details.
Oct 26, 2013 11:04:54 PM org.apache.maven.cli.event.ExecutionEventLogger mojoStarted
INFO: 
Oct 26, 2013 11:04:54 PM org.apache.maven.cli.event.ExecutionEventLogger mojoStarted
INFO: --- maven-resources-plugin:2.6:testResources (default-testResources) @ mahout-integration
---
[INFO] Using 'UTF-8' encoding to copy filtered resources.
[INFO] Copying 10 resources
Oct 26, 2013 11:04:54 PM org.apache.maven.cli.event.ExecutionEventLogger mojoStarted
INFO: 
Oct 26, 2013 11:04:54 PM org.apache.maven.cli.event.ExecutionEventLogger mojoStarted
INFO: --- maven-compiler-plugin:3.1:testCompile (default-testCompile) @ mahout-integration
---
[INFO] Changes detected - recompiling the module!
[INFO] Compiling 37 source files to <https://builds.apache.org/job/mahout-nightly/ws/trunk/integration/target/test-classes>
[WARNING] Note: Some input files use or override a deprecated API.
[WARNING] Note: Recompile with -Xlint:deprecation for details.
[WARNING] Note: Some input files use unchecked or unsafe operations.
[WARNING] Note: Recompile with -Xlint:unchecked for details.
Oct 26, 2013 11:04:54 PM org.apache.maven.cli.event.ExecutionEventLogger mojoStarted
INFO: 
Oct 26, 2013 11:04:54 PM org.apache.maven.cli.event.ExecutionEventLogger mojoStarted
INFO: --- maven-surefire-plugin:2.16:test (default-test) @ mahout-integration ---
[INFO] Surefire report directory: <https://builds.apache.org/job/mahout-nightly/ws/trunk/integration/target/surefire-reports>

-------------------------------------------------------
 T E S T S
-------------------------------------------------------

-------------------------------------------------------
 T E S T S
-------------------------------------------------------
Running org.apache.mahout.utils.vectors.arff.ARFFVectorIterableTest
Running org.apache.mahout.clustering.TestClusterEvaluator
Running org.apache.mahout.text.MailArchivesClusteringAnalyzerTest
Running org.apache.mahout.utils.vectors.arff.MapBackedARFFModelTest
Running org.apache.mahout.text.SequenceFilesFromLuceneStorageDriverTest
Running org.apache.mahout.utils.vectors.lucene.DriverTest
Running org.apache.mahout.text.SequenceFilesFromLuceneStorageMRJobTest
Running org.apache.mahout.text.LuceneSegmentInputFormatTest
Running org.apache.mahout.text.TestSequenceFilesFromDirectory
Running org.apache.mahout.utils.email.MailProcessorTest
Running org.apache.mahout.utils.regex.RegexUtilsTest
Running org.apache.mahout.clustering.TestClusterDumper
Running org.apache.mahout.text.LuceneSegmentInputSplitTest
Running org.apache.mahout.utils.nlp.collocations.llr.BloomTokenFilterTest
Running org.apache.mahout.utils.vectors.arff.DriverTest
Running org.apache.mahout.clustering.cdbw.TestCDbwEvaluator
Running org.apache.mahout.text.LuceneStorageConfigurationTest
Running org.apache.mahout.cf.taste.impl.similarity.jdbc.MySQLJDBCInMemoryItemSimilarityTest
Running org.apache.mahout.utils.Bump125Test
Running org.apache.mahout.utils.vectors.lucene.LuceneIterableTest
Running org.apache.mahout.utils.vectors.arff.ARFFTypeTest
Running org.apache.mahout.utils.vectors.lucene.CachedTermInfoTest
Running org.apache.mahout.text.LuceneSegmentRecordReaderTest
Running org.apache.mahout.utils.vectors.io.VectorWriterTest
Running org.apache.mahout.utils.regex.RegexMapperTest
Running org.apache.mahout.text.SequenceFilesFromLuceneStorageTest
Running org.apache.mahout.utils.SplitInputTest
Running org.apache.mahout.utils.vectors.VectorHelperTest
Running org.apache.mahout.text.SequenceFilesFromMailArchivesTest
Tests run: 1, Failures: 0, Errors: 0, Skipped: 0, Time elapsed: 0.192 sec - in org.apache.mahout.utils.regex.RegexUtilsTest
Tests run: 1, Failures: 0, Errors: 0, Skipped: 0, Time elapsed: 0.201 sec - in org.apache.mahout.utils.Bump125Test
Running org.apache.mahout.utils.TestConcatenateVectorsJob
Running org.apache.mahout.utils.vectors.csv.CSVVectorIteratorTest
Tests run: 5, Failures: 0, Errors: 0, Skipped: 0, Time elapsed: 0.299 sec - in org.apache.mahout.utils.nlp.collocations.llr.BloomTokenFilterTest
Tests run: 1, Failures: 0, Errors: 0, Skipped: 0, Time elapsed: 0.41 sec - in org.apache.mahout.utils.vectors.arff.MapBackedARFFModelTest
Tests run: 1, Failures: 0, Errors: 0, Skipped: 0, Time elapsed: 0.38 sec - in org.apache.mahout.utils.vectors.arff.ARFFTypeTest
Tests run: 8, Failures: 0, Errors: 0, Skipped: 0, Time elapsed: 0.611 sec - in org.apache.mahout.utils.vectors.arff.ARFFVectorIterableTest
Tests run: 3, Failures: 0, Errors: 0, Skipped: 0, Time elapsed: 0.294 sec - in org.apache.mahout.utils.vectors.VectorHelperTest
Tests run: 1, Failures: 0, Errors: 0, Skipped: 0, Time elapsed: 0.601 sec - in org.apache.mahout.text.MailArchivesClusteringAnalyzerTest
Tests run: 2, Failures: 0, Errors: 0, Skipped: 0, Time elapsed: 0.54 sec - in org.apache.mahout.utils.email.MailProcessorTest
Tests run: 1, Failures: 0, Errors: 0, Skipped: 0, Time elapsed: 0.634 sec - in org.apache.mahout.cf.taste.impl.similarity.jdbc.MySQLJDBCInMemoryItemSimilarityTest
Tests run: 2, Failures: 0, Errors: 0, Skipped: 0, Time elapsed: 0.954 sec - in org.apache.mahout.text.LuceneStorageConfigurationTest
Tests run: 1, Failures: 0, Errors: 0, Skipped: 0, Time elapsed: 1.008 sec - in org.apache.mahout.utils.vectors.lucene.CachedTermInfoTest
Tests run: 1, Failures: 0, Errors: 0, Skipped: 0, Time elapsed: 0.776 sec - in org.apache.mahout.utils.vectors.csv.CSVVectorIteratorTest
Tests run: 2, Failures: 0, Errors: 0, Skipped: 0, Time elapsed: 1.078 sec - in org.apache.mahout.utils.vectors.arff.DriverTest
Tests run: 3, Failures: 0, Errors: 0, Skipped: 0, Time elapsed: 1.333 sec - in org.apache.mahout.utils.vectors.lucene.LuceneIterableTest
Tests run: 3, Failures: 0, Errors: 0, Skipped: 0, Time elapsed: 1.417 sec - in org.apache.mahout.utils.regex.RegexMapperTest
Tests run: 1, Failures: 0, Errors: 0, Skipped: 0, Time elapsed: 1.209 sec - in org.apache.mahout.utils.TestConcatenateVectorsJob
Tests run: 2, Failures: 0, Errors: 0, Skipped: 0, Time elapsed: 1.54 sec - in org.apache.mahout.utils.vectors.io.VectorWriterTest
Tests run: 1, Failures: 0, Errors: 0, Skipped: 0, Time elapsed: 1.976 sec - in org.apache.mahout.utils.vectors.lucene.DriverTest
Tests run: 1, Failures: 0, Errors: 0, Skipped: 0, Time elapsed: 2.171 sec - in org.apache.mahout.text.LuceneSegmentInputFormatTest
Tests run: 2, Failures: 0, Errors: 0, Skipped: 0, Time elapsed: 2.23 sec - in org.apache.mahout.text.LuceneSegmentInputSplitTest
Tests run: 1, Failures: 0, Errors: 0, Skipped: 0, Time elapsed: 2.25 sec - in org.apache.mahout.text.LuceneSegmentRecordReaderTest
Tests run: 2, Failures: 0, Errors: 0, Skipped: 0, Time elapsed: 2.972 sec - in org.apache.mahout.text.SequenceFilesFromMailArchivesTest
Tests run: 6, Failures: 0, Errors: 0, Skipped: 0, Time elapsed: 3.606 sec - in org.apache.mahout.text.SequenceFilesFromLuceneStorageTest
Tests run: 1, Failures: 1, Errors: 0, Skipped: 0, Time elapsed: 4.061 sec <<< FAILURE!
- in org.apache.mahout.text.SequenceFilesFromLuceneStorageMRJobTest
testRun(org.apache.mahout.text.SequenceFilesFromLuceneStorageMRJobTest)  Time elapsed: 3.671
sec  <<< FAILURE!
java.lang.AssertionError: expected:<2002> but was:<0>
	at org.junit.Assert.fail(Assert.java:88)
	at org.junit.Assert.failNotEquals(Assert.java:743)
	at org.junit.Assert.assertEquals(Assert.java:118)
	at org.junit.Assert.assertEquals(Assert.java:555)
	at org.junit.Assert.assertEquals(Assert.java:542)
	at org.apache.mahout.text.SequenceFilesFromLuceneStorageMRJobTest.testRun(SequenceFilesFromLuceneStorageMRJobTest.java:73)

Tests run: 2, Failures: 0, Errors: 0, Skipped: 0, Time elapsed: 4.099 sec - in org.apache.mahout.text.TestSequenceFilesFromDirectory
Tests run: 5, Failures: 0, Errors: 0, Skipped: 0, Time elapsed: 4.662 sec - in org.apache.mahout.text.SequenceFilesFromLuceneStorageDriverTest
Tests run: 3, Failures: 0, Errors: 0, Skipped: 0, Time elapsed: 6.262 sec - in org.apache.mahout.clustering.TestClusterDumper
Tests run: 12, Failures: 0, Errors: 0, Skipped: 0, Time elapsed: 6.834 sec - in org.apache.mahout.utils.SplitInputTest
Tests run: 10, Failures: 0, Errors: 0, Skipped: 0, Time elapsed: 6.96 sec - in org.apache.mahout.clustering.cdbw.TestCDbwEvaluator
Tests run: 10, Failures: 0, Errors: 0, Skipped: 0, Time elapsed: 14.836 sec - in org.apache.mahout.clustering.TestClusterEvaluator

Results :

Failed tests: 
  SequenceFilesFromLuceneStorageMRJobTest.testRun:73->Assert.assertEquals:542->Assert.assertEquals:555->Assert.assertEquals:118->Assert.failNotEquals:743->Assert.fail:88
expected:<2002> but was:<0>

Tests run: 95, Failures: 1, Errors: 0, Skipped: 0

[JENKINS] Recording test results
Oct 26, 2013 11:05:10 PM org.apache.maven.cli.event.ExecutionEventLogger logReactorSummary
INFO: ------------------------------------------------------------------------
Oct 26, 2013 11:05:10 PM org.apache.maven.cli.event.ExecutionEventLogger logReactorSummary
INFO: Reactor Summary:
Oct 26, 2013 11:05:10 PM org.apache.maven.cli.event.ExecutionEventLogger logReactorSummary
INFO: 
Oct 26, 2013 11:05:10 PM org.apache.maven.cli.event.ExecutionEventLogger logReactorSummary
INFO: Mahout Build Tools ................................ SUCCESS [14.813s]
Oct 26, 2013 11:05:10 PM org.apache.maven.cli.event.ExecutionEventLogger logReactorSummary
INFO: Apache Mahout ..................................... SUCCESS [7.936s]
Oct 26, 2013 11:05:10 PM org.apache.maven.cli.event.ExecutionEventLogger logReactorSummary
INFO: Mahout Math ....................................... SUCCESS [37.351s]
Oct 26, 2013 11:05:10 PM org.apache.maven.cli.event.ExecutionEventLogger logReactorSummary
INFO: Mahout Core ....................................... SUCCESS [2:11.994s]
Oct 26, 2013 11:05:10 PM org.apache.maven.cli.event.ExecutionEventLogger logReactorSummary
INFO: Mahout Integration ................................ FAILURE [25.180s]
Oct 26, 2013 11:05:10 PM org.apache.maven.cli.event.ExecutionEventLogger logReactorSummary
INFO: Mahout Examples ................................... SKIPPED
Oct 26, 2013 11:05:10 PM org.apache.maven.cli.event.ExecutionEventLogger logReactorSummary
INFO: Mahout Release Package ............................ SKIPPED
Oct 26, 2013 11:05:10 PM org.apache.maven.cli.event.ExecutionEventLogger logResult
INFO: ------------------------------------------------------------------------
Oct 26, 2013 11:05:10 PM org.apache.maven.cli.event.ExecutionEventLogger logResult
INFO: BUILD FAILURE
Oct 26, 2013 11:05:10 PM org.apache.maven.cli.event.ExecutionEventLogger logStats
INFO: ------------------------------------------------------------------------
Oct 26, 2013 11:05:10 PM org.apache.maven.cli.event.ExecutionEventLogger logStats
INFO: Total time: 3:38.578s
Oct 26, 2013 11:05:10 PM org.apache.maven.cli.event.ExecutionEventLogger logStats
INFO: Finished at: Sat Oct 26 23:05:10 UTC 2013
Oct 26, 2013 11:05:10 PM org.apache.maven.cli.event.ExecutionEventLogger logStats
INFO: Final Memory: 34M/403M
Oct 26, 2013 11:05:10 PM org.apache.maven.cli.event.ExecutionEventLogger sessionEnded
INFO: ------------------------------------------------------------------------
[JENKINS] Archiving <https://builds.apache.org/job/mahout-nightly/ws/trunk/buildtools/pom.xml>
to /home/hudson/hudson/jobs/mahout-nightly/modules/org.apache.mahout$mahout-buildtools/builds/2013-10-26_23-01-28/archive/org.apache.mahout/mahout-buildtools/0.9-SNAPSHOT/mahout-buildtools-0.9-SNAPSHOT.pom
[JENKINS] Archiving <https://builds.apache.org/job/mahout-nightly/ws/trunk/buildtools/target/mahout-buildtools-0.9-SNAPSHOT.jar>
to /home/hudson/hudson/jobs/mahout-nightly/modules/org.apache.mahout$mahout-buildtools/builds/2013-10-26_23-01-28/archive/org.apache.mahout/mahout-buildtools/0.9-20131026.230146-109/mahout-buildtools-0.9-20131026.230146-109.jar
[JENKINS] Archiving <https://builds.apache.org/job/mahout-nightly/ws/trunk/examples/pom.xml>
to /home/hudson/hudson/jobs/mahout-nightly/modules/org.apache.mahout$mahout-examples/builds/2013-10-26_23-01-28/archive/org.apache.mahout/mahout-examples/0.9-SNAPSHOT/mahout-examples-0.9-SNAPSHOT.pom
[JENKINS] Archiving <https://builds.apache.org/job/mahout-nightly/ws/trunk/distribution/pom.xml>
to /home/hudson/hudson/jobs/mahout-nightly/modules/org.apache.mahout$mahout-distribution/builds/2013-10-26_23-01-28/archive/org.apache.mahout/mahout-distribution/0.9-SNAPSHOT/mahout-distribution-0.9-SNAPSHOT.pom
[JENKINS] Archiving <https://builds.apache.org/job/mahout-nightly/ws/trunk/pom.xml>
to /home/hudson/hudson/jobs/mahout-nightly/modules/org.apache.mahout$mahout/builds/2013-10-26_23-01-28/archive/org.apache.mahout/mahout/0.9-SNAPSHOT/mahout-0.9-SNAPSHOT.pom
[JENKINS] Archiving <https://builds.apache.org/job/mahout-nightly/ws/trunk/integration/pom.xml>
to /home/hudson/hudson/jobs/mahout-nightly/modules/org.apache.mahout$mahout-integration/builds/2013-10-26_23-01-28/archive/org.apache.mahout/mahout-integration/0.9-SNAPSHOT/mahout-integration-0.9-SNAPSHOT.pom
[JENKINS] Archiving <https://builds.apache.org/job/mahout-nightly/ws/trunk/core/pom.xml>
to /home/hudson/hudson/jobs/mahout-nightly/modules/org.apache.mahout$mahout-core/builds/2013-10-26_23-01-28/archive/org.apache.mahout/mahout-core/0.9-SNAPSHOT/mahout-core-0.9-SNAPSHOT.pom
[JENKINS] Archiving <https://builds.apache.org/job/mahout-nightly/ws/trunk/core/target/mahout-core-0.9-SNAPSHOT.jar>
to /home/hudson/hudson/jobs/mahout-nightly/modules/org.apache.mahout$mahout-core/builds/2013-10-26_23-01-28/archive/org.apache.mahout/mahout-core/0.9-20131026.230442-83/mahout-core-0.9-20131026.230442-83.jar
[JENKINS] Archiving <https://builds.apache.org/job/mahout-nightly/ws/trunk/core/target/mahout-core-0.9-SNAPSHOT-tests.jar>
to /home/hudson/hudson/jobs/mahout-nightly/modules/org.apache.mahout$mahout-core/builds/2013-10-26_23-01-28/archive/org.apache.mahout/mahout-core/0.9-20131026.230442-83/mahout-core-0.9-20131026.230442-83-tests.jar
[JENKINS] Archiving <https://builds.apache.org/job/mahout-nightly/ws/trunk/core/target/mahout-core-0.9-SNAPSHOT-job.jar>
to /home/hudson/hudson/jobs/mahout-nightly/modules/org.apache.mahout$mahout-core/builds/2013-10-26_23-01-28/archive/org.apache.mahout/mahout-core/0.9-20131026.230442-83/mahout-core-0.9-20131026.230442-83-job.jar
[JENKINS] Archiving <https://builds.apache.org/job/mahout-nightly/ws/trunk/core/target/mahout-core-0.9-SNAPSHOT-sources.jar>
to /home/hudson/hudson/jobs/mahout-nightly/modules/org.apache.mahout$mahout-core/builds/2013-10-26_23-01-28/archive/org.apache.mahout/mahout-core/0.9-20131026.230442-83/mahout-core-0.9-20131026.230442-83-sources.jar
[JENKINS] Archiving <https://builds.apache.org/job/mahout-nightly/ws/trunk/math/pom.xml>
to /home/hudson/hudson/jobs/mahout-nightly/modules/org.apache.mahout$mahout-math/builds/2013-10-26_23-01-28/archive/org.apache.mahout/mahout-math/0.9-SNAPSHOT/mahout-math-0.9-SNAPSHOT.pom
[JENKINS] Archiving <https://builds.apache.org/job/mahout-nightly/ws/trunk/math/target/mahout-math-0.9-SNAPSHOT.jar>
to /home/hudson/hudson/jobs/mahout-nightly/modules/org.apache.mahout$mahout-math/builds/2013-10-26_23-01-28/archive/org.apache.mahout/mahout-math/0.9-20131026.230231-100/mahout-math-0.9-20131026.230231-100.jar
[JENKINS] Archiving <https://builds.apache.org/job/mahout-nightly/ws/trunk/math/target/mahout-math-0.9-SNAPSHOT-tests.jar>
to /home/hudson/hudson/jobs/mahout-nightly/modules/org.apache.mahout$mahout-math/builds/2013-10-26_23-01-28/archive/org.apache.mahout/mahout-math/0.9-20131026.230231-100/mahout-math-0.9-20131026.230231-100-tests.jar
[JENKINS] Archiving <https://builds.apache.org/job/mahout-nightly/ws/trunk/math/target/mahout-math-0.9-SNAPSHOT-sources.jar>
to /home/hudson/hudson/jobs/mahout-nightly/modules/org.apache.mahout$mahout-math/builds/2013-10-26_23-01-28/archive/org.apache.mahout/mahout-math/0.9-20131026.230231-100/mahout-math-0.9-20131026.230231-100-sources.jar
Waiting for Jenkins to finish collecting data
Sending e-mails to: dev@mahout.apache.org
channel stopped

Mime
View raw message