mahout-dev mailing list archives

Site index · List index
Message view « Date » · « Thread »
Top « Date » · « Thread »
From Apache Jenkins Server <jenk...@builds.apache.org>
Subject Build failed in Jenkins: Mahout-Quality #2241
Date Fri, 13 Sep 2013 22:51:07 GMT
See <https://builds.apache.org/job/Mahout-Quality/2241/>

------------------------------------------
[...truncated 5996 lines...]
Generating <https://builds.apache.org/job/Mahout-Quality/ws/trunk/core/target/site/apidocs/org/apache/mahout/cf/taste/recommender//package-use.html...>
Generating <https://builds.apache.org/job/Mahout-Quality/ws/trunk/core/target/site/apidocs/org/apache/mahout/cf/taste/similarity//package-use.html...>
Generating <https://builds.apache.org/job/Mahout-Quality/ws/trunk/core/target/site/apidocs/org/apache/mahout/cf/taste/similarity/precompute//package-use.html...>
Generating <https://builds.apache.org/job/Mahout-Quality/ws/trunk/core/target/site/apidocs/org/apache/mahout/classifier//package-use.html...>
Generating <https://builds.apache.org/job/Mahout-Quality/ws/trunk/core/target/site/apidocs/org/apache/mahout/classifier/df//package-use.html...>
Generating <https://builds.apache.org/job/Mahout-Quality/ws/trunk/core/target/site/apidocs/org/apache/mahout/classifier/df/builder//package-use.html...>
Generating <https://builds.apache.org/job/Mahout-Quality/ws/trunk/core/target/site/apidocs/org/apache/mahout/classifier/df/data//package-use.html...>
Generating <https://builds.apache.org/job/Mahout-Quality/ws/trunk/core/target/site/apidocs/org/apache/mahout/classifier/df/data/conditions//package-use.html...>
Generating <https://builds.apache.org/job/Mahout-Quality/ws/trunk/core/target/site/apidocs/org/apache/mahout/classifier/df/mapreduce//package-use.html...>
Generating <https://builds.apache.org/job/Mahout-Quality/ws/trunk/core/target/site/apidocs/org/apache/mahout/classifier/df/mapreduce/inmem//package-use.html...>
Generating <https://builds.apache.org/job/Mahout-Quality/ws/trunk/core/target/site/apidocs/org/apache/mahout/classifier/df/mapreduce/partial//package-use.html...>
Generating <https://builds.apache.org/job/Mahout-Quality/ws/trunk/core/target/site/apidocs/org/apache/mahout/classifier/df/node//package-use.html...>
Generating <https://builds.apache.org/job/Mahout-Quality/ws/trunk/core/target/site/apidocs/org/apache/mahout/classifier/df/ref//package-use.html...>
Generating <https://builds.apache.org/job/Mahout-Quality/ws/trunk/core/target/site/apidocs/org/apache/mahout/classifier/df/split//package-use.html...>
Generating <https://builds.apache.org/job/Mahout-Quality/ws/trunk/core/target/site/apidocs/org/apache/mahout/classifier/df/tools//package-use.html...>
Generating <https://builds.apache.org/job/Mahout-Quality/ws/trunk/core/target/site/apidocs/org/apache/mahout/classifier/evaluation//package-use.html...>
Generating <https://builds.apache.org/job/Mahout-Quality/ws/trunk/core/target/site/apidocs/org/apache/mahout/classifier/naivebayes//package-use.html...>
Generating <https://builds.apache.org/job/Mahout-Quality/ws/trunk/core/target/site/apidocs/org/apache/mahout/classifier/naivebayes/test//package-use.html...>
Generating <https://builds.apache.org/job/Mahout-Quality/ws/trunk/core/target/site/apidocs/org/apache/mahout/classifier/naivebayes/training//package-use.html...>
Generating <https://builds.apache.org/job/Mahout-Quality/ws/trunk/core/target/site/apidocs/org/apache/mahout/classifier/sequencelearning/hmm//package-use.html...>
Generating <https://builds.apache.org/job/Mahout-Quality/ws/trunk/core/target/site/apidocs/org/apache/mahout/classifier/sgd//package-use.html...>
Generating <https://builds.apache.org/job/Mahout-Quality/ws/trunk/core/target/site/apidocs/org/apache/mahout/clustering//package-use.html...>
Generating <https://builds.apache.org/job/Mahout-Quality/ws/trunk/core/target/site/apidocs/org/apache/mahout/clustering/canopy//package-use.html...>
Generating <https://builds.apache.org/job/Mahout-Quality/ws/trunk/core/target/site/apidocs/org/apache/mahout/clustering/classify//package-use.html...>
Generating <https://builds.apache.org/job/Mahout-Quality/ws/trunk/core/target/site/apidocs/org/apache/mahout/clustering/fuzzykmeans//package-use.html...>
Generating <https://builds.apache.org/job/Mahout-Quality/ws/trunk/core/target/site/apidocs/org/apache/mahout/clustering/iterator//package-use.html...>
Generating <https://builds.apache.org/job/Mahout-Quality/ws/trunk/core/target/site/apidocs/org/apache/mahout/clustering/kernel//package-use.html...>
Generating <https://builds.apache.org/job/Mahout-Quality/ws/trunk/core/target/site/apidocs/org/apache/mahout/clustering/kmeans//package-use.html...>
Generating <https://builds.apache.org/job/Mahout-Quality/ws/trunk/core/target/site/apidocs/org/apache/mahout/clustering/lda/cvb//package-use.html...>
Generating <https://builds.apache.org/job/Mahout-Quality/ws/trunk/core/target/site/apidocs/org/apache/mahout/clustering/spectral//package-use.html...>
Generating <https://builds.apache.org/job/Mahout-Quality/ws/trunk/core/target/site/apidocs/org/apache/mahout/clustering/spectral/kmeans//package-use.html...>
Generating <https://builds.apache.org/job/Mahout-Quality/ws/trunk/core/target/site/apidocs/org/apache/mahout/clustering/streaming/cluster//package-use.html...>
Generating <https://builds.apache.org/job/Mahout-Quality/ws/trunk/core/target/site/apidocs/org/apache/mahout/clustering/streaming/mapreduce//package-use.html...>
Generating <https://builds.apache.org/job/Mahout-Quality/ws/trunk/core/target/site/apidocs/org/apache/mahout/clustering/topdown//package-use.html...>
Generating <https://builds.apache.org/job/Mahout-Quality/ws/trunk/core/target/site/apidocs/org/apache/mahout/clustering/topdown/postprocessor//package-use.html...>
Generating <https://builds.apache.org/job/Mahout-Quality/ws/trunk/core/target/site/apidocs/org/apache/mahout/common//package-use.html...>
Generating <https://builds.apache.org/job/Mahout-Quality/ws/trunk/core/target/site/apidocs/org/apache/mahout/common/commandline//package-use.html...>
Generating <https://builds.apache.org/job/Mahout-Quality/ws/trunk/core/target/site/apidocs/org/apache/mahout/common/distance//package-use.html...>
Generating <https://builds.apache.org/job/Mahout-Quality/ws/trunk/core/target/site/apidocs/org/apache/mahout/common/iterator//package-use.html...>
Generating <https://builds.apache.org/job/Mahout-Quality/ws/trunk/core/target/site/apidocs/org/apache/mahout/common/iterator/sequencefile//package-use.html...>
Generating <https://builds.apache.org/job/Mahout-Quality/ws/trunk/core/target/site/apidocs/org/apache/mahout/common/lucene//package-use.html...>
Generating <https://builds.apache.org/job/Mahout-Quality/ws/trunk/core/target/site/apidocs/org/apache/mahout/common/mapreduce//package-use.html...>
Generating <https://builds.apache.org/job/Mahout-Quality/ws/trunk/core/target/site/apidocs/org/apache/mahout/common/nlp//package-use.html...>
Generating <https://builds.apache.org/job/Mahout-Quality/ws/trunk/core/target/site/apidocs/org/apache/mahout/common/parameters//package-use.html...>
Generating <https://builds.apache.org/job/Mahout-Quality/ws/trunk/core/target/site/apidocs/org/apache/mahout/driver//package-use.html...>
Generating <https://builds.apache.org/job/Mahout-Quality/ws/trunk/core/target/site/apidocs/org/apache/mahout/ep//package-use.html...>
Generating <https://builds.apache.org/job/Mahout-Quality/ws/trunk/core/target/site/apidocs/org/apache/mahout/math//package-use.html...>
Generating <https://builds.apache.org/job/Mahout-Quality/ws/trunk/core/target/site/apidocs/org/apache/mahout/math/hadoop//package-use.html...>
Generating <https://builds.apache.org/job/Mahout-Quality/ws/trunk/core/target/site/apidocs/org/apache/mahout/math/hadoop/decomposer//package-use.html...>
Generating <https://builds.apache.org/job/Mahout-Quality/ws/trunk/core/target/site/apidocs/org/apache/mahout/math/hadoop/similarity//package-use.html...>
Generating <https://builds.apache.org/job/Mahout-Quality/ws/trunk/core/target/site/apidocs/org/apache/mahout/math/hadoop/similarity/cooccurrence//package-use.html...>
Generating <https://builds.apache.org/job/Mahout-Quality/ws/trunk/core/target/site/apidocs/org/apache/mahout/math/hadoop/similarity/cooccurrence/measures//package-use.html...>
Generating <https://builds.apache.org/job/Mahout-Quality/ws/trunk/core/target/site/apidocs/org/apache/mahout/math/hadoop/solver//package-use.html...>
Generating <https://builds.apache.org/job/Mahout-Quality/ws/trunk/core/target/site/apidocs/org/apache/mahout/math/hadoop/stats//package-use.html...>
Generating <https://builds.apache.org/job/Mahout-Quality/ws/trunk/core/target/site/apidocs/org/apache/mahout/math/hadoop/stochasticsvd//package-use.html...>
Generating <https://builds.apache.org/job/Mahout-Quality/ws/trunk/core/target/site/apidocs/org/apache/mahout/math/hadoop/stochasticsvd/qr//package-use.html...>
Generating <https://builds.apache.org/job/Mahout-Quality/ws/trunk/core/target/site/apidocs/org/apache/mahout/math/neighborhood//package-use.html...>
Generating <https://builds.apache.org/job/Mahout-Quality/ws/trunk/core/target/site/apidocs/org/apache/mahout/math/random//package-use.html...>
Generating <https://builds.apache.org/job/Mahout-Quality/ws/trunk/core/target/site/apidocs/org/apache/mahout/math/ssvd//package-use.html...>
Generating <https://builds.apache.org/job/Mahout-Quality/ws/trunk/core/target/site/apidocs/org/apache/mahout/math/stats//package-use.html...>
Generating <https://builds.apache.org/job/Mahout-Quality/ws/trunk/core/target/site/apidocs/org/apache/mahout/vectorizer//package-use.html...>
Generating <https://builds.apache.org/job/Mahout-Quality/ws/trunk/core/target/site/apidocs/org/apache/mahout/vectorizer/collocations/llr//package-use.html...>
Generating <https://builds.apache.org/job/Mahout-Quality/ws/trunk/core/target/site/apidocs/org/apache/mahout/vectorizer/common//package-use.html...>
Generating <https://builds.apache.org/job/Mahout-Quality/ws/trunk/core/target/site/apidocs/org/apache/mahout/vectorizer/document//package-use.html...>
Generating <https://builds.apache.org/job/Mahout-Quality/ws/trunk/core/target/site/apidocs/org/apache/mahout/vectorizer/encoders//package-use.html...>
Generating <https://builds.apache.org/job/Mahout-Quality/ws/trunk/core/target/site/apidocs/org/apache/mahout/vectorizer/pruner//package-use.html...>
Generating <https://builds.apache.org/job/Mahout-Quality/ws/trunk/core/target/site/apidocs/org/apache/mahout/vectorizer/term//package-use.html...>
Generating <https://builds.apache.org/job/Mahout-Quality/ws/trunk/core/target/site/apidocs/org/apache/mahout/vectorizer/tfidf//package-use.html...>
Building index for all the packages and classes...
Generating <https://builds.apache.org/job/Mahout-Quality/ws/trunk/core/target/site/apidocs/overview-tree.html...>
Generating <https://builds.apache.org/job/Mahout-Quality/ws/trunk/core/target/site/apidocs/index-all.html...>
Generating <https://builds.apache.org/job/Mahout-Quality/ws/trunk/core/target/site/apidocs/deprecated-list.html...>
Building index for all classes...
Generating <https://builds.apache.org/job/Mahout-Quality/ws/trunk/core/target/site/apidocs/allclasses-frame.html...>
Generating <https://builds.apache.org/job/Mahout-Quality/ws/trunk/core/target/site/apidocs/allclasses-noframe.html...>
Generating <https://builds.apache.org/job/Mahout-Quality/ws/trunk/core/target/site/apidocs/index.html...>
Generating <https://builds.apache.org/job/Mahout-Quality/ws/trunk/core/target/site/apidocs/overview-summary.html...>
Generating <https://builds.apache.org/job/Mahout-Quality/ws/trunk/core/target/site/apidocs/help-doc.html...>
Generating <https://builds.apache.org/job/Mahout-Quality/ws/trunk/core/target/site/apidocs/stylesheet.css...>
5 warnings
[WARNING] Javadoc Warnings
[WARNING] <https://builds.apache.org/job/Mahout-Quality/ws/trunk/core/src/main/java/org/apache/mahout/common/AbstractJob.java>:103:
warning - Missing closing '}' character for inline tag: "{@link #parseArguments(String[])"
[WARNING] <https://builds.apache.org/job/Mahout-Quality/ws/trunk/core/src/main/java/org/apache/mahout/common/AbstractJob.java>:107:
warning - Missing closing '}' character for inline tag: "{@link #parseArguments(String[])"
[WARNING] <https://builds.apache.org/job/Mahout-Quality/ws/trunk/core/src/main/java/org/apache/mahout/classifier/sgd/AdaptiveLogisticRegression.java>:104:
warning - Tag @see:illegal character: "123" in "{@link #AdaptiveLogisticRegression(int, int,
org.apache.mahout.classifier.sgd.PriorFunction, int, int)}"
[WARNING] <https://builds.apache.org/job/Mahout-Quality/ws/trunk/core/src/main/java/org/apache/mahout/classifier/sgd/AdaptiveLogisticRegression.java>:104:
warning - Tag @see:illegal character: "64" in "{@link #AdaptiveLogisticRegression(int, int,
org.apache.mahout.classifier.sgd.PriorFunction, int, int)}"
[WARNING] <https://builds.apache.org/job/Mahout-Quality/ws/trunk/core/src/main/java/org/apache/mahout/classifier/sgd/AdaptiveLogisticRegression.java>:104:
warning - Tag @see: reference not found: {@link #AdaptiveLogisticRegression(int, int, org.apache.mahout.classifier.sgd.PriorFunction,
int, int)}
[INFO] Fixed Javadoc frame injection vulnerability (CVE-2013-1571) in 1 files.
[INFO] 
[INFO] --- findbugs-maven-plugin:2.5.2:findbugs (default-cli) @ mahout-core ---
[INFO] Fork Value is true
     [java] Warnings generated: 30
[INFO] Done FindBugs Analysis....
[INFO] 
[INFO] --- maven-pmd-plugin:3.0.1:pmd (default-cli) @ mahout-core ---
[INFO]                                                                         
[INFO] ------------------------------------------------------------------------
[INFO] Building Mahout Integration 0.9-SNAPSHOT
[INFO] ------------------------------------------------------------------------
[INFO] 
[INFO] --- maven-clean-plugin:2.4.1:clean (default-clean) @ mahout-integration ---
[INFO] 
[INFO] --- maven-resources-plugin:2.6:resources (default-resources) @ mahout-integration ---
[INFO] Using 'UTF-8' encoding to copy filtered resources.
[INFO] Copying 0 resource
[INFO] 
[INFO] --- maven-compiler-plugin:3.1:compile (default-compile) @ mahout-integration ---
[INFO] Changes detected - recompiling the module!
[INFO] Compiling 127 source files to <https://builds.apache.org/job/Mahout-Quality/2241/artifact/trunk/integration/target/classes>
[WARNING] Note: <https://builds.apache.org/job/Mahout-Quality/ws/trunk/integration/src/main/java/org/apache/mahout/cf/taste/impl/model/mongodb/MongoDBDataModel.java>
uses or overrides a deprecated API.
[WARNING] Note: Recompile with -Xlint:deprecation for details.
[WARNING] Note: <https://builds.apache.org/job/Mahout-Quality/ws/trunk/integration/src/main/java/org/apache/mahout/cf/taste/impl/model/mongodb/MongoDBDataModel.java>
uses unchecked or unsafe operations.
[WARNING] Note: Recompile with -Xlint:unchecked for details.
[INFO] 
[INFO] --- maven-resources-plugin:2.6:testResources (default-testResources) @ mahout-integration
---
[INFO] Using 'UTF-8' encoding to copy filtered resources.
[INFO] Copying 10 resources
[INFO] 
[INFO] --- maven-compiler-plugin:3.1:testCompile (default-testCompile) @ mahout-integration
---
[INFO] Changes detected - recompiling the module!
[INFO] Compiling 37 source files to <https://builds.apache.org/job/Mahout-Quality/2241/artifact/trunk/integration/target/test-classes>
[WARNING] Note: Some input files use or override a deprecated API.
[WARNING] Note: Recompile with -Xlint:deprecation for details.
[INFO] 
[INFO] --- maven-surefire-plugin:2.16:test (default-test) @ mahout-integration ---
[INFO] Surefire report directory: <https://builds.apache.org/job/Mahout-Quality/2241/artifact/trunk/integration/target/surefire-reports>

-------------------------------------------------------
 T E S T S
-------------------------------------------------------

-------------------------------------------------------
 T E S T S
-------------------------------------------------------
Running org.apache.mahout.text.LuceneStorageConfigurationTest
Running org.apache.mahout.text.SequenceFilesFromLuceneStorageTest
Running org.apache.mahout.text.TestSequenceFilesFromDirectory
Running org.apache.mahout.text.LuceneSegmentInputSplitTest
Running org.apache.mahout.text.SequenceFilesFromMailArchivesTest
Running org.apache.mahout.text.LuceneSegmentRecordReaderTest
Running org.apache.mahout.text.MailArchivesClusteringAnalyzerTest
Running org.apache.mahout.text.LuceneSegmentInputFormatTest
Running org.apache.mahout.text.SequenceFilesFromLuceneStorageDriverTest
Running org.apache.mahout.utils.vectors.csv.CSVVectorIteratorTest
Running org.apache.mahout.utils.vectors.VectorHelperTest
Running org.apache.mahout.text.SequenceFilesFromLuceneStorageMRJobTest
Tests run: 1, Failures: 0, Errors: 0, Skipped: 0, Time elapsed: 0.462 sec - in org.apache.mahout.text.MailArchivesClusteringAnalyzerTest
Tests run: 3, Failures: 0, Errors: 0, Skipped: 0, Time elapsed: 0.417 sec - in org.apache.mahout.utils.vectors.VectorHelperTest
Tests run: 2, Failures: 0, Errors: 0, Skipped: 0, Time elapsed: 0.832 sec - in org.apache.mahout.text.LuceneStorageConfigurationTest
Tests run: 1, Failures: 0, Errors: 0, Skipped: 0, Time elapsed: 0.833 sec - in org.apache.mahout.utils.vectors.csv.CSVVectorIteratorTest
Running org.apache.mahout.utils.vectors.arff.MapBackedARFFModelTest
Running org.apache.mahout.utils.vectors.arff.DriverTest
Running org.apache.mahout.utils.vectors.arff.ARFFVectorIterableTest
Tests run: 1, Failures: 0, Errors: 0, Skipped: 0, Time elapsed: 0.446 sec - in org.apache.mahout.utils.vectors.arff.MapBackedARFFModelTest
Running org.apache.mahout.utils.vectors.arff.ARFFTypeTest
Tests run: 8, Failures: 0, Errors: 0, Skipped: 0, Time elapsed: 0.629 sec - in org.apache.mahout.utils.vectors.arff.ARFFVectorIterableTest
Tests run: 1, Failures: 0, Errors: 0, Skipped: 0, Time elapsed: 0.364 sec - in org.apache.mahout.utils.vectors.arff.ARFFTypeTest
Running org.apache.mahout.utils.vectors.lucene.DriverTest
Tests run: 2, Failures: 0, Errors: 0, Skipped: 0, Time elapsed: 1.212 sec - in org.apache.mahout.utils.vectors.arff.DriverTest
Running org.apache.mahout.utils.vectors.lucene.CachedTermInfoTest
Running org.apache.mahout.utils.vectors.lucene.LuceneIterableTest
Running org.apache.mahout.utils.vectors.io.VectorWriterTest
Tests run: 2, Failures: 1, Errors: 0, Skipped: 0, Time elapsed: 3.38 sec <<< FAILURE!
- in org.apache.mahout.text.SequenceFilesFromMailArchivesTest
testMapReduce(org.apache.mahout.text.SequenceFilesFromMailArchivesTest)  Time elapsed: 1.897
sec  <<< FAILURE!
java.lang.AssertionError: expected:<1> but was:<0>
	at org.junit.Assert.fail(Assert.java:88)
	at org.junit.Assert.failNotEquals(Assert.java:743)
	at org.junit.Assert.assertEquals(Assert.java:118)
	at org.junit.Assert.assertEquals(Assert.java:555)
	at org.junit.Assert.assertEquals(Assert.java:542)
	at org.apache.mahout.text.SequenceFilesFromMailArchivesTest.testMapReduce(SequenceFilesFromMailArchivesTest.java:153)

Tests run: 1, Failures: 0, Errors: 0, Skipped: 0, Time elapsed: 0.823 sec - in org.apache.mahout.utils.vectors.lucene.CachedTermInfoTest
Running org.apache.mahout.utils.nlp.collocations.llr.BloomTokenFilterTest
Tests run: 3, Failures: 0, Errors: 0, Skipped: 0, Time elapsed: 0.925 sec - in org.apache.mahout.utils.vectors.lucene.LuceneIterableTest
Tests run: 5, Failures: 0, Errors: 0, Skipped: 0, Time elapsed: 0.171 sec - in org.apache.mahout.utils.nlp.collocations.llr.BloomTokenFilterTest
Running org.apache.mahout.utils.SplitInputTest
Tests run: 2, Failures: 0, Errors: 0, Skipped: 0, Time elapsed: 0.969 sec - in org.apache.mahout.utils.vectors.io.VectorWriterTest
Running org.apache.mahout.utils.regex.RegexUtilsTest
Running org.apache.mahout.utils.regex.RegexMapperTest
Tests run: 1, Failures: 0, Errors: 0, Skipped: 0, Time elapsed: 0.102 sec - in org.apache.mahout.utils.regex.RegexUtilsTest
Running org.apache.mahout.utils.email.MailProcessorTest
Running org.apache.mahout.utils.TestConcatenateVectorsJob
Tests run: 2, Failures: 0, Errors: 0, Skipped: 0, Time elapsed: 0.301 sec - in org.apache.mahout.utils.email.MailProcessorTest
Tests run: 2, Failures: 0, Errors: 0, Skipped: 0, Time elapsed: 4.805 sec - in org.apache.mahout.text.TestSequenceFilesFromDirectory
Tests run: 1, Failures: 0, Errors: 0, Skipped: 0, Time elapsed: 4.694 sec - in org.apache.mahout.text.LuceneSegmentRecordReaderTest
Tests run: 1, Failures: 0, Errors: 0, Skipped: 0, Time elapsed: 4.792 sec - in org.apache.mahout.text.LuceneSegmentInputFormatTest
Tests run: 3, Failures: 0, Errors: 0, Skipped: 0, Time elapsed: 0.864 sec - in org.apache.mahout.utils.regex.RegexMapperTest
Tests run: 2, Failures: 0, Errors: 0, Skipped: 0, Time elapsed: 5.089 sec - in org.apache.mahout.text.LuceneSegmentInputSplitTest
Running org.apache.mahout.utils.Bump125Test
Running org.apache.mahout.cf.taste.impl.similarity.jdbc.MySQLJDBCInMemoryItemSimilarityTest
Running org.apache.mahout.clustering.TestClusterEvaluator
Running org.apache.mahout.clustering.cdbw.TestCDbwEvaluator
Running org.apache.mahout.clustering.TestClusterDumper
Tests run: 1, Failures: 0, Errors: 0, Skipped: 0, Time elapsed: 0.344 sec - in org.apache.mahout.utils.Bump125Test
Tests run: 1, Failures: 0, Errors: 0, Skipped: 0, Time elapsed: 1.301 sec - in org.apache.mahout.utils.TestConcatenateVectorsJob
Tests run: 1, Failures: 0, Errors: 0, Skipped: 0, Time elapsed: 3.414 sec - in org.apache.mahout.utils.vectors.lucene.DriverTest
Tests run: 1, Failures: 0, Errors: 0, Skipped: 0, Time elapsed: 0.718 sec - in org.apache.mahout.cf.taste.impl.similarity.jdbc.MySQLJDBCInMemoryItemSimilarityTest
Tests run: 1, Failures: 0, Errors: 0, Skipped: 0, Time elapsed: 8.25 sec - in org.apache.mahout.text.SequenceFilesFromLuceneStorageMRJobTest
Tests run: 5, Failures: 0, Errors: 0, Skipped: 0, Time elapsed: 8.697 sec - in org.apache.mahout.text.SequenceFilesFromLuceneStorageDriverTest
Tests run: 6, Failures: 0, Errors: 0, Skipped: 0, Time elapsed: 8.988 sec - in org.apache.mahout.text.SequenceFilesFromLuceneStorageTest
Tests run: 12, Failures: 0, Errors: 0, Skipped: 0, Time elapsed: 7.397 sec - in org.apache.mahout.utils.SplitInputTest
Tests run: 3, Failures: 0, Errors: 0, Skipped: 0, Time elapsed: 6.007 sec - in org.apache.mahout.clustering.TestClusterDumper
Tests run: 10, Failures: 0, Errors: 0, Skipped: 0, Time elapsed: 7.543 sec - in org.apache.mahout.clustering.cdbw.TestCDbwEvaluator
Tests run: 10, Failures: 0, Errors: 0, Skipped: 0, Time elapsed: 16.883 sec - in org.apache.mahout.clustering.TestClusterEvaluator

Results :

Failed tests: 
  SequenceFilesFromMailArchivesTest.testMapReduce:153->Assert.assertEquals:542->Assert.assertEquals:555->Assert.assertEquals:118->Assert.failNotEquals:743->Assert.fail:88
expected:<1> but was:<0>

Tests run: 95, Failures: 1, Errors: 0, Skipped: 0

[INFO] ------------------------------------------------------------------------
[INFO] Reactor Summary:
[INFO] 
[INFO] Mahout Build Tools ................................ SUCCESS [13.511s]
[INFO] Apache Mahout ..................................... SUCCESS [4.994s]
[INFO] Mahout Math ....................................... SUCCESS [1:41.641s]
[INFO] Mahout Core ....................................... SUCCESS [4:35.461s]
[INFO] Mahout Integration ................................ FAILURE [28.827s]
[INFO] Mahout Examples ................................... SKIPPED
[INFO] Mahout Release Package ............................ SKIPPED
[INFO] ------------------------------------------------------------------------
[INFO] BUILD FAILURE
[INFO] ------------------------------------------------------------------------
[INFO] Total time: 7:07.872s
[INFO] Finished at: Fri Sep 13 22:50:44 UTC 2013
[INFO] Final Memory: 55M/358M
[INFO] ------------------------------------------------------------------------
[ERROR] Failed to execute goal org.apache.maven.plugins:maven-surefire-plugin:2.16:test (default-test)
on project mahout-integration: There are test failures.
[ERROR] 
[ERROR] Please refer to <https://builds.apache.org/job/Mahout-Quality/2241/artifact/trunk/integration/target/surefire-reports>
for the individual test results.
[ERROR] -> [Help 1]
[ERROR] 
[ERROR] To see the full stack trace of the errors, re-run Maven with the -e switch.
[ERROR] Re-run Maven using the -X switch to enable full debug logging.
[ERROR] 
[ERROR] For more information about the errors and possible solutions, please read the following
articles:
[ERROR] [Help 1] http://cwiki.apache.org/confluence/display/MAVEN/MojoFailureException
[ERROR] 
[ERROR] After correcting the problems, you can resume the build with the command
[ERROR]   mvn <goals> -rf :mahout-integration
Build step 'Invoke top-level Maven targets' marked build as failure
[FINDBUGS] Skipping publisher since build result is FAILURE
[PMD] Skipping publisher since build result is FAILURE
[TASKS] Skipping publisher since build result is FAILURE
Archiving artifacts
Recording test results
Publishing Javadoc

Mime
View raw message