mahout-dev mailing list archives

Site index · List index
Message view « Date » · « Thread »
Top « Date » · « Thread »
From Apache Jenkins Server <jenk...@builds.apache.org>
Subject Build failed in Jenkins: mahout-nightly #1310
Date Sat, 03 Aug 2013 00:00:45 GMT
See <https://builds.apache.org/job/mahout-nightly/1310/>

------------------------------------------
[...truncated 2020 lines...]
Downloading: http://repo.maven.apache.org/maven2/org/mongodb/bson/2.11.2/bson-2.11.2.pom
Downloaded: http://repo.maven.apache.org/maven2/org/mongodb/bson/2.11.2/bson-2.11.2.pom (830
B at 5.6 KB/sec)
Downloading: http://repo.maven.apache.org/maven2/org/apache/hbase/hbase-client/0.95.1-hadoop1/hbase-client-0.95.1-hadoop1.pom
Downloaded: http://repo.maven.apache.org/maven2/org/apache/hbase/hbase-client/0.95.1-hadoop1/hbase-client-0.95.1-hadoop1.pom
(7 KB at 79.4 KB/sec)
Downloading: http://repo.maven.apache.org/maven2/org/apache/hbase/hbase/0.95.1-hadoop1/hbase-0.95.1-hadoop1.pom
Downloaded: http://repo.maven.apache.org/maven2/org/apache/hbase/hbase/0.95.1-hadoop1/hbase-0.95.1-hadoop1.pom
(68 KB at 435.6 KB/sec)
Downloading: http://repo.maven.apache.org/maven2/org/apache/hbase/hbase-common/0.95.1-hadoop1/hbase-common-0.95.1-hadoop1.pom
Downloaded: http://repo.maven.apache.org/maven2/org/apache/hbase/hbase-common/0.95.1-hadoop1/hbase-common-0.95.1-hadoop1.pom
(12 KB at 188.0 KB/sec)
Downloading: http://repo.maven.apache.org/maven2/org/apache/hbase/hbase-protocol/0.95.1-hadoop1/hbase-protocol-0.95.1-hadoop1.pom
Downloaded: http://repo.maven.apache.org/maven2/org/apache/hbase/hbase-protocol/0.95.1-hadoop1/hbase-protocol-0.95.1-hadoop1.pom
(4 KB at 61.1 KB/sec)
Downloading: http://repo.maven.apache.org/maven2/org/mongodb/bson/2.11.2/bson-2.11.2.jar
Downloading: http://repo.maven.apache.org/maven2/org/apache/hbase/hbase-client/0.95.1-hadoop1/hbase-client-0.95.1-hadoop1.jar
Downloading: http://repo.maven.apache.org/maven2/org/apache/hbase/hbase-common/0.95.1-hadoop1/hbase-common-0.95.1-hadoop1.jar
Downloading: http://repo.maven.apache.org/maven2/org/apache/hbase/hbase-protocol/0.95.1-hadoop1/hbase-protocol-0.95.1-hadoop1.jar
Downloaded: http://repo.maven.apache.org/maven2/org/mongodb/bson/2.11.2/bson-2.11.2.jar (107
KB at 733.4 KB/sec)
Downloaded: http://repo.maven.apache.org/maven2/org/apache/hbase/hbase-common/0.95.1-hadoop1/hbase-common-0.95.1-hadoop1.jar
(276 KB at 870.4 KB/sec)
Downloaded: http://repo.maven.apache.org/maven2/org/apache/hbase/hbase-client/0.95.1-hadoop1/hbase-client-0.95.1-hadoop1.jar
(762 KB at 1780.3 KB/sec)
Downloaded: http://repo.maven.apache.org/maven2/org/apache/hbase/hbase-protocol/0.95.1-hadoop1/hbase-protocol-0.95.1-hadoop1.jar
(2420 KB at 3188.0 KB/sec)
Aug 2, 2013 11:58:52 PM org.apache.maven.cli.event.ExecutionEventLogger mojoStarted
INFO: 
Aug 2, 2013 11:58:52 PM org.apache.maven.cli.event.ExecutionEventLogger mojoStarted
INFO: --- maven-clean-plugin:2.4.1:clean (default-clean) @ mahout-integration ---
[INFO] Deleting <https://builds.apache.org/job/mahout-nightly/ws/trunk/integration/target>
Aug 2, 2013 11:58:52 PM org.apache.maven.cli.event.ExecutionEventLogger mojoStarted
INFO: 
Aug 2, 2013 11:58:52 PM org.apache.maven.cli.event.ExecutionEventLogger mojoStarted
INFO: --- maven-resources-plugin:2.6:resources (default-resources) @ mahout-integration ---
[INFO] Using 'UTF-8' encoding to copy filtered resources.
[INFO] Copying 0 resource
Aug 2, 2013 11:58:52 PM org.apache.maven.cli.event.ExecutionEventLogger mojoStarted
INFO: 
Aug 2, 2013 11:58:52 PM org.apache.maven.cli.event.ExecutionEventLogger mojoStarted
INFO: --- maven-compiler-plugin:3.1:compile (default-compile) @ mahout-integration ---
[INFO] Changes detected - recompiling the module!
[INFO] Compiling 127 source files to <https://builds.apache.org/job/mahout-nightly/ws/trunk/integration/target/classes>
[WARNING] Note: <https://builds.apache.org/job/mahout-nightly/ws/trunk/integration/src/main/java/org/apache/mahout/cf/taste/impl/model/mongodb/MongoDBDataModel.java>
uses or overrides a deprecated API.
[WARNING] Note: Recompile with -Xlint:deprecation for details.
[WARNING] Note: <https://builds.apache.org/job/mahout-nightly/ws/trunk/integration/src/main/java/org/apache/mahout/cf/taste/impl/model/mongodb/MongoDBDataModel.java>
uses unchecked or unsafe operations.
[WARNING] Note: Recompile with -Xlint:unchecked for details.
Aug 2, 2013 11:58:55 PM org.apache.maven.cli.event.ExecutionEventLogger mojoStarted
INFO: 
Aug 2, 2013 11:58:55 PM org.apache.maven.cli.event.ExecutionEventLogger mojoStarted
INFO: --- maven-resources-plugin:2.6:testResources (default-testResources) @ mahout-integration
---
[INFO] Using 'UTF-8' encoding to copy filtered resources.
[INFO] Copying 10 resources
Aug 2, 2013 11:58:55 PM org.apache.maven.cli.event.ExecutionEventLogger mojoStarted
INFO: 
Aug 2, 2013 11:58:55 PM org.apache.maven.cli.event.ExecutionEventLogger mojoStarted
INFO: --- maven-compiler-plugin:3.1:testCompile (default-testCompile) @ mahout-integration
---
[INFO] Changes detected - recompiling the module!
[INFO] Compiling 38 source files to <https://builds.apache.org/job/mahout-nightly/ws/trunk/integration/target/test-classes>
[WARNING] Note: Some input files use or override a deprecated API.
[WARNING] Note: Recompile with -Xlint:deprecation for details.
Aug 2, 2013 11:58:55 PM org.apache.maven.cli.event.ExecutionEventLogger mojoStarted
INFO: 
Aug 2, 2013 11:58:55 PM org.apache.maven.cli.event.ExecutionEventLogger mojoStarted
INFO: --- maven-surefire-plugin:2.15:test (default-test) @ mahout-integration ---
[INFO] Surefire report directory: <https://builds.apache.org/job/mahout-nightly/ws/trunk/integration/target/surefire-reports>
[INFO] parallel='classes', perCoreThreadCount=false, threadCount=1, useUnlimitedThreads=false

-------------------------------------------------------
 T E S T S
-------------------------------------------------------

-------------------------------------------------------
 T E S T S
-------------------------------------------------------
Running org.apache.mahout.cf.taste.impl.similarity.jdbc.MySQLJDBCInMemoryItemSimilarityTest
Tests run: 1, Failures: 0, Errors: 0, Skipped: 0, Time elapsed: 0.179 sec - in org.apache.mahout.cf.taste.impl.similarity.jdbc.MySQLJDBCInMemoryItemSimilarityTest
Running org.apache.mahout.clustering.TestClusterEvaluator
Tests run: 10, Failures: 0, Errors: 0, Skipped: 0, Time elapsed: 12.967 sec - in org.apache.mahout.clustering.TestClusterEvaluator
Running org.apache.mahout.clustering.TestClusterDumper
Tests run: 3, Failures: 0, Errors: 0, Skipped: 0, Time elapsed: 5.018 sec - in org.apache.mahout.clustering.TestClusterDumper
Running org.apache.mahout.clustering.cdbw.TestCDbwEvaluator
Tests run: 10, Failures: 0, Errors: 0, Skipped: 0, Time elapsed: 5.295 sec - in org.apache.mahout.clustering.cdbw.TestCDbwEvaluator
Running org.apache.mahout.utils.TestConcatenateVectorsJob
Tests run: 1, Failures: 0, Errors: 0, Skipped: 0, Time elapsed: 0.573 sec - in org.apache.mahout.utils.TestConcatenateVectorsJob
Running org.apache.mahout.utils.vectors.lucene.LuceneIterableTest
Tests run: 3, Failures: 0, Errors: 0, Skipped: 0, Time elapsed: 0.522 sec - in org.apache.mahout.utils.vectors.lucene.LuceneIterableTest
Running org.apache.mahout.utils.vectors.lucene.DriverTest
Tests run: 1, Failures: 0, Errors: 0, Skipped: 0, Time elapsed: 0.985 sec - in org.apache.mahout.utils.vectors.lucene.DriverTest
Running org.apache.mahout.utils.vectors.lucene.CachedTermInfoTest
Tests run: 1, Failures: 0, Errors: 0, Skipped: 0, Time elapsed: 0.37 sec - in org.apache.mahout.utils.vectors.lucene.CachedTermInfoTest
Running org.apache.mahout.utils.vectors.csv.CSVVectorIteratorTest
Tests run: 1, Failures: 0, Errors: 0, Skipped: 0, Time elapsed: 0.163 sec - in org.apache.mahout.utils.vectors.csv.CSVVectorIteratorTest
Running org.apache.mahout.utils.vectors.VectorHelperTest
Tests run: 3, Failures: 0, Errors: 0, Skipped: 0, Time elapsed: 0.052 sec - in org.apache.mahout.utils.vectors.VectorHelperTest
Running org.apache.mahout.utils.vectors.io.VectorWriterTest
Tests run: 2, Failures: 0, Errors: 0, Skipped: 0, Time elapsed: 0.572 sec - in org.apache.mahout.utils.vectors.io.VectorWriterTest
Running org.apache.mahout.utils.vectors.arff.MapBackedARFFModelTest
Tests run: 1, Failures: 0, Errors: 0, Skipped: 0, Time elapsed: 0.025 sec - in org.apache.mahout.utils.vectors.arff.MapBackedARFFModelTest
Running org.apache.mahout.utils.vectors.arff.ARFFVectorIterableTest
Tests run: 8, Failures: 0, Errors: 0, Skipped: 0, Time elapsed: 0.15 sec - in org.apache.mahout.utils.vectors.arff.ARFFVectorIterableTest
Running org.apache.mahout.utils.vectors.arff.DriverTest
Tests run: 2, Failures: 0, Errors: 0, Skipped: 0, Time elapsed: 0.325 sec - in org.apache.mahout.utils.vectors.arff.DriverTest
Running org.apache.mahout.utils.vectors.arff.ARFFTypeTest
Tests run: 1, Failures: 0, Errors: 0, Skipped: 0, Time elapsed: 0.008 sec - in org.apache.mahout.utils.vectors.arff.ARFFTypeTest
Running org.apache.mahout.utils.nlp.collocations.llr.BloomTokenFilterTest
Tests run: 5, Failures: 0, Errors: 0, Skipped: 0, Time elapsed: 0.062 sec - in org.apache.mahout.utils.nlp.collocations.llr.BloomTokenFilterTest
Running org.apache.mahout.utils.SplitInputTest
Tests run: 12, Failures: 0, Errors: 0, Skipped: 0, Time elapsed: 5.85 sec - in org.apache.mahout.utils.SplitInputTest
Running org.apache.mahout.utils.Bump125Test
Tests run: 1, Failures: 0, Errors: 0, Skipped: 0, Time elapsed: 0.018 sec - in org.apache.mahout.utils.Bump125Test
Running org.apache.mahout.utils.email.MailProcessorTest
Tests run: 2, Failures: 0, Errors: 0, Skipped: 0, Time elapsed: 0.076 sec - in org.apache.mahout.utils.email.MailProcessorTest
Running org.apache.mahout.utils.regex.RegexMapperTest
Tests run: 3, Failures: 0, Errors: 0, Skipped: 0, Time elapsed: 0.418 sec - in org.apache.mahout.utils.regex.RegexMapperTest
Running org.apache.mahout.utils.regex.RegexUtilsTest
Tests run: 1, Failures: 0, Errors: 0, Skipped: 0, Time elapsed: 0.012 sec - in org.apache.mahout.utils.regex.RegexUtilsTest
Running org.apache.mahout.text.SequenceFilesFromLuceneStorageTest
Tests run: 6, Failures: 0, Errors: 0, Skipped: 0, Time elapsed: 2.322 sec - in org.apache.mahout.text.SequenceFilesFromLuceneStorageTest
Running org.apache.mahout.text.SequenceFilesFromLuceneStorageMRJobTest
Tests run: 1, Failures: 0, Errors: 0, Skipped: 0, Time elapsed: 2.721 sec - in org.apache.mahout.text.SequenceFilesFromLuceneStorageMRJobTest
Running org.apache.mahout.text.LuceneSegmentInputFormatTest
Tests run: 1, Failures: 0, Errors: 0, Skipped: 0, Time elapsed: 0.846 sec - in org.apache.mahout.text.LuceneSegmentInputFormatTest
Running org.apache.mahout.text.MailArchivesClusteringAnalyzerTest
Tests run: 1, Failures: 0, Errors: 0, Skipped: 0, Time elapsed: 0.075 sec - in org.apache.mahout.text.MailArchivesClusteringAnalyzerTest
Running org.apache.mahout.text.SequenceFilesFromMailArchivesTest
Tests run: 2, Failures: 1, Errors: 0, Skipped: 0, Time elapsed: 1.835 sec <<< FAILURE!
- in org.apache.mahout.text.SequenceFilesFromMailArchivesTest
testSequential(org.apache.mahout.text.SequenceFilesFromMailArchivesTest)  Time elapsed: 0.581
sec  <<< FAILURE!
org.junit.ComparisonFailure: expected:<TEST/subdir/[mail-messages].gz/user@example.com>
but was:<TEST/subdir/[subsubdir/mail-messages-2].gz/user@example.com>
	at org.junit.Assert.assertEquals(Assert.java:115)
	at org.junit.Assert.assertEquals(Assert.java:144)
	at org.apache.mahout.text.SequenceFilesFromMailArchivesTest.testSequential(SequenceFilesFromMailArchivesTest.java:106)

Running org.apache.mahout.text.LuceneSegmentInputSplitTest
Tests run: 2, Failures: 0, Errors: 0, Skipped: 0, Time elapsed: 1.038 sec - in org.apache.mahout.text.LuceneSegmentInputSplitTest
Running org.apache.mahout.text.LuceneStorageConfigurationTest
Tests run: 2, Failures: 0, Errors: 0, Skipped: 0, Time elapsed: 0.408 sec - in org.apache.mahout.text.LuceneStorageConfigurationTest
Running org.apache.mahout.text.LuceneSegmentRecordReaderTest
Tests run: 1, Failures: 0, Errors: 0, Skipped: 0, Time elapsed: 1.278 sec - in org.apache.mahout.text.LuceneSegmentRecordReaderTest
Running org.apache.mahout.text.SequenceFilesFromLuceneStorageDriverTest
Tests run: 5, Failures: 0, Errors: 0, Skipped: 0, Time elapsed: 3.503 sec - in org.apache.mahout.text.SequenceFilesFromLuceneStorageDriverTest
Running org.apache.mahout.text.TestSequenceFilesFromDirectory
Tests run: 2, Failures: 0, Errors: 0, Skipped: 0, Time elapsed: 3.098 sec - in org.apache.mahout.text.TestSequenceFilesFromDirectory

Results :

Failed tests: 
  SequenceFilesFromMailArchivesTest.testSequential:106->Assert.assertEquals:144->Assert.assertEquals:115
expected:<TEST/subdir/[mail-messages].gz/user@example.com> but was:<TEST/subdir/[subsubdir/mail-messages-2].gz/user@example.com>

Tests run: 95, Failures: 1, Errors: 0, Skipped: 0

[JENKINS] Recording test results
Aug 2, 2013 11:59:58 PM org.apache.maven.cli.event.ExecutionEventLogger logReactorSummary
INFO: ------------------------------------------------------------------------
Aug 2, 2013 11:59:58 PM org.apache.maven.cli.event.ExecutionEventLogger logReactorSummary
INFO: Reactor Summary:
Aug 2, 2013 11:59:58 PM org.apache.maven.cli.event.ExecutionEventLogger logReactorSummary
INFO: 
Aug 2, 2013 11:59:58 PM org.apache.maven.cli.event.ExecutionEventLogger logReactorSummary
INFO: Mahout Build Tools ................................ SUCCESS [9.335s]
Aug 2, 2013 11:59:58 PM org.apache.maven.cli.event.ExecutionEventLogger logReactorSummary
INFO: Apache Mahout ..................................... SUCCESS [3.183s]
Aug 2, 2013 11:59:58 PM org.apache.maven.cli.event.ExecutionEventLogger logReactorSummary
INFO: Mahout Math ....................................... SUCCESS [1:41.976s]
Aug 2, 2013 11:59:58 PM org.apache.maven.cli.event.ExecutionEventLogger logReactorSummary
INFO: Mahout Core ....................................... SUCCESS [16:00.463s]
Aug 2, 2013 11:59:58 PM org.apache.maven.cli.event.ExecutionEventLogger logReactorSummary
INFO: Mahout Integration ................................ FAILURE [1:08.702s]
Aug 2, 2013 11:59:58 PM org.apache.maven.cli.event.ExecutionEventLogger logReactorSummary
INFO: Mahout Examples ................................... SKIPPED
Aug 2, 2013 11:59:58 PM org.apache.maven.cli.event.ExecutionEventLogger logReactorSummary
INFO: Mahout Release Package ............................ SKIPPED
Aug 2, 2013 11:59:58 PM org.apache.maven.cli.event.ExecutionEventLogger logResult
INFO: ------------------------------------------------------------------------
Aug 2, 2013 11:59:58 PM org.apache.maven.cli.event.ExecutionEventLogger logResult
INFO: BUILD FAILURE
Aug 2, 2013 11:59:58 PM org.apache.maven.cli.event.ExecutionEventLogger logStats
INFO: ------------------------------------------------------------------------
Aug 2, 2013 11:59:58 PM org.apache.maven.cli.event.ExecutionEventLogger logStats
INFO: Total time: 19:04.308s
Aug 2, 2013 11:59:58 PM org.apache.maven.cli.event.ExecutionEventLogger logStats
INFO: Finished at: Fri Aug 02 23:59:58 UTC 2013
Aug 2, 2013 11:59:58 PM org.apache.maven.cli.event.ExecutionEventLogger logStats
INFO: Final Memory: 32M/248M
Aug 2, 2013 11:59:58 PM org.apache.maven.cli.event.ExecutionEventLogger sessionEnded
INFO: ------------------------------------------------------------------------
[JENKINS] Archiving <https://builds.apache.org/job/mahout-nightly/ws/trunk/buildtools/pom.xml>
to /home/hudson/hudson/jobs/mahout-nightly/modules/org.apache.mahout$mahout-buildtools/builds/2013-08-02_23-40-50/archive/org.apache.mahout/mahout-buildtools/0.9-SNAPSHOT/mahout-buildtools-0.9-SNAPSHOT.pom
[JENKINS] Archiving <https://builds.apache.org/job/mahout-nightly/ws/trunk/buildtools/target/mahout-buildtools-0.9-SNAPSHOT.jar>
to /home/hudson/hudson/jobs/mahout-nightly/modules/org.apache.mahout$mahout-buildtools/builds/2013-08-02_23-40-50/archive/org.apache.mahout/mahout-buildtools/0.9-20130802.234101-24/mahout-buildtools-0.9-20130802.234101-24.jar
[JENKINS] Archiving <https://builds.apache.org/job/mahout-nightly/ws/trunk/examples/pom.xml>
to /home/hudson/hudson/jobs/mahout-nightly/modules/org.apache.mahout$mahout-examples/builds/2013-08-02_23-40-50/archive/org.apache.mahout/mahout-examples/0.9-SNAPSHOT/mahout-examples-0.9-SNAPSHOT.pom
[JENKINS] Archiving <https://builds.apache.org/job/mahout-nightly/ws/trunk/distribution/pom.xml>
to /home/hudson/hudson/jobs/mahout-nightly/modules/org.apache.mahout$mahout-distribution/builds/2013-08-02_23-40-50/archive/org.apache.mahout/mahout-distribution/0.9-SNAPSHOT/mahout-distribution-0.9-SNAPSHOT.pom
[JENKINS] Archiving <https://builds.apache.org/job/mahout-nightly/ws/trunk/pom.xml>
to /home/hudson/hudson/jobs/mahout-nightly/modules/org.apache.mahout$mahout/builds/2013-08-02_23-40-50/archive/org.apache.mahout/mahout/0.9-SNAPSHOT/mahout-0.9-SNAPSHOT.pom
[JENKINS] Archiving <https://builds.apache.org/job/mahout-nightly/ws/trunk/integration/pom.xml>
to /home/hudson/hudson/jobs/mahout-nightly/modules/org.apache.mahout$mahout-integration/builds/2013-08-02_23-40-50/archive/org.apache.mahout/mahout-integration/0.9-SNAPSHOT/mahout-integration-0.9-SNAPSHOT.pom
[JENKINS] Archiving <https://builds.apache.org/job/mahout-nightly/ws/trunk/core/pom.xml>
to /home/hudson/hudson/jobs/mahout-nightly/modules/org.apache.mahout$mahout-core/builds/2013-08-02_23-40-50/archive/org.apache.mahout/mahout-core/0.9-SNAPSHOT/mahout-core-0.9-SNAPSHOT.pom
[JENKINS] Archiving <https://builds.apache.org/job/mahout-nightly/ws/trunk/core/target/mahout-core-0.9-SNAPSHOT.jar>
to /home/hudson/hudson/jobs/mahout-nightly/modules/org.apache.mahout$mahout-core/builds/2013-08-02_23-40-50/archive/org.apache.mahout/mahout-core/0.9-20130802.235846-18/mahout-core-0.9-20130802.235846-18.jar
[JENKINS] Archiving <https://builds.apache.org/job/mahout-nightly/ws/trunk/core/target/mahout-core-0.9-SNAPSHOT-tests.jar>
to /home/hudson/hudson/jobs/mahout-nightly/modules/org.apache.mahout$mahout-core/builds/2013-08-02_23-40-50/archive/org.apache.mahout/mahout-core/0.9-20130802.235846-18/mahout-core-0.9-20130802.235846-18-tests.jar
[JENKINS] Archiving <https://builds.apache.org/job/mahout-nightly/ws/trunk/core/target/mahout-core-0.9-SNAPSHOT-job.jar>
to /home/hudson/hudson/jobs/mahout-nightly/modules/org.apache.mahout$mahout-core/builds/2013-08-02_23-40-50/archive/org.apache.mahout/mahout-core/0.9-20130802.235846-18/mahout-core-0.9-20130802.235846-18-job.jar
[JENKINS] Archiving <https://builds.apache.org/job/mahout-nightly/ws/trunk/core/target/mahout-core-0.9-SNAPSHOT-sources.jar>
to /home/hudson/hudson/jobs/mahout-nightly/modules/org.apache.mahout$mahout-core/builds/2013-08-02_23-40-50/archive/org.apache.mahout/mahout-core/0.9-20130802.235846-18/mahout-core-0.9-20130802.235846-18-sources.jar
[JENKINS] Archiving <https://builds.apache.org/job/mahout-nightly/ws/trunk/math/pom.xml>
to /home/hudson/hudson/jobs/mahout-nightly/modules/org.apache.mahout$mahout-math/builds/2013-08-02_23-40-50/archive/org.apache.mahout/mahout-math/0.9-SNAPSHOT/mahout-math-0.9-SNAPSHOT.pom
[JENKINS] Archiving <https://builds.apache.org/job/mahout-nightly/ws/trunk/math/target/mahout-math-0.9-SNAPSHOT.jar>
to /home/hudson/hudson/jobs/mahout-nightly/modules/org.apache.mahout$mahout-math/builds/2013-08-02_23-40-50/archive/org.apache.mahout/mahout-math/0.9-20130802.234247-23/mahout-math-0.9-20130802.234247-23.jar
[JENKINS] Archiving <https://builds.apache.org/job/mahout-nightly/ws/trunk/math/target/mahout-math-0.9-SNAPSHOT-tests.jar>
to /home/hudson/hudson/jobs/mahout-nightly/modules/org.apache.mahout$mahout-math/builds/2013-08-02_23-40-50/archive/org.apache.mahout/mahout-math/0.9-20130802.234247-23/mahout-math-0.9-20130802.234247-23-tests.jar
[JENKINS] Archiving <https://builds.apache.org/job/mahout-nightly/ws/trunk/math/target/mahout-math-0.9-SNAPSHOT-sources.jar>
to /home/hudson/hudson/jobs/mahout-nightly/modules/org.apache.mahout$mahout-math/builds/2013-08-02_23-40-50/archive/org.apache.mahout/mahout-math/0.9-20130802.234247-23/mahout-math-0.9-20130802.234247-23-sources.jar
Waiting for Jenkins to finish collecting data
mavenExecutionResult exceptions not empty
message : Failed to execute goal org.apache.maven.plugins:maven-surefire-plugin:2.15:test
(default-test) on project mahout-integration: There are test failures.

Please refer to <https://builds.apache.org/job/mahout-nightly/ws/trunk/integration/target/surefire-reports>
for the individual test results.
cause : There are test failures.

Please refer to <https://builds.apache.org/job/mahout-nightly/ws/trunk/integration/target/surefire-reports>
for the individual test results.
Stack trace : 
org.apache.maven.lifecycle.LifecycleExecutionException: Failed to execute goal org.apache.maven.plugins:maven-surefire-plugin:2.15:test
(default-test) on project mahout-integration: There are test failures.

Please refer to <https://builds.apache.org/job/mahout-nightly/ws/trunk/integration/target/surefire-reports>
for the individual test results.
	at org.apache.maven.lifecycle.internal.MojoExecutor.execute(MojoExecutor.java:213)
	at org.apache.maven.lifecycle.internal.MojoExecutor.execute(MojoExecutor.java:153)
	at org.apache.maven.lifecycle.internal.MojoExecutor.execute(MojoExecutor.java:145)
	at org.apache.maven.lifecycle.internal.LifecycleModuleBuilder.buildProject(LifecycleModuleBuilder.java:84)
	at org.apache.maven.lifecycle.internal.LifecycleModuleBuilder.buildProject(LifecycleModuleBuilder.java:59)
	at org.apache.maven.lifecycle.internal.LifecycleStarter.singleThreadedBuild(LifecycleStarter.java:183)
	at org.apache.maven.lifecycle.internal.LifecycleStarter.execute(LifecycleStarter.java:161)
	at org.apache.maven.DefaultMaven.doExecute(DefaultMaven.java:320)
	at org.apache.maven.DefaultMaven.execute(DefaultMaven.java:156)
	at org.jvnet.hudson.maven3.launcher.Maven3Launcher.main(Maven3Launcher.java:117)
	at sun.reflect.NativeMethodAccessorImpl.invoke0(Native Method)
	at sun.reflect.NativeMethodAccessorImpl.invoke(NativeMethodAccessorImpl.java:39)
	at sun.reflect.DelegatingMethodAccessorImpl.invoke(DelegatingMethodAccessorImpl.java:25)
	at java.lang.reflect.Method.invoke(Method.java:597)
	at org.codehaus.plexus.classworlds.launcher.Launcher.launchStandard(Launcher.java:329)
	at org.codehaus.plexus.classworlds.launcher.Launcher.launch(Launcher.java:239)
	at org.jvnet.hudson.maven3.agent.Maven3Main.launch(Maven3Main.java:178)
	at sun.reflect.NativeMethodAccessorImpl.invoke0(Native Method)
	at sun.reflect.NativeMethodAccessorImpl.invoke(NativeMethodAccessorImpl.java:39)
	at sun.reflect.DelegatingMethodAccessorImpl.invoke(DelegatingMethodAccessorImpl.java:25)
	at java.lang.reflect.Method.invoke(Method.java:597)
	at hudson.maven.Maven3Builder.call(Maven3Builder.java:129)
	at hudson.maven.Maven3Builder.call(Maven3Builder.java:67)
	at hudson.remoting.UserRequest.perform(UserRequest.java:118)
	at hudson.remoting.UserRequest.perform(UserRequest.java:48)
	at hudson.remoting.Request$2.run(Request.java:326)
	at hudson.remoting.InterceptingExecutorService$1.call(InterceptingExecutorService.java:72)
	at java.util.concurrent.FutureTask$Sync.innerRun(FutureTask.java:303)
	at java.util.concurrent.FutureTask.run(FutureTask.java:138)
	at java.util.concurrent.ThreadPoolExecutor$Worker.runTask(ThreadPoolExecutor.java:895)
	at java.util.concurrent.ThreadPoolExecutor$Worker.run(ThreadPoolExecutor.java:918)
	at java.lang.Thread.run(Thread.java:662)
Caused by: org.apache.maven.plugin.MojoFailureException: There are test failures.

Please refer to <https://builds.apache.org/job/mahout-nightly/ws/trunk/integration/target/surefire-reports>
for the individual test results.
	at org.apache.maven.plugin.surefire.SurefireHelper.reportExecution(SurefireHelper.java:82)
	at org.apache.maven.plugin.surefire.SurefirePlugin.handleSummary(SurefirePlugin.java:169)
	at org.apache.maven.plugin.surefire.AbstractSurefireMojo.executeAfterPreconditionsChecked(AbstractSurefireMojo.java:777)
	at org.apache.maven.plugin.surefire.AbstractSurefireMojo.execute(AbstractSurefireMojo.java:645)
	at org.apache.maven.plugin.DefaultBuildPluginManager.executeMojo(DefaultBuildPluginManager.java:101)
	at org.apache.maven.lifecycle.internal.MojoExecutor.execute(MojoExecutor.java:209)
	... 31 more
Sending e-mails to: dev@mahout.apache.org
channel stopped

Mime
View raw message