mahout-dev mailing list archives

Site index · List index
Message view « Date » · « Thread »
Top « Date » · « Thread »
From Apache Jenkins Server <jenk...@builds.apache.org>
Subject Build failed in Jenkins: Mahout-Quality #2184
Date Sun, 04 Aug 2013 22:24:54 GMT
See <https://builds.apache.org/job/Mahout-Quality/2184/>

------------------------------------------
[...truncated 310831 lines...]
     [java] Applying edu.umd.cs.findbugs.detect.LostLoggerDueToWeakReference to org/apache/mahout/cf/taste/impl/recommender/svd/ParallelSGDFactorizer
     [java] Applying edu.umd.cs.findbugs.detect.CheckImmutableAnnotation to org/apache/mahout/cf/taste/impl/recommender/svd/ParallelSGDFactorizer
     [java] Applying edu.umd.cs.findbugs.detect.DontCatchIllegalMonitorStateException to org/apache/mahout/cf/taste/impl/recommender/svd/ParallelSGDFactorizer
     [java] Applying edu.umd.cs.findbugs.detect.CloneIdiom to org/apache/mahout/cf/taste/impl/recommender/svd/ParallelSGDFactorizer
     [java] Applying edu.umd.cs.findbugs.detect.ComparatorIdiom to org/apache/mahout/cf/taste/impl/recommender/svd/ParallelSGDFactorizer
     [java] Applying edu.umd.cs.findbugs.detect.FindFieldSelfAssignment to org/apache/mahout/cf/taste/impl/recommender/svd/ParallelSGDFactorizer
     [java] Applying edu.umd.cs.findbugs.detect.FindSelfComparison to org/apache/mahout/cf/taste/impl/recommender/svd/ParallelSGDFactorizer
     [java] Applying edu.umd.cs.findbugs.detect.FindSelfComparison2 to org/apache/mahout/cf/taste/impl/recommender/svd/ParallelSGDFactorizer
     [java] Applying edu.umd.cs.findbugs.detect.DroppedException to org/apache/mahout/cf/taste/impl/recommender/svd/ParallelSGDFactorizer
     [java] Applying edu.umd.cs.findbugs.detect.LoadOfKnownNullValue to org/apache/mahout/cf/taste/impl/recommender/svd/ParallelSGDFactorizer
     [java] Applying edu.umd.cs.findbugs.detect.DumbMethodInvocations to org/apache/mahout/cf/taste/impl/recommender/svd/ParallelSGDFactorizer
     [java] Applying edu.umd.cs.findbugs.detect.URLProblems to org/apache/mahout/cf/taste/impl/recommender/svd/ParallelSGDFactorizer
     [java] Applying edu.umd.cs.findbugs.detect.DumbMethods to org/apache/mahout/cf/taste/impl/recommender/svd/ParallelSGDFactorizer
     [java] Applying edu.umd.cs.findbugs.detect.NumberConstructor to org/apache/mahout/cf/taste/impl/recommender/svd/ParallelSGDFactorizer
     [java] Applying edu.umd.cs.findbugs.detect.FindSqlInjection to org/apache/mahout/cf/taste/impl/recommender/svd/ParallelSGDFactorizer
     [java] Applying edu.umd.cs.findbugs.detect.FindDoubleCheck to org/apache/mahout/cf/taste/impl/recommender/svd/ParallelSGDFactorizer
     [java] Applying edu.umd.cs.findbugs.detect.FindFinalizeInvocations to org/apache/mahout/cf/taste/impl/recommender/svd/ParallelSGDFactorizer
     [java] Applying edu.umd.cs.findbugs.detect.FindHEmismatch to org/apache/mahout/cf/taste/impl/recommender/svd/ParallelSGDFactorizer
     [java] Applying edu.umd.cs.findbugs.detect.FindNakedNotify to org/apache/mahout/cf/taste/impl/recommender/svd/ParallelSGDFactorizer
     [java] Applying edu.umd.cs.findbugs.detect.FindReturnRef to org/apache/mahout/cf/taste/impl/recommender/svd/ParallelSGDFactorizer
     [java] Applying edu.umd.cs.findbugs.detect.FindRunInvocations to org/apache/mahout/cf/taste/impl/recommender/svd/ParallelSGDFactorizer
     [java] Applying edu.umd.cs.findbugs.detect.SwitchFallthrough to org/apache/mahout/cf/taste/impl/recommender/svd/ParallelSGDFactorizer
     [java] Applying edu.umd.cs.findbugs.detect.FindSpinLoop to org/apache/mahout/cf/taste/impl/recommender/svd/ParallelSGDFactorizer
     [java] Applying edu.umd.cs.findbugs.detect.FindNonShortCircuit to org/apache/mahout/cf/taste/impl/recommender/svd/ParallelSGDFactorizer
     [java] Applying edu.umd.cs.findbugs.detect.FindTwoLockWait to org/apache/mahout/cf/taste/impl/recommender/svd/ParallelSGDFactorizer
     [java] Applying edu.umd.cs.findbugs.detect.FindUnconditionalWait to org/apache/mahout/cf/taste/impl/recommender/svd/ParallelSGDFactorizer
     [java] Applying edu.umd.cs.findbugs.detect.DontUseEnum to org/apache/mahout/cf/taste/impl/recommender/svd/ParallelSGDFactorizer
     [java] Applying edu.umd.cs.findbugs.detect.FindUnsyncGet to org/apache/mahout/cf/taste/impl/recommender/svd/ParallelSGDFactorizer
     [java] Applying edu.umd.cs.findbugs.detect.InitializationChain to org/apache/mahout/cf/taste/impl/recommender/svd/ParallelSGDFactorizer
     [java] Applying edu.umd.cs.findbugs.detect.IteratorIdioms to org/apache/mahout/cf/taste/impl/recommender/svd/ParallelSGDFactorizer
     [java] Applying edu.umd.cs.findbugs.detect.PreferZeroLengthArrays to org/apache/mahout/cf/taste/impl/recommender/svd/ParallelSGDFactorizer
     [java] Applying edu.umd.cs.findbugs.detect.SynchronizingOnContentsOfFieldToProtectField
to org/apache/mahout/cf/taste/impl/recommender/svd/ParallelSGDFactorizer
     [java] Applying edu.umd.cs.findbugs.detect.MutableLock to org/apache/mahout/cf/taste/impl/recommender/svd/ParallelSGDFactorizer
     [java] Applying edu.umd.cs.findbugs.detect.MutableStaticFields to org/apache/mahout/cf/taste/impl/recommender/svd/ParallelSGDFactorizer
     [java] Applying edu.umd.cs.findbugs.detect.Naming to org/apache/mahout/cf/taste/impl/recommender/svd/ParallelSGDFactorizer
     [java] Applying edu.umd.cs.findbugs.detect.ReadReturnShouldBeChecked to org/apache/mahout/cf/taste/impl/recommender/svd/ParallelSGDFactorizer
     [java] Applying edu.umd.cs.findbugs.detect.SerializableIdiom to org/apache/mahout/cf/taste/impl/recommender/svd/ParallelSGDFactorizer
     [java] Applying edu.umd.cs.findbugs.detect.StartInConstructor to org/apache/mahout/cf/taste/impl/recommender/svd/ParallelSGDFactorizer
     [java] Applying edu.umd.cs.findbugs.detect.FindBadForLoop to org/apache/mahout/cf/taste/impl/recommender/svd/ParallelSGDFactorizer
     [java] Applying edu.umd.cs.findbugs.detect.WaitInLoop to org/apache/mahout/cf/taste/impl/recommender/svd/ParallelSGDFactorizer
     [java] Applying edu.umd.cs.findbugs.detect.FindNullDerefsInvolvingNonShortCircuitEvaluation
to org/apache/mahout/cf/taste/impl/recommender/svd/ParallelSGDFactorizer
     [java] Applying edu.umd.cs.findbugs.detect.FindOpenStream to org/apache/mahout/cf/taste/impl/recommender/svd/ParallelSGDFactorizer
     [java] Applying edu.umd.cs.findbugs.detect.FindUselessControlFlow to org/apache/mahout/cf/taste/impl/recommender/svd/ParallelSGDFactorizer
     [java] Applying edu.umd.cs.findbugs.detect.FindUnreleasedLock to org/apache/mahout/cf/taste/impl/recommender/svd/ParallelSGDFactorizer
     [java] Applying edu.umd.cs.findbugs.detect.FindRefComparison to org/apache/mahout/cf/taste/impl/recommender/svd/ParallelSGDFactorizer
     [java] Applying edu.umd.cs.findbugs.detect.FindMismatchedWaitOrNotify to org/apache/mahout/cf/taste/impl/recommender/svd/ParallelSGDFactorizer
     [java] Applying edu.umd.cs.findbugs.detect.FindEmptySynchronizedBlock to org/apache/mahout/cf/taste/impl/recommender/svd/ParallelSGDFactorizer
     [java] Applying edu.umd.cs.findbugs.detect.FindInconsistentSync2 to org/apache/mahout/cf/taste/impl/recommender/svd/ParallelSGDFactorizer
     [java] Applying edu.umd.cs.findbugs.detect.FindLocalSelfAssignment2 to org/apache/mahout/cf/taste/impl/recommender/svd/ParallelSGDFactorizer
     [java] Applying edu.umd.cs.findbugs.detect.IncompatMask to org/apache/mahout/cf/taste/impl/recommender/svd/ParallelSGDFactorizer
     [java] Applying edu.umd.cs.findbugs.detect.LazyInit to org/apache/mahout/cf/taste/impl/recommender/svd/ParallelSGDFactorizer
     [java] Applying edu.umd.cs.findbugs.detect.FindJSR166LockMonitorenter to org/apache/mahout/cf/taste/impl/recommender/svd/ParallelSGDFactorizer
     [java] Applying edu.umd.cs.findbugs.detect.FindUncalledPrivateMethods to org/apache/mahout/cf/taste/impl/recommender/svd/ParallelSGDFactorizer
     [java] Applying edu.umd.cs.findbugs.detect.UncallableMethodOfAnonymousClass to org/apache/mahout/cf/taste/impl/recommender/svd/ParallelSGDFactorizer
     [java] Applying edu.umd.cs.findbugs.detect.StringConcatenation to org/apache/mahout/cf/taste/impl/recommender/svd/ParallelSGDFactorizer
     [java] Applying edu.umd.cs.findbugs.detect.InefficientToArray to org/apache/mahout/cf/taste/impl/recommender/svd/ParallelSGDFactorizer
     [java] Applying edu.umd.cs.findbugs.detect.InvalidJUnitTest to org/apache/mahout/cf/taste/impl/recommender/svd/ParallelSGDFactorizer
     [java] Applying edu.umd.cs.findbugs.detect.BadlyOverriddenAdapter to org/apache/mahout/cf/taste/impl/recommender/svd/ParallelSGDFactorizer
     [java] Applying edu.umd.cs.findbugs.detect.BadResultSetAccess to org/apache/mahout/cf/taste/impl/recommender/svd/ParallelSGDFactorizer
     [java] Applying edu.umd.cs.findbugs.detect.SuperfluousInstanceOf to org/apache/mahout/cf/taste/impl/recommender/svd/ParallelSGDFactorizer
     [java] Applying edu.umd.cs.findbugs.detect.SuspiciousThreadInterrupted to org/apache/mahout/cf/taste/impl/recommender/svd/ParallelSGDFactorizer
     [java] Applying edu.umd.cs.findbugs.detect.FindDeadLocalStores to org/apache/mahout/cf/taste/impl/recommender/svd/ParallelSGDFactorizer
     [java] Applying edu.umd.cs.findbugs.detect.WrongMapIterator to org/apache/mahout/cf/taste/impl/recommender/svd/ParallelSGDFactorizer
     [java] Applying edu.umd.cs.findbugs.detect.InstantiateStaticClass to org/apache/mahout/cf/taste/impl/recommender/svd/ParallelSGDFactorizer
     [java] Applying edu.umd.cs.findbugs.detect.RuntimeExceptionCapture to org/apache/mahout/cf/taste/impl/recommender/svd/ParallelSGDFactorizer
     [java] Applying edu.umd.cs.findbugs.detect.FindFloatEquality to org/apache/mahout/cf/taste/impl/recommender/svd/ParallelSGDFactorizer
     [java] Applying edu.umd.cs.findbugs.detect.FindUnsatisfiedObligation to org/apache/mahout/cf/taste/impl/recommender/svd/ParallelSGDFactorizer
     [java] Applying edu.umd.cs.findbugs.detect.UnnecessaryMath to org/apache/mahout/cf/taste/impl/recommender/svd/ParallelSGDFactorizer
     [java] Applying edu.umd.cs.findbugs.detect.RedundantInterfaces to org/apache/mahout/cf/taste/impl/recommender/svd/ParallelSGDFactorizer
     [java] Applying edu.umd.cs.findbugs.detect.MultithreadedInstanceAccess to org/apache/mahout/cf/taste/impl/recommender/svd/ParallelSGDFactorizer
     [java] Applying edu.umd.cs.findbugs.detect.BadUseOfReturnValue to org/apache/mahout/cf/taste/impl/recommender/svd/ParallelSGDFactorizer
     [java] Applying edu.umd.cs.findbugs.detect.MethodReturnCheck to org/apache/mahout/cf/taste/impl/recommender/svd/ParallelSGDFactorizer
     [java] Applying edu.umd.cs.findbugs.detect.IDivResultCastToDouble to org/apache/mahout/cf/taste/impl/recommender/svd/ParallelSGDFactorizer
     [java] Applying edu.umd.cs.findbugs.detect.FindBadCast2 to org/apache/mahout/cf/taste/impl/recommender/svd/ParallelSGDFactorizer
     [java] Applying edu.umd.cs.findbugs.detect.BadSyntaxForRegularExpression to org/apache/mahout/cf/taste/impl/recommender/svd/ParallelSGDFactorizer
     [java] Applying edu.umd.cs.findbugs.detect.VarArgsProblems to org/apache/mahout/cf/taste/impl/recommender/svd/ParallelSGDFactorizer
     [java] Applying edu.umd.cs.findbugs.detect.FindPuzzlers to org/apache/mahout/cf/taste/impl/recommender/svd/ParallelSGDFactorizer
     [java] Applying edu.umd.cs.findbugs.detect.IntCast2LongAsInstant to org/apache/mahout/cf/taste/impl/recommender/svd/ParallelSGDFactorizer
     [java] Applying edu.umd.cs.findbugs.detect.FindSleepWithLockHeld to org/apache/mahout/cf/taste/impl/recommender/svd/ParallelSGDFactorizer
     [java] Applying edu.umd.cs.findbugs.detect.DuplicateBranches to org/apache/mahout/cf/taste/impl/recommender/svd/ParallelSGDFactorizer
     [java] Applying edu.umd.cs.findbugs.detect.XMLFactoryBypass to org/apache/mahout/cf/taste/impl/recommender/svd/ParallelSGDFactorizer
     [java] Applying edu.umd.cs.findbugs.detect.ConfusedInheritance to org/apache/mahout/cf/taste/impl/recommender/svd/ParallelSGDFactorizer
     [java] Applying edu.umd.cs.findbugs.detect.QuestionableBooleanAssignment to org/apache/mahout/cf/taste/impl/recommender/svd/ParallelSGDFactorizer
     [java] Applying edu.umd.cs.findbugs.detect.AppendingToAnObjectOutputStream to org/apache/mahout/cf/taste/impl/recommender/svd/ParallelSGDFactorizer
     [java] Applying edu.umd.cs.findbugs.detect.FindUnrelatedTypesInGenericContainer to org/apache/mahout/cf/taste/impl/recommender/svd/ParallelSGDFactorizer
     [java] Applying edu.umd.cs.findbugs.detect.StaticCalendarDetector to org/apache/mahout/cf/taste/impl/recommender/svd/ParallelSGDFactorizer
     [java] Applying edu.umd.cs.findbugs.detect.CheckTypeQualifiers to org/apache/mahout/cf/taste/impl/recommender/svd/ParallelSGDFactorizer
     [java] Applying edu.umd.cs.findbugs.detect.CrossSiteScripting to org/apache/mahout/cf/taste/impl/recommender/svd/ParallelSGDFactorizer
     [java] Applying edu.umd.cs.findbugs.detect.AtomicityProblem to org/apache/mahout/cf/taste/impl/recommender/svd/ParallelSGDFactorizer
     [java] Applying edu.umd.cs.findbugs.detect.DefaultEncodingDetector to org/apache/mahout/cf/taste/impl/recommender/svd/ParallelSGDFactorizer
     [java] Pass 2: Analyzing classes (784 / 784) - 100% completeDone with analysis
     [java] Warnings generated: 31
     [java] Analysis completed
[INFO] Done FindBugs Analysis....
[INFO] 
[INFO] --- maven-pmd-plugin:3.0.1:pmd (default-cli) @ mahout-core ---
[INFO]                                                                         
[INFO] ------------------------------------------------------------------------
[INFO] Building Mahout Integration 0.9-SNAPSHOT
[INFO] ------------------------------------------------------------------------
[INFO] 
[INFO] --- maven-clean-plugin:2.4.1:clean (default-clean) @ mahout-integration ---
[INFO] 
[INFO] --- maven-resources-plugin:2.6:resources (default-resources) @ mahout-integration ---
[INFO] Using 'UTF-8' encoding to copy filtered resources.
[INFO] Copying 0 resource
[INFO] 
[INFO] --- maven-compiler-plugin:3.1:compile (default-compile) @ mahout-integration ---
[INFO] Changes detected - recompiling the module!
[INFO] Compiling 127 source files to /x1/jenkins/jenkins-slave/workspace/Mahout-Quality/trunk/integration/target/classes
[WARNING] Note: /x1/jenkins/jenkins-slave/workspace/Mahout-Quality/trunk/integration/src/main/java/org/apache/mahout/cf/taste/impl/model/mongodb/MongoDBDataModel.java
uses or overrides a deprecated API.
[WARNING] Note: Recompile with -Xlint:deprecation for details.
[WARNING] Note: /x1/jenkins/jenkins-slave/workspace/Mahout-Quality/trunk/integration/src/main/java/org/apache/mahout/cf/taste/impl/model/mongodb/MongoDBDataModel.java
uses unchecked or unsafe operations.
[WARNING] Note: Recompile with -Xlint:unchecked for details.
[INFO] 
[INFO] --- maven-resources-plugin:2.6:testResources (default-testResources) @ mahout-integration
---
[INFO] Using 'UTF-8' encoding to copy filtered resources.
[INFO] Copying 10 resources
[INFO] 
[INFO] --- maven-compiler-plugin:3.1:testCompile (default-testCompile) @ mahout-integration
---
[INFO] Changes detected - recompiling the module!
[INFO] Compiling 38 source files to /x1/jenkins/jenkins-slave/workspace/Mahout-Quality/trunk/integration/target/test-classes
[WARNING] Note: Some input files use or override a deprecated API.
[WARNING] Note: Recompile with -Xlint:deprecation for details.
[INFO] 
[INFO] --- maven-surefire-plugin:2.15:test (default-test) @ mahout-integration ---
[INFO] Surefire report directory: /x1/jenkins/jenkins-slave/workspace/Mahout-Quality/trunk/integration/target/surefire-reports
[INFO] parallel='classes', perCoreThreadCount=false, threadCount=1, useUnlimitedThreads=false

-------------------------------------------------------
 T E S T S
-------------------------------------------------------

-------------------------------------------------------
 T E S T S
-------------------------------------------------------
Running org.apache.mahout.cf.taste.impl.similarity.jdbc.MySQLJDBCInMemoryItemSimilarityTest
Tests run: 1, Failures: 0, Errors: 0, Skipped: 0, Time elapsed: 0.192 sec - in org.apache.mahout.cf.taste.impl.similarity.jdbc.MySQLJDBCInMemoryItemSimilarityTest
Running org.apache.mahout.clustering.TestClusterEvaluator
Tests run: 10, Failures: 0, Errors: 0, Skipped: 0, Time elapsed: 12.937 sec - in org.apache.mahout.clustering.TestClusterEvaluator
Running org.apache.mahout.clustering.TestClusterDumper
Tests run: 3, Failures: 0, Errors: 0, Skipped: 0, Time elapsed: 4.937 sec - in org.apache.mahout.clustering.TestClusterDumper
Running org.apache.mahout.clustering.cdbw.TestCDbwEvaluator
Tests run: 10, Failures: 0, Errors: 0, Skipped: 0, Time elapsed: 5.159 sec - in org.apache.mahout.clustering.cdbw.TestCDbwEvaluator
Running org.apache.mahout.utils.TestConcatenateVectorsJob
Tests run: 1, Failures: 0, Errors: 0, Skipped: 0, Time elapsed: 0.464 sec - in org.apache.mahout.utils.TestConcatenateVectorsJob
Running org.apache.mahout.utils.vectors.lucene.LuceneIterableTest
Tests run: 3, Failures: 0, Errors: 0, Skipped: 0, Time elapsed: 0.579 sec - in org.apache.mahout.utils.vectors.lucene.LuceneIterableTest
Running org.apache.mahout.utils.vectors.lucene.DriverTest
Tests run: 1, Failures: 0, Errors: 0, Skipped: 0, Time elapsed: 1.007 sec - in org.apache.mahout.utils.vectors.lucene.DriverTest
Running org.apache.mahout.utils.vectors.lucene.CachedTermInfoTest
Tests run: 1, Failures: 0, Errors: 0, Skipped: 0, Time elapsed: 0.401 sec - in org.apache.mahout.utils.vectors.lucene.CachedTermInfoTest
Running org.apache.mahout.utils.vectors.csv.CSVVectorIteratorTest
Tests run: 1, Failures: 0, Errors: 0, Skipped: 0, Time elapsed: 0.226 sec - in org.apache.mahout.utils.vectors.csv.CSVVectorIteratorTest
Running org.apache.mahout.utils.vectors.VectorHelperTest
Tests run: 3, Failures: 0, Errors: 0, Skipped: 0, Time elapsed: 0.051 sec - in org.apache.mahout.utils.vectors.VectorHelperTest
Running org.apache.mahout.utils.vectors.io.VectorWriterTest
Tests run: 2, Failures: 0, Errors: 0, Skipped: 0, Time elapsed: 0.599 sec - in org.apache.mahout.utils.vectors.io.VectorWriterTest
Running org.apache.mahout.utils.vectors.arff.MapBackedARFFModelTest
Tests run: 1, Failures: 0, Errors: 0, Skipped: 0, Time elapsed: 0.022 sec - in org.apache.mahout.utils.vectors.arff.MapBackedARFFModelTest
Running org.apache.mahout.utils.vectors.arff.ARFFVectorIterableTest
Tests run: 8, Failures: 0, Errors: 0, Skipped: 0, Time elapsed: 0.144 sec - in org.apache.mahout.utils.vectors.arff.ARFFVectorIterableTest
Running org.apache.mahout.utils.vectors.arff.DriverTest
Tests run: 2, Failures: 0, Errors: 0, Skipped: 0, Time elapsed: 0.357 sec - in org.apache.mahout.utils.vectors.arff.DriverTest
Running org.apache.mahout.utils.vectors.arff.ARFFTypeTest
Tests run: 1, Failures: 0, Errors: 0, Skipped: 0, Time elapsed: 0.005 sec - in org.apache.mahout.utils.vectors.arff.ARFFTypeTest
Running org.apache.mahout.utils.nlp.collocations.llr.BloomTokenFilterTest
Tests run: 5, Failures: 0, Errors: 0, Skipped: 0, Time elapsed: 0.062 sec - in org.apache.mahout.utils.nlp.collocations.llr.BloomTokenFilterTest
Running org.apache.mahout.utils.SplitInputTest
Tests run: 12, Failures: 0, Errors: 0, Skipped: 0, Time elapsed: 5.892 sec - in org.apache.mahout.utils.SplitInputTest
Running org.apache.mahout.utils.Bump125Test
Tests run: 1, Failures: 0, Errors: 0, Skipped: 0, Time elapsed: 0.018 sec - in org.apache.mahout.utils.Bump125Test
Running org.apache.mahout.utils.email.MailProcessorTest
Tests run: 2, Failures: 0, Errors: 0, Skipped: 0, Time elapsed: 0.121 sec - in org.apache.mahout.utils.email.MailProcessorTest
Running org.apache.mahout.utils.regex.RegexMapperTest
Tests run: 3, Failures: 0, Errors: 0, Skipped: 0, Time elapsed: 0.515 sec - in org.apache.mahout.utils.regex.RegexMapperTest
Running org.apache.mahout.utils.regex.RegexUtilsTest
Tests run: 1, Failures: 0, Errors: 0, Skipped: 0, Time elapsed: 0.017 sec - in org.apache.mahout.utils.regex.RegexUtilsTest
Running org.apache.mahout.text.SequenceFilesFromLuceneStorageTest
Tests run: 6, Failures: 0, Errors: 0, Skipped: 0, Time elapsed: 2.231 sec - in org.apache.mahout.text.SequenceFilesFromLuceneStorageTest
Running org.apache.mahout.text.SequenceFilesFromLuceneStorageMRJobTest
Tests run: 1, Failures: 0, Errors: 0, Skipped: 0, Time elapsed: 2.703 sec - in org.apache.mahout.text.SequenceFilesFromLuceneStorageMRJobTest
Running org.apache.mahout.text.LuceneSegmentInputFormatTest
Tests run: 1, Failures: 0, Errors: 0, Skipped: 0, Time elapsed: 0.935 sec - in org.apache.mahout.text.LuceneSegmentInputFormatTest
Running org.apache.mahout.text.MailArchivesClusteringAnalyzerTest
Tests run: 1, Failures: 0, Errors: 0, Skipped: 0, Time elapsed: 0.071 sec - in org.apache.mahout.text.MailArchivesClusteringAnalyzerTest
Running org.apache.mahout.text.SequenceFilesFromMailArchivesTest
Tests run: 2, Failures: 1, Errors: 0, Skipped: 0, Time elapsed: 1.87 sec <<< FAILURE!
- in org.apache.mahout.text.SequenceFilesFromMailArchivesTest
testSequential(org.apache.mahout.text.SequenceFilesFromMailArchivesTest)  Time elapsed: 0.607
sec  <<< FAILURE!
org.junit.ComparisonFailure: expected:<TEST/subdir/[mail-messages].gz/user@example.com>
but was:<TEST/subdir/[subsubdir/mail-messages-2].gz/user@example.com>
	at org.junit.Assert.assertEquals(Assert.java:115)
	at org.junit.Assert.assertEquals(Assert.java:144)
	at org.apache.mahout.text.SequenceFilesFromMailArchivesTest.testSequential(SequenceFilesFromMailArchivesTest.java:106)

Running org.apache.mahout.text.LuceneSegmentInputSplitTest
Tests run: 2, Failures: 0, Errors: 0, Skipped: 0, Time elapsed: 0.986 sec - in org.apache.mahout.text.LuceneSegmentInputSplitTest
Running org.apache.mahout.text.LuceneStorageConfigurationTest
Tests run: 2, Failures: 0, Errors: 0, Skipped: 0, Time elapsed: 0.392 sec - in org.apache.mahout.text.LuceneStorageConfigurationTest
Running org.apache.mahout.text.LuceneSegmentRecordReaderTest
Tests run: 1, Failures: 0, Errors: 0, Skipped: 0, Time elapsed: 1.174 sec - in org.apache.mahout.text.LuceneSegmentRecordReaderTest
Running org.apache.mahout.text.SequenceFilesFromLuceneStorageDriverTest
Tests run: 5, Failures: 0, Errors: 0, Skipped: 0, Time elapsed: 3.561 sec - in org.apache.mahout.text.SequenceFilesFromLuceneStorageDriverTest
Running org.apache.mahout.text.TestSequenceFilesFromDirectory
Tests run: 2, Failures: 0, Errors: 0, Skipped: 0, Time elapsed: 2.983 sec - in org.apache.mahout.text.TestSequenceFilesFromDirectory

Results :

Failed tests: 
  SequenceFilesFromMailArchivesTest.testSequential:106->Assert.assertEquals:144->Assert.assertEquals:115
expected:<TEST/subdir/[mail-messages].gz/user@example.com> but was:<TEST/subdir/[subsubdir/mail-messages-2].gz/user@example.com>

Tests run: 95, Failures: 1, Errors: 0, Skipped: 0

[INFO] ------------------------------------------------------------------------
[INFO] Reactor Summary:
[INFO] 
[INFO] Mahout Build Tools ................................ SUCCESS [6.828s]
[INFO] Apache Mahout ..................................... SUCCESS [1.852s]
[INFO] Mahout Math ....................................... SUCCESS [2:37.829s]
[INFO] Mahout Core ....................................... SUCCESS [16:24.598s]
[INFO] Mahout Integration ................................ FAILURE [1:02.632s]
[INFO] Mahout Examples ................................... SKIPPED
[INFO] Mahout Release Package ............................ SKIPPED
[INFO] ------------------------------------------------------------------------
[INFO] BUILD FAILURE
[INFO] ------------------------------------------------------------------------
[INFO] Total time: 20:16.017s
[INFO] Finished at: Sun Aug 04 22:24:45 UTC 2013
[INFO] Final Memory: 57M/211M
[INFO] ------------------------------------------------------------------------
[ERROR] Failed to execute goal org.apache.maven.plugins:maven-surefire-plugin:2.15:test (default-test)
on project mahout-integration: There are test failures.
[ERROR] 
[ERROR] Please refer to /x1/jenkins/jenkins-slave/workspace/Mahout-Quality/trunk/integration/target/surefire-reports
for the individual test results.
[ERROR] -> [Help 1]
[ERROR] 
[ERROR] To see the full stack trace of the errors, re-run Maven with the -e switch.
[ERROR] Re-run Maven using the -X switch to enable full debug logging.
[ERROR] 
[ERROR] For more information about the errors and possible solutions, please read the following
articles:
[ERROR] [Help 1] http://cwiki.apache.org/confluence/display/MAVEN/MojoFailureException
[ERROR] 
[ERROR] After correcting the problems, you can resume the build with the command
[ERROR]   mvn <goals> -rf :mahout-integration
Build step 'Invoke top-level Maven targets' marked build as failure
[FINDBUGS] Skipping publisher since build result is FAILURE
[PMD] Skipping publisher since build result is FAILURE
[TASKS] Skipping publisher since build result is FAILURE
Archiving artifacts
Recording test results
Publishing Javadoc

Mime
View raw message