mahout-dev mailing list archives

Site index · List index
Message view « Date » · « Thread »
Top « Date » · « Thread »
From Apache Jenkins Server <jenk...@builds.apache.org>
Subject Build failed in Jenkins: mahout-nightly #1297
Date Sat, 20 Jul 2013 23:25:55 GMT
See <https://builds.apache.org/job/mahout-nightly/1297/>

------------------------------------------
[...truncated 3659 lines...]
[INFO] Building jar: <https://builds.apache.org/job/mahout-nightly/ws/trunk/core/target/mahout-core-0.9-SNAPSHOT.jar>
[INFO] 
[INFO] --- maven-jar-plugin:2.4:test-jar (default) @ mahout-core ---
[INFO] Building jar: <https://builds.apache.org/job/mahout-nightly/ws/trunk/core/target/mahout-core-0.9-SNAPSHOT-tests.jar>
[WARNING] Artifact org.apache.mahout:mahout-core:test-jar:tests:0.9-SNAPSHOT already attached
to project, ignoring duplicate
[INFO] [INFO] Reading assembly descriptor: src/main/assembly/job.xml

[INFO] --- maven-assembly-plugin:2.4:single (job) @ mahout-core ---
[INFO] Building jar: <https://builds.apache.org/job/mahout-nightly/ws/trunk/core/target/mahout-core-0.9-SNAPSHOT-job.jar>
[WARNING] Artifact org.apache.mahout:mahout-core:jar:job:0.9-SNAPSHOT already attached to
project, ignoring duplicate
[INFO] 
[INFO] --- maven-source-plugin:2.2.1:jar-no-fork (attach-sources) @ mahout-core ---
[WARNING] Artifact org.apache.mahout:mahout-core:java-source:sources:0.9-SNAPSHOT already
attached to project, ignoring duplicate
[INFO] [INFO] Installing <https://builds.apache.org/job/mahout-nightly/ws/trunk/core/target/mahout-core-0.9-SNAPSHOT.jar>
to /home/jenkins/jenkins-slave/maven-repositories/0/org/apache/mahout/mahout-core/0.9-SNAPSHOT/mahout-core-0.9-SNAPSHOT.jar

[INFO] --- maven-install-plugin:2.4:install (default-install) @ mahout-core ---
[INFO] Installing <https://builds.apache.org/job/mahout-nightly/ws/trunk/core/pom.xml>
to /home/jenkins/jenkins-slave/maven-repositories/0/org/apache/mahout/mahout-core/0.9-SNAPSHOT/mahout-core-0.9-SNAPSHOT.pom
[INFO] Installing <https://builds.apache.org/job/mahout-nightly/ws/trunk/core/target/mahout-core-0.9-SNAPSHOT-tests.jar>
to /home/jenkins/jenkins-slave/maven-repositories/0/org/apache/mahout/mahout-core/0.9-SNAPSHOT/mahout-core-0.9-SNAPSHOT-tests.jar
[INFO] Installing <https://builds.apache.org/job/mahout-nightly/ws/trunk/core/target/mahout-core-0.9-SNAPSHOT-job.jar>
to /home/jenkins/jenkins-slave/maven-repositories/0/org/apache/mahout/mahout-core/0.9-SNAPSHOT/mahout-core-0.9-SNAPSHOT-job.jar
[INFO] Installing <https://builds.apache.org/job/mahout-nightly/ws/trunk/core/target/mahout-core-0.9-SNAPSHOT-sources.jar>
to /home/jenkins/jenkins-slave/maven-repositories/0/org/apache/mahout/mahout-core/0.9-SNAPSHOT/mahout-core-0.9-SNAPSHOT-sources.jar
[INFO] 
[INFO] --- maven-deploy-plugin:2.5:deploy (default-deploy) @ mahout-core ---
Downloading: https://repository.apache.org/content/repositories/snapshots/org/apache/mahout/mahout-core/0.9-SNAPSHOT/maven-metadata.xml
Downloaded: https://repository.apache.org/content/repositories/snapshots/org/apache/mahout/mahout-core/0.9-SNAPSHOT/maven-metadata.xml
(2 KB at 5.3 KB/sec)
Uploading: https://repository.apache.org/content/repositories/snapshots/org/apache/mahout/mahout-core/0.9-SNAPSHOT/mahout-core-0.9-20130720.232414-9.jar
Uploaded: https://repository.apache.org/content/repositories/snapshots/org/apache/mahout/mahout-core/0.9-SNAPSHOT/mahout-core-0.9-20130720.232414-9.jar
(1605 KB at 8961.0 KB/sec)
Uploading: https://repository.apache.org/content/repositories/snapshots/org/apache/mahout/mahout-core/0.9-SNAPSHOT/mahout-core-0.9-20130720.232414-9.pom
Uploaded: https://repository.apache.org/content/repositories/snapshots/org/apache/mahout/mahout-core/0.9-SNAPSHOT/mahout-core-0.9-20130720.232414-9.pom
(7 KB at 127.0 KB/sec)
Downloading: https://repository.apache.org/content/repositories/snapshots/org/apache/mahout/mahout-core/maven-metadata.xml
Downloaded: https://repository.apache.org/content/repositories/snapshots/org/apache/mahout/mahout-core/maven-metadata.xml
(382 B at 1.4 KB/sec)
Uploading: https://repository.apache.org/content/repositories/snapshots/org/apache/mahout/mahout-core/0.9-SNAPSHOT/maven-metadata.xml
Uploaded: https://repository.apache.org/content/repositories/snapshots/org/apache/mahout/mahout-core/0.9-SNAPSHOT/maven-metadata.xml
(2 KB at 14.1 KB/sec)
Uploading: https://repository.apache.org/content/repositories/snapshots/org/apache/mahout/mahout-core/maven-metadata.xml
Uploaded: https://repository.apache.org/content/repositories/snapshots/org/apache/mahout/mahout-core/maven-metadata.xml
(382 B at 7.2 KB/sec)
Uploading: https://repository.apache.org/content/repositories/snapshots/org/apache/mahout/mahout-core/0.9-SNAPSHOT/mahout-core-0.9-20130720.232414-9-tests.jar
Uploaded: https://repository.apache.org/content/repositories/snapshots/org/apache/mahout/mahout-core/0.9-SNAPSHOT/mahout-core-0.9-20130720.232414-9-tests.jar
(2446 KB at 10774.2 KB/sec)
Uploading: https://repository.apache.org/content/repositories/snapshots/org/apache/mahout/mahout-core/0.9-SNAPSHOT/maven-metadata.xml
Uploaded: https://repository.apache.org/content/repositories/snapshots/org/apache/mahout/mahout-core/0.9-SNAPSHOT/maven-metadata.xml
(2 KB at 23.2 KB/sec)
Uploading: https://repository.apache.org/content/repositories/snapshots/org/apache/mahout/mahout-core/0.9-SNAPSHOT/mahout-core-0.9-20130720.232414-9-job.jar
Uploaded: https://repository.apache.org/content/repositories/snapshots/org/apache/mahout/mahout-core/0.9-SNAPSHOT/mahout-core-0.9-20130720.232414-9-job.jar
(19462 KB at 23168.4 KB/sec)
Uploading: https://repository.apache.org/content/repositories/snapshots/org/apache/mahout/mahout-core/0.9-SNAPSHOT/maven-metadata.xml
Uploaded: https://repository.apache.org/content/repositories/snapshots/org/apache/mahout/mahout-core/0.9-SNAPSHOT/maven-metadata.xml
(2 KB at 25.4 KB/sec)
Uploading: https://repository.apache.org/content/repositories/snapshots/org/apache/mahout/mahout-core/0.9-SNAPSHOT/mahout-core-0.9-20130720.232414-9-sources.jar
Uploaded: https://repository.apache.org/content/repositories/snapshots/org/apache/mahout/mahout-core/0.9-SNAPSHOT/mahout-core-0.9-20130720.232414-9-sources.jar
(1155 KB at 9788.1 KB/sec)
Uploading: https://repository.apache.org/content/repositories/snapshots/org/apache/mahout/mahout-core/0.9-SNAPSHOT/maven-metadata.xml
Uploaded: https://repository.apache.org/content/repositories/snapshots/org/apache/mahout/mahout-core/0.9-SNAPSHOT/maven-metadata.xml
(2 KB at 27.9 KB/sec)
[INFO]                                                                         
[INFO] ------------------------------------------------------------------------
[INFO] Building Mahout Integration 0.9-SNAPSHOT
[INFO] ------------------------------------------------------------------------
[INFO] 
[INFO] --- maven-clean-plugin:2.4.1:clean (default-clean) @ mahout-integration ---
[INFO] [INFO] Using 'UTF-8' encoding to copy filtered resources.

[INFO] --- maven-resources-plugin:2.6:resources (default-resources) @ mahout-integration ---
[INFO] Copying 0 resource
[INFO] 
[INFO] --- maven-compiler-plugin:3.1:compile (default-compile) @ mahout-integration ---
[INFO] Changes detected - recompiling the module!
[INFO] Compiling 131 source files to <https://builds.apache.org/job/mahout-nightly/ws/trunk/integration/target/classes>
[WARNING] Note: Some input files use or override a deprecated API.
[WARNING] Note: Recompile with -Xlint:deprecation for details.
[WARNING] Note: <https://builds.apache.org/job/mahout-nightly/ws/trunk/integration/src/main/java/org/apache/mahout/cf/taste/impl/model/mongodb/MongoDBDataModel.java>
uses unchecked or unsafe operations.
[WARNING] Note: Recompile with -Xlint:unchecked for details.
[INFO] [INFO] Using 'UTF-8' encoding to copy filtered resources.

[INFO] Copying 10 resources
[INFO] --- maven-resources-plugin:2.6:testResources (default-testResources) @ mahout-integration
---
[INFO] 
[INFO] --- maven-compiler-plugin:3.1:testCompile (default-testCompile) @ mahout-integration
---
[INFO] Changes detected - recompiling the module!
[INFO] Compiling 39 source files to <https://builds.apache.org/job/mahout-nightly/ws/trunk/integration/target/test-classes>
[WARNING] Note: Some input files use or override a deprecated API.
[WARNING] Note: Recompile with -Xlint:deprecation for details.
[INFO] [INFO] Surefire report directory: <https://builds.apache.org/job/mahout-nightly/ws/trunk/integration/target/surefire-reports>

[INFO] parallel='classes', perCoreThreadCount=false, threadCount=1, useUnlimitedThreads=false
[INFO] --- maven-surefire-plugin:2.15:test (default-test) @ mahout-integration ---

-------------------------------------------------------
 T E S T S
-------------------------------------------------------

-------------------------------------------------------
 T E S T S
-------------------------------------------------------
Running org.apache.mahout.cf.taste.impl.similarity.jdbc.MySQLJDBCInMemoryItemSimilarityTest
Tests run: 1, Failures: 0, Errors: 0, Skipped: 0, Time elapsed: 0.196 sec - in org.apache.mahout.cf.taste.impl.similarity.jdbc.MySQLJDBCInMemoryItemSimilarityTest
Running org.apache.mahout.clustering.TestClusterEvaluator
Tests run: 12, Failures: 0, Errors: 0, Skipped: 0, Time elapsed: 13.768 sec - in org.apache.mahout.clustering.TestClusterEvaluator
Running org.apache.mahout.clustering.TestClusterDumper
Tests run: 6, Failures: 0, Errors: 0, Skipped: 0, Time elapsed: 6.003 sec - in org.apache.mahout.clustering.TestClusterDumper
Running org.apache.mahout.clustering.dirichlet.TestL1ModelClustering
Tests run: 4, Failures: 0, Errors: 0, Skipped: 0, Time elapsed: 0.966 sec - in org.apache.mahout.clustering.dirichlet.TestL1ModelClustering
Running org.apache.mahout.clustering.cdbw.TestCDbwEvaluator
Tests run: 12, Failures: 0, Errors: 0, Skipped: 0, Time elapsed: 6.001 sec - in org.apache.mahout.clustering.cdbw.TestCDbwEvaluator
Running org.apache.mahout.utils.TestConcatenateVectorsJob
Tests run: 1, Failures: 0, Errors: 0, Skipped: 0, Time elapsed: 0.487 sec - in org.apache.mahout.utils.TestConcatenateVectorsJob
Running org.apache.mahout.utils.vectors.lucene.LuceneIterableTest
Tests run: 3, Failures: 0, Errors: 0, Skipped: 0, Time elapsed: 0.617 sec - in org.apache.mahout.utils.vectors.lucene.LuceneIterableTest
Running org.apache.mahout.utils.vectors.lucene.DriverTest
Tests run: 1, Failures: 0, Errors: 0, Skipped: 0, Time elapsed: 0.995 sec - in org.apache.mahout.utils.vectors.lucene.DriverTest
Running org.apache.mahout.utils.vectors.lucene.CachedTermInfoTest
Tests run: 1, Failures: 0, Errors: 0, Skipped: 0, Time elapsed: 0.395 sec - in org.apache.mahout.utils.vectors.lucene.CachedTermInfoTest
Running org.apache.mahout.utils.vectors.csv.CSVVectorIteratorTest
Tests run: 1, Failures: 0, Errors: 0, Skipped: 0, Time elapsed: 0.223 sec - in org.apache.mahout.utils.vectors.csv.CSVVectorIteratorTest
Running org.apache.mahout.utils.vectors.VectorHelperTest
Tests run: 3, Failures: 0, Errors: 0, Skipped: 0, Time elapsed: 0.051 sec - in org.apache.mahout.utils.vectors.VectorHelperTest
Running org.apache.mahout.utils.vectors.io.VectorWriterTest
Tests run: 2, Failures: 0, Errors: 0, Skipped: 0, Time elapsed: 0.58 sec - in org.apache.mahout.utils.vectors.io.VectorWriterTest
Running org.apache.mahout.utils.vectors.arff.MapBackedARFFModelTest
Tests run: 1, Failures: 0, Errors: 0, Skipped: 0, Time elapsed: 0.025 sec - in org.apache.mahout.utils.vectors.arff.MapBackedARFFModelTest
Running org.apache.mahout.utils.vectors.arff.ARFFVectorIterableTest
Tests run: 8, Failures: 0, Errors: 0, Skipped: 0, Time elapsed: 0.141 sec - in org.apache.mahout.utils.vectors.arff.ARFFVectorIterableTest
Running org.apache.mahout.utils.vectors.arff.DriverTest
Tests run: 2, Failures: 0, Errors: 0, Skipped: 0, Time elapsed: 0.354 sec - in org.apache.mahout.utils.vectors.arff.DriverTest
Running org.apache.mahout.utils.vectors.arff.ARFFTypeTest
Tests run: 1, Failures: 0, Errors: 0, Skipped: 0, Time elapsed: 0.005 sec - in org.apache.mahout.utils.vectors.arff.ARFFTypeTest
Running org.apache.mahout.utils.nlp.collocations.llr.BloomTokenFilterTest
Tests run: 5, Failures: 0, Errors: 0, Skipped: 0, Time elapsed: 0.063 sec - in org.apache.mahout.utils.nlp.collocations.llr.BloomTokenFilterTest
Running org.apache.mahout.utils.SplitInputTest
Tests run: 12, Failures: 0, Errors: 0, Skipped: 0, Time elapsed: 5.814 sec - in org.apache.mahout.utils.SplitInputTest
Running org.apache.mahout.utils.Bump125Test
Tests run: 1, Failures: 0, Errors: 0, Skipped: 0, Time elapsed: 0.015 sec - in org.apache.mahout.utils.Bump125Test
Running org.apache.mahout.utils.email.MailProcessorTest
Tests run: 2, Failures: 0, Errors: 0, Skipped: 0, Time elapsed: 0.122 sec - in org.apache.mahout.utils.email.MailProcessorTest
Running org.apache.mahout.utils.regex.RegexMapperTest
Tests run: 3, Failures: 0, Errors: 0, Skipped: 0, Time elapsed: 0.477 sec - in org.apache.mahout.utils.regex.RegexMapperTest
Running org.apache.mahout.utils.regex.RegexUtilsTest
Tests run: 1, Failures: 0, Errors: 0, Skipped: 0, Time elapsed: 0.019 sec - in org.apache.mahout.utils.regex.RegexUtilsTest
Running org.apache.mahout.text.SequenceFilesFromLuceneStorageTest
Tests run: 6, Failures: 0, Errors: 0, Skipped: 0, Time elapsed: 2.194 sec - in org.apache.mahout.text.SequenceFilesFromLuceneStorageTest
Running org.apache.mahout.text.SequenceFilesFromLuceneStorageMRJobTest
Tests run: 1, Failures: 0, Errors: 0, Skipped: 0, Time elapsed: 2.728 sec - in org.apache.mahout.text.SequenceFilesFromLuceneStorageMRJobTest
Running org.apache.mahout.text.LuceneSegmentInputFormatTest
Tests run: 1, Failures: 0, Errors: 0, Skipped: 0, Time elapsed: 0.919 sec - in org.apache.mahout.text.LuceneSegmentInputFormatTest
Running org.apache.mahout.text.MailArchivesClusteringAnalyzerTest
Tests run: 1, Failures: 0, Errors: 0, Skipped: 0, Time elapsed: 0.07 sec - in org.apache.mahout.text.MailArchivesClusteringAnalyzerTest
Running org.apache.mahout.text.SequenceFilesFromMailArchivesTest
Tests run: 2, Failures: 1, Errors: 0, Skipped: 0, Time elapsed: 1.872 sec <<< FAILURE!
- in org.apache.mahout.text.SequenceFilesFromMailArchivesTest
testSequential(org.apache.mahout.text.SequenceFilesFromMailArchivesTest)  Time elapsed: 0.595
sec  <<< FAILURE!
org.junit.ComparisonFailure: expected:<TEST/subdir/[mail-messages].gz/user@example.com>
but was:<TEST/subdir/[subsubdir/mail-messages-2].gz/user@example.com>
	at org.junit.Assert.assertEquals(Assert.java:115)
	at org.junit.Assert.assertEquals(Assert.java:144)
	at org.apache.mahout.text.SequenceFilesFromMailArchivesTest.testSequential(SequenceFilesFromMailArchivesTest.java:106)

Running org.apache.mahout.text.LuceneSegmentInputSplitTest
Tests run: 2, Failures: 0, Errors: 0, Skipped: 0, Time elapsed: 0.977 sec - in org.apache.mahout.text.LuceneSegmentInputSplitTest
Running org.apache.mahout.text.LuceneStorageConfigurationTest
Tests run: 2, Failures: 0, Errors: 0, Skipped: 0, Time elapsed: 0.382 sec - in org.apache.mahout.text.LuceneStorageConfigurationTest
Running org.apache.mahout.text.LuceneSegmentRecordReaderTest
Tests run: 1, Failures: 0, Errors: 0, Skipped: 0, Time elapsed: 1.166 sec - in org.apache.mahout.text.LuceneSegmentRecordReaderTest
Running org.apache.mahout.text.SequenceFilesFromLuceneStorageDriverTest
Tests run: 5, Failures: 0, Errors: 0, Skipped: 0, Time elapsed: 3.563 sec - in org.apache.mahout.text.SequenceFilesFromLuceneStorageDriverTest
Running org.apache.mahout.text.TestSequenceFilesFromDirectory
Tests run: 2, Failures: 0, Errors: 0, Skipped: 0, Time elapsed: 3.034 sec - in org.apache.mahout.text.TestSequenceFilesFromDirectory

Results :

Failed tests: 
  SequenceFilesFromMailArchivesTest.testSequential:106->Assert.assertEquals:144->Assert.assertEquals:115
expected:<TEST/subdir/[mail-messages].gz/user@example.com> but was:<TEST/subdir/[subsubdir/mail-messages-2].gz/user@example.com>

Tests run: 106, Failures: 1, Errors: 0, Skipped: 0

[JENKINS] Recording test results
[INFO] ------------------------------------------------------------------------
[INFO] Reactor Summary:
[INFO] 
[INFO] Mahout Build Tools ................................ SUCCESS [9.330s]
[INFO] Apache Mahout ..................................... SUCCESS [1.654s]
[INFO] Mahout Math ....................................... SUCCESS [1:38.675s]
[INFO] Mahout Core ....................................... SUCCESS [19:48.556s]
[INFO] Mahout Integration ................................ FAILURE [1:10.498s]
[INFO] Mahout Examples ................................... SKIPPED
[INFO] Mahout Release Package ............................ SKIPPED
[INFO] ------------------------------------------------------------------------
[INFO] BUILD FAILURE
[INFO] ------------------------------------------------------------------------
[INFO] Total time: 22:49.495s
[INFO] Finished at: Sat Jul 20 23:25:27 UTC 2013
[INFO] Final Memory: 35M/405M
[INFO] ------------------------------------------------------------------------
[JENKINS] Archiving <https://builds.apache.org/job/mahout-nightly/ws/trunk/buildtools/pom.xml>
to /home/hudson/hudson/jobs/mahout-nightly/modules/org.apache.mahout$mahout-buildtools/builds/2013-07-20_23-02-33/archive/org.apache.mahout/mahout-buildtools/0.9-SNAPSHOT/mahout-buildtools-0.9-SNAPSHOT.pom
[JENKINS] Archiving <https://builds.apache.org/job/mahout-nightly/ws/trunk/buildtools/target/mahout-buildtools-0.9-SNAPSHOT.jar>
to /home/hudson/hudson/jobs/mahout-nightly/modules/org.apache.mahout$mahout-buildtools/builds/2013-07-20_23-02-33/archive/org.apache.mahout/mahout-buildtools/0.9-20130720.230247-11/mahout-buildtools-0.9-20130720.230247-11.jar
[JENKINS] Archiving <https://builds.apache.org/job/mahout-nightly/ws/trunk/examples/pom.xml>
to /home/hudson/hudson/jobs/mahout-nightly/modules/org.apache.mahout$mahout-examples/builds/2013-07-20_23-02-33/archive/org.apache.mahout/mahout-examples/0.9-SNAPSHOT/mahout-examples-0.9-SNAPSHOT.pom
[JENKINS] Archiving <https://builds.apache.org/job/mahout-nightly/ws/trunk/distribution/pom.xml>
to /home/hudson/hudson/jobs/mahout-nightly/modules/org.apache.mahout$mahout-distribution/builds/2013-07-20_23-02-33/archive/org.apache.mahout/mahout-distribution/0.9-SNAPSHOT/mahout-distribution-0.9-SNAPSHOT.pom
[JENKINS] Archiving <https://builds.apache.org/job/mahout-nightly/ws/trunk/pom.xml>
to /home/hudson/hudson/jobs/mahout-nightly/modules/org.apache.mahout$mahout/builds/2013-07-20_23-02-33/archive/org.apache.mahout/mahout/0.9-SNAPSHOT/mahout-0.9-SNAPSHOT.pom
[JENKINS] Archiving <https://builds.apache.org/job/mahout-nightly/ws/trunk/integration/pom.xml>
to /home/hudson/hudson/jobs/mahout-nightly/modules/org.apache.mahout$mahout-integration/builds/2013-07-20_23-02-33/archive/org.apache.mahout/mahout-integration/0.9-SNAPSHOT/mahout-integration-0.9-SNAPSHOT.pom
[JENKINS] Archiving <https://builds.apache.org/job/mahout-nightly/ws/trunk/core/pom.xml>
to /home/hudson/hudson/jobs/mahout-nightly/modules/org.apache.mahout$mahout-core/builds/2013-07-20_23-02-33/archive/org.apache.mahout/mahout-core/0.9-SNAPSHOT/mahout-core-0.9-SNAPSHOT.pom
[JENKINS] Archiving <https://builds.apache.org/job/mahout-nightly/ws/trunk/core/target/mahout-core-0.9-SNAPSHOT.jar>
to /home/hudson/hudson/jobs/mahout-nightly/modules/org.apache.mahout$mahout-core/builds/2013-07-20_23-02-33/archive/org.apache.mahout/mahout-core/0.9-20130720.232414-9/mahout-core-0.9-20130720.232414-9.jar
[JENKINS] Archiving <https://builds.apache.org/job/mahout-nightly/ws/trunk/core/target/mahout-core-0.9-SNAPSHOT-tests.jar>
to /home/hudson/hudson/jobs/mahout-nightly/modules/org.apache.mahout$mahout-core/builds/2013-07-20_23-02-33/archive/org.apache.mahout/mahout-core/0.9-20130720.232414-9/mahout-core-0.9-20130720.232414-9-tests.jar
[JENKINS] Archiving <https://builds.apache.org/job/mahout-nightly/ws/trunk/core/target/mahout-core-0.9-SNAPSHOT-job.jar>
to /home/hudson/hudson/jobs/mahout-nightly/modules/org.apache.mahout$mahout-core/builds/2013-07-20_23-02-33/archive/org.apache.mahout/mahout-core/0.9-20130720.232414-9/mahout-core-0.9-20130720.232414-9-job.jar
[JENKINS] Archiving <https://builds.apache.org/job/mahout-nightly/ws/trunk/core/target/mahout-core-0.9-SNAPSHOT-sources.jar>
to /home/hudson/hudson/jobs/mahout-nightly/modules/org.apache.mahout$mahout-core/builds/2013-07-20_23-02-33/archive/org.apache.mahout/mahout-core/0.9-20130720.232414-9/mahout-core-0.9-20130720.232414-9-sources.jar
[JENKINS] Archiving <https://builds.apache.org/job/mahout-nightly/ws/trunk/math/pom.xml>
to /home/hudson/hudson/jobs/mahout-nightly/modules/org.apache.mahout$mahout-math/builds/2013-07-20_23-02-33/archive/org.apache.mahout/mahout-math/0.9-SNAPSHOT/mahout-math-0.9-SNAPSHOT.pom
[JENKINS] Archiving <https://builds.apache.org/job/mahout-nightly/ws/trunk/math/target/mahout-math-0.9-SNAPSHOT.jar>
to /home/hudson/hudson/jobs/mahout-nightly/modules/org.apache.mahout$mahout-math/builds/2013-07-20_23-02-33/archive/org.apache.mahout/mahout-math/0.9-20130720.230427-10/mahout-math-0.9-20130720.230427-10.jar
[JENKINS] Archiving <https://builds.apache.org/job/mahout-nightly/ws/trunk/math/target/mahout-math-0.9-SNAPSHOT-tests.jar>
to /home/hudson/hudson/jobs/mahout-nightly/modules/org.apache.mahout$mahout-math/builds/2013-07-20_23-02-33/archive/org.apache.mahout/mahout-math/0.9-20130720.230427-10/mahout-math-0.9-20130720.230427-10-tests.jar
[JENKINS] Archiving <https://builds.apache.org/job/mahout-nightly/ws/trunk/math/target/mahout-math-0.9-SNAPSHOT-sources.jar>
to /home/hudson/hudson/jobs/mahout-nightly/modules/org.apache.mahout$mahout-math/builds/2013-07-20_23-02-33/archive/org.apache.mahout/mahout-math/0.9-20130720.230427-10/mahout-math-0.9-20130720.230427-10-sources.jar
Waiting for Jenkins to finish collecting data
mavenExecutionResult exceptions not empty
message : Failed to execute goal org.apache.maven.plugins:maven-surefire-plugin:2.15:test
(default-test) on project mahout-integration: There are test failures.

Please refer to <https://builds.apache.org/job/mahout-nightly/ws/trunk/integration/target/surefire-reports>
for the individual test results.
cause : There are test failures.

Please refer to <https://builds.apache.org/job/mahout-nightly/ws/trunk/integration/target/surefire-reports>
for the individual test results.
Stack trace : 
org.apache.maven.lifecycle.LifecycleExecutionException: Failed to execute goal org.apache.maven.plugins:maven-surefire-plugin:2.15:test
(default-test) on project mahout-integration: There are test failures.

Please refer to <https://builds.apache.org/job/mahout-nightly/ws/trunk/integration/target/surefire-reports>
for the individual test results.
	at org.apache.maven.lifecycle.internal.MojoExecutor.execute(MojoExecutor.java:213)
	at org.apache.maven.lifecycle.internal.MojoExecutor.execute(MojoExecutor.java:153)
	at org.apache.maven.lifecycle.internal.MojoExecutor.execute(MojoExecutor.java:145)
	at org.apache.maven.lifecycle.internal.LifecycleModuleBuilder.buildProject(LifecycleModuleBuilder.java:84)
	at org.apache.maven.lifecycle.internal.LifecycleModuleBuilder.buildProject(LifecycleModuleBuilder.java:59)
	at org.apache.maven.lifecycle.internal.LifecycleStarter.singleThreadedBuild(LifecycleStarter.java:183)
	at org.apache.maven.lifecycle.internal.LifecycleStarter.execute(LifecycleStarter.java:161)
	at org.apache.maven.DefaultMaven.doExecute(DefaultMaven.java:320)
	at org.apache.maven.DefaultMaven.execute(DefaultMaven.java:156)
	at org.jvnet.hudson.maven3.launcher.Maven3Launcher.main(Maven3Launcher.java:79)
	at sun.reflect.NativeMethodAccessorImpl.invoke0(Native Method)
	at sun.reflect.NativeMethodAccessorImpl.invoke(NativeMethodAccessorImpl.java:39)
	at sun.reflect.DelegatingMethodAccessorImpl.invoke(DelegatingMethodAccessorImpl.java:25)
	at java.lang.reflect.Method.invoke(Method.java:597)
	at org.codehaus.plexus.classworlds.launcher.Launcher.launchStandard(Launcher.java:329)
	at org.codehaus.plexus.classworlds.launcher.Launcher.launch(Launcher.java:239)
	at org.jvnet.hudson.maven3.agent.Maven3Main.launch(Maven3Main.java:158)
	at hudson.maven.Maven3Builder.call(Maven3Builder.java:100)
	at hudson.maven.Maven3Builder.call(Maven3Builder.java:66)
	at hudson.remoting.UserRequest.perform(UserRequest.java:118)
	at hudson.remoting.UserRequest.perform(UserRequest.java:48)
	at hudson.remoting.Request$2.run(Request.java:326)
	at hudson.remoting.InterceptingExecutorService$1.call(InterceptingExecutorService.java:72)
	at java.util.concurrent.FutureTask$Sync.innerRun(FutureTask.java:303)
	at java.util.concurrent.FutureTask.run(FutureTask.java:138)
	at java.util.concurrent.ThreadPoolExecutor$Worker.runTask(ThreadPoolExecutor.java:895)
	at java.util.concurrent.ThreadPoolExecutor$Worker.run(ThreadPoolExecutor.java:918)
	at java.lang.Thread.run(Thread.java:662)
Caused by: org.apache.maven.plugin.MojoFailureException: There are test failures.

Please refer to <https://builds.apache.org/job/mahout-nightly/ws/trunk/integration/target/surefire-reports>
for the individual test results.
	at org.apache.maven.plugin.surefire.SurefireHelper.reportExecution(SurefireHelper.java:82)
	at org.apache.maven.plugin.surefire.SurefirePlugin.handleSummary(SurefirePlugin.java:169)
	at org.apache.maven.plugin.surefire.AbstractSurefireMojo.executeAfterPreconditionsChecked(AbstractSurefireMojo.java:777)
	at org.apache.maven.plugin.surefire.AbstractSurefireMojo.execute(AbstractSurefireMojo.java:645)
	at org.apache.maven.plugin.DefaultBuildPluginManager.executeMojo(DefaultBuildPluginManager.java:101)
	at org.apache.maven.lifecycle.internal.MojoExecutor.execute(MojoExecutor.java:209)
	... 27 more
Sending e-mails to: dev@mahout.apache.org
channel stopped

Mime
View raw message