mahout-dev mailing list archives

Site index · List index
Message view « Date » · « Thread »
Top « Date » · « Thread »
From Apache Jenkins Server <jenk...@builds.apache.org>
Subject Build failed in Jenkins: mahout-nightly #1300
Date Tue, 23 Jul 2013 23:59:41 GMT
See <https://builds.apache.org/job/mahout-nightly/1300/>

------------------------------------------
[...truncated 1925 lines...]
Uploading: https://repository.apache.org/content/repositories/snapshots/org/apache/mahout/mahout-core/0.9-SNAPSHOT/mahout-core-0.9-20130723.235741-12-job.jar
Uploaded: https://repository.apache.org/content/repositories/snapshots/org/apache/mahout/mahout-core/0.9-SNAPSHOT/mahout-core-0.9-20130723.235741-12-job.jar
(19462 KB at 24086.0 KB/sec)
Uploading: https://repository.apache.org/content/repositories/snapshots/org/apache/mahout/mahout-core/0.9-SNAPSHOT/maven-metadata.xml
Uploaded: https://repository.apache.org/content/repositories/snapshots/org/apache/mahout/mahout-core/0.9-SNAPSHOT/maven-metadata.xml
(2 KB at 23.3 KB/sec)
Uploading: https://repository.apache.org/content/repositories/snapshots/org/apache/mahout/mahout-core/0.9-SNAPSHOT/mahout-core-0.9-20130723.235741-12-sources.jar
Uploaded: https://repository.apache.org/content/repositories/snapshots/org/apache/mahout/mahout-core/0.9-SNAPSHOT/mahout-core-0.9-20130723.235741-12-sources.jar
(1155 KB at 9094.4 KB/sec)
Uploading: https://repository.apache.org/content/repositories/snapshots/org/apache/mahout/mahout-core/0.9-SNAPSHOT/maven-metadata.xml
Uploaded: https://repository.apache.org/content/repositories/snapshots/org/apache/mahout/mahout-core/0.9-SNAPSHOT/maven-metadata.xml
(2 KB at 22.2 KB/sec)
Jul 23, 2013 11:57:43 PM org.apache.maven.cli.event.ExecutionEventLogger projectStarted
INFO:                                                                         
Jul 23, 2013 11:57:43 PM org.apache.maven.cli.event.ExecutionEventLogger projectStarted
INFO: ------------------------------------------------------------------------
Jul 23, 2013 11:57:43 PM org.apache.maven.cli.event.ExecutionEventLogger projectStarted
INFO: Building Mahout Integration 0.9-SNAPSHOT
Jul 23, 2013 11:57:43 PM org.apache.maven.cli.event.ExecutionEventLogger projectStarted
INFO: ------------------------------------------------------------------------
Jul 23, 2013 11:57:45 PM org.apache.maven.cli.event.ExecutionEventLogger mojoStarted
INFO: 
Jul 23, 2013 11:57:45 PM org.apache.maven.cli.event.ExecutionEventLogger mojoStarted
INFO: --- maven-clean-plugin:2.4.1:clean (default-clean) @ mahout-integration ---
[INFO] Deleting <https://builds.apache.org/job/mahout-nightly/ws/trunk/integration/target>
Jul 23, 2013 11:57:45 PM org.apache.maven.cli.event.ExecutionEventLogger mojoStarted
INFO: 
Jul 23, 2013 11:57:45 PM org.apache.maven.cli.event.ExecutionEventLogger mojoStarted
INFO: --- maven-resources-plugin:2.6:resources (default-resources) @ mahout-integration ---
[INFO] Using 'UTF-8' encoding to copy filtered resources.
[INFO] Copying 0 resource
Jul 23, 2013 11:57:45 PM org.apache.maven.cli.event.ExecutionEventLogger mojoStarted
INFO: 
Jul 23, 2013 11:57:45 PM org.apache.maven.cli.event.ExecutionEventLogger mojoStarted
INFO: --- maven-compiler-plugin:3.1:compile (default-compile) @ mahout-integration ---
[INFO] Changes detected - recompiling the module!
[INFO] Compiling 131 source files to <https://builds.apache.org/job/mahout-nightly/ws/trunk/integration/target/classes>
[WARNING] Note: Some input files use or override a deprecated API.
[WARNING] Note: Recompile with -Xlint:deprecation for details.
[WARNING] Note: <https://builds.apache.org/job/mahout-nightly/ws/trunk/integration/src/main/java/org/apache/mahout/cf/taste/impl/model/mongodb/MongoDBDataModel.java>
uses unchecked or unsafe operations.
[WARNING] Note: Recompile with -Xlint:unchecked for details.
Jul 23, 2013 11:57:48 PM org.apache.maven.cli.event.ExecutionEventLogger mojoStarted
INFO: 
Jul 23, 2013 11:57:48 PM org.apache.maven.cli.event.ExecutionEventLogger mojoStarted
INFO: --- maven-resources-plugin:2.6:testResources (default-testResources) @ mahout-integration
---
[INFO] Using 'UTF-8' encoding to copy filtered resources.
[INFO] Copying 10 resources
Jul 23, 2013 11:57:48 PM org.apache.maven.cli.event.ExecutionEventLogger mojoStarted
INFO: 
Jul 23, 2013 11:57:48 PM org.apache.maven.cli.event.ExecutionEventLogger mojoStarted
INFO: --- maven-compiler-plugin:3.1:testCompile (default-testCompile) @ mahout-integration
---
[INFO] Changes detected - recompiling the module!
[INFO] Compiling 39 source files to <https://builds.apache.org/job/mahout-nightly/ws/trunk/integration/target/test-classes>
[WARNING] Note: Some input files use or override a deprecated API.
[WARNING] Note: Recompile with -Xlint:deprecation for details.
Jul 23, 2013 11:57:49 PM org.apache.maven.cli.event.ExecutionEventLogger mojoStarted
INFO: 
Jul 23, 2013 11:57:49 PM org.apache.maven.cli.event.ExecutionEventLogger mojoStarted
INFO: --- maven-surefire-plugin:2.15:test (default-test) @ mahout-integration ---
[INFO] Surefire report directory: <https://builds.apache.org/job/mahout-nightly/ws/trunk/integration/target/surefire-reports>
[INFO] parallel='classes', perCoreThreadCount=false, threadCount=1, useUnlimitedThreads=false

-------------------------------------------------------
 T E S T S
-------------------------------------------------------

-------------------------------------------------------
 T E S T S
-------------------------------------------------------
Running org.apache.mahout.cf.taste.impl.similarity.jdbc.MySQLJDBCInMemoryItemSimilarityTest
Tests run: 1, Failures: 0, Errors: 0, Skipped: 0, Time elapsed: 0.138 sec - in org.apache.mahout.cf.taste.impl.similarity.jdbc.MySQLJDBCInMemoryItemSimilarityTest
Running org.apache.mahout.clustering.TestClusterEvaluator
Tests run: 12, Failures: 0, Errors: 0, Skipped: 0, Time elapsed: 15.031 sec - in org.apache.mahout.clustering.TestClusterEvaluator
Running org.apache.mahout.clustering.TestClusterDumper
Tests run: 6, Failures: 0, Errors: 0, Skipped: 0, Time elapsed: 6.01 sec - in org.apache.mahout.clustering.TestClusterDumper
Running org.apache.mahout.clustering.dirichlet.TestL1ModelClustering
Tests run: 4, Failures: 0, Errors: 0, Skipped: 0, Time elapsed: 0.795 sec - in org.apache.mahout.clustering.dirichlet.TestL1ModelClustering
Running org.apache.mahout.clustering.cdbw.TestCDbwEvaluator
Tests run: 12, Failures: 0, Errors: 0, Skipped: 0, Time elapsed: 5.929 sec - in org.apache.mahout.clustering.cdbw.TestCDbwEvaluator
Running org.apache.mahout.utils.TestConcatenateVectorsJob
Tests run: 1, Failures: 0, Errors: 0, Skipped: 0, Time elapsed: 0.398 sec - in org.apache.mahout.utils.TestConcatenateVectorsJob
Running org.apache.mahout.utils.vectors.lucene.LuceneIterableTest
Tests run: 3, Failures: 0, Errors: 0, Skipped: 0, Time elapsed: 0.616 sec - in org.apache.mahout.utils.vectors.lucene.LuceneIterableTest
Running org.apache.mahout.utils.vectors.lucene.DriverTest
Tests run: 1, Failures: 0, Errors: 0, Skipped: 0, Time elapsed: 0.979 sec - in org.apache.mahout.utils.vectors.lucene.DriverTest
Running org.apache.mahout.utils.vectors.lucene.CachedTermInfoTest
Tests run: 1, Failures: 0, Errors: 0, Skipped: 0, Time elapsed: 0.43 sec - in org.apache.mahout.utils.vectors.lucene.CachedTermInfoTest
Running org.apache.mahout.utils.vectors.csv.CSVVectorIteratorTest
Tests run: 1, Failures: 0, Errors: 0, Skipped: 0, Time elapsed: 0.155 sec - in org.apache.mahout.utils.vectors.csv.CSVVectorIteratorTest
Running org.apache.mahout.utils.vectors.VectorHelperTest
Tests run: 3, Failures: 0, Errors: 0, Skipped: 0, Time elapsed: 0.043 sec - in org.apache.mahout.utils.vectors.VectorHelperTest
Running org.apache.mahout.utils.vectors.io.VectorWriterTest
Tests run: 2, Failures: 0, Errors: 0, Skipped: 0, Time elapsed: 0.544 sec - in org.apache.mahout.utils.vectors.io.VectorWriterTest
Running org.apache.mahout.utils.vectors.arff.MapBackedARFFModelTest
Tests run: 1, Failures: 0, Errors: 0, Skipped: 0, Time elapsed: 0.025 sec - in org.apache.mahout.utils.vectors.arff.MapBackedARFFModelTest
Running org.apache.mahout.utils.vectors.arff.ARFFVectorIterableTest
Tests run: 8, Failures: 0, Errors: 0, Skipped: 0, Time elapsed: 0.087 sec - in org.apache.mahout.utils.vectors.arff.ARFFVectorIterableTest
Running org.apache.mahout.utils.vectors.arff.DriverTest
Tests run: 2, Failures: 0, Errors: 0, Skipped: 0, Time elapsed: 0.317 sec - in org.apache.mahout.utils.vectors.arff.DriverTest
Running org.apache.mahout.utils.vectors.arff.ARFFTypeTest
Tests run: 1, Failures: 0, Errors: 0, Skipped: 0, Time elapsed: 0.005 sec - in org.apache.mahout.utils.vectors.arff.ARFFTypeTest
Running org.apache.mahout.utils.nlp.collocations.llr.BloomTokenFilterTest
Tests run: 5, Failures: 0, Errors: 0, Skipped: 0, Time elapsed: 0.049 sec - in org.apache.mahout.utils.nlp.collocations.llr.BloomTokenFilterTest
Running org.apache.mahout.utils.SplitInputTest
Tests run: 12, Failures: 0, Errors: 0, Skipped: 0, Time elapsed: 5.671 sec - in org.apache.mahout.utils.SplitInputTest
Running org.apache.mahout.utils.Bump125Test
Tests run: 1, Failures: 0, Errors: 0, Skipped: 0, Time elapsed: 0.012 sec - in org.apache.mahout.utils.Bump125Test
Running org.apache.mahout.utils.email.MailProcessorTest
Tests run: 2, Failures: 0, Errors: 0, Skipped: 0, Time elapsed: 0.076 sec - in org.apache.mahout.utils.email.MailProcessorTest
Running org.apache.mahout.utils.regex.RegexMapperTest
Tests run: 3, Failures: 0, Errors: 0, Skipped: 0, Time elapsed: 0.493 sec - in org.apache.mahout.utils.regex.RegexMapperTest
Running org.apache.mahout.utils.regex.RegexUtilsTest
Tests run: 1, Failures: 0, Errors: 0, Skipped: 0, Time elapsed: 0.012 sec - in org.apache.mahout.utils.regex.RegexUtilsTest
Running org.apache.mahout.text.SequenceFilesFromLuceneStorageTest
Tests run: 6, Failures: 0, Errors: 0, Skipped: 0, Time elapsed: 2.386 sec - in org.apache.mahout.text.SequenceFilesFromLuceneStorageTest
Running org.apache.mahout.text.SequenceFilesFromLuceneStorageMRJobTest
Tests run: 1, Failures: 0, Errors: 0, Skipped: 0, Time elapsed: 2.77 sec - in org.apache.mahout.text.SequenceFilesFromLuceneStorageMRJobTest
Running org.apache.mahout.text.LuceneSegmentInputFormatTest
Tests run: 1, Failures: 0, Errors: 0, Skipped: 0, Time elapsed: 0.907 sec - in org.apache.mahout.text.LuceneSegmentInputFormatTest
Running org.apache.mahout.text.MailArchivesClusteringAnalyzerTest
Tests run: 1, Failures: 0, Errors: 0, Skipped: 0, Time elapsed: 0.041 sec - in org.apache.mahout.text.MailArchivesClusteringAnalyzerTest
Running org.apache.mahout.text.SequenceFilesFromMailArchivesTest
Tests run: 2, Failures: 1, Errors: 0, Skipped: 0, Time elapsed: 1.773 sec <<< FAILURE!
- in org.apache.mahout.text.SequenceFilesFromMailArchivesTest
testSequential(org.apache.mahout.text.SequenceFilesFromMailArchivesTest)  Time elapsed: 0.522
sec  <<< FAILURE!
org.junit.ComparisonFailure: expected:<TEST/subdir/[mail-messages].gz/user@example.com>
but was:<TEST/subdir/[subsubdir/mail-messages-2].gz/user@example.com>
	at org.junit.Assert.assertEquals(Assert.java:115)
	at org.junit.Assert.assertEquals(Assert.java:144)
	at org.apache.mahout.text.SequenceFilesFromMailArchivesTest.testSequential(SequenceFilesFromMailArchivesTest.java:106)

Running org.apache.mahout.text.LuceneSegmentInputSplitTest
Tests run: 2, Failures: 0, Errors: 0, Skipped: 0, Time elapsed: 0.922 sec - in org.apache.mahout.text.LuceneSegmentInputSplitTest
Running org.apache.mahout.text.LuceneStorageConfigurationTest
Tests run: 2, Failures: 0, Errors: 0, Skipped: 0, Time elapsed: 0.349 sec - in org.apache.mahout.text.LuceneStorageConfigurationTest
Running org.apache.mahout.text.LuceneSegmentRecordReaderTest
Tests run: 1, Failures: 0, Errors: 0, Skipped: 0, Time elapsed: 1.222 sec - in org.apache.mahout.text.LuceneSegmentRecordReaderTest
Running org.apache.mahout.text.SequenceFilesFromLuceneStorageDriverTest
Tests run: 5, Failures: 0, Errors: 0, Skipped: 0, Time elapsed: 3.55 sec - in org.apache.mahout.text.SequenceFilesFromLuceneStorageDriverTest
Running org.apache.mahout.text.TestSequenceFilesFromDirectory
Tests run: 2, Failures: 0, Errors: 0, Skipped: 0, Time elapsed: 2.841 sec - in org.apache.mahout.text.TestSequenceFilesFromDirectory

Results :

Failed tests: 
  SequenceFilesFromMailArchivesTest.testSequential:106->Assert.assertEquals:144->Assert.assertEquals:115
expected:<TEST/subdir/[mail-messages].gz/user@example.com> but was:<TEST/subdir/[subsubdir/mail-messages-2].gz/user@example.com>

Tests run: 106, Failures: 1, Errors: 0, Skipped: 0

[JENKINS] Recording test results
Jul 23, 2013 11:58:54 PM org.apache.maven.cli.event.ExecutionEventLogger logReactorSummary
INFO: ------------------------------------------------------------------------
Jul 23, 2013 11:58:54 PM org.apache.maven.cli.event.ExecutionEventLogger logReactorSummary
INFO: Reactor Summary:
Jul 23, 2013 11:58:54 PM org.apache.maven.cli.event.ExecutionEventLogger logReactorSummary
INFO: 
Jul 23, 2013 11:58:54 PM org.apache.maven.cli.event.ExecutionEventLogger logReactorSummary
INFO: Mahout Build Tools ................................ SUCCESS [7.217s]
Jul 23, 2013 11:58:54 PM org.apache.maven.cli.event.ExecutionEventLogger logReactorSummary
INFO: Apache Mahout ..................................... SUCCESS [1.227s]
Jul 23, 2013 11:58:54 PM org.apache.maven.cli.event.ExecutionEventLogger logReactorSummary
INFO: Mahout Math ....................................... SUCCESS [1:40.026s]
Jul 23, 2013 11:58:54 PM org.apache.maven.cli.event.ExecutionEventLogger logReactorSummary
INFO: Mahout Core ....................................... SUCCESS [20:01.507s]
Jul 23, 2013 11:58:54 PM org.apache.maven.cli.event.ExecutionEventLogger logReactorSummary
INFO: Mahout Integration ................................ FAILURE [1:10.222s]
Jul 23, 2013 11:58:54 PM org.apache.maven.cli.event.ExecutionEventLogger logReactorSummary
INFO: Mahout Examples ................................... SKIPPED
Jul 23, 2013 11:58:54 PM org.apache.maven.cli.event.ExecutionEventLogger logReactorSummary
INFO: Mahout Release Package ............................ SKIPPED
Jul 23, 2013 11:58:54 PM org.apache.maven.cli.event.ExecutionEventLogger logResult
INFO: ------------------------------------------------------------------------
Jul 23, 2013 11:58:54 PM org.apache.maven.cli.event.ExecutionEventLogger logResult
INFO: BUILD FAILURE
Jul 23, 2013 11:58:54 PM org.apache.maven.cli.event.ExecutionEventLogger logStats
INFO: ------------------------------------------------------------------------
Jul 23, 2013 11:58:54 PM org.apache.maven.cli.event.ExecutionEventLogger logStats
INFO: Total time: 23:00.958s
Jul 23, 2013 11:58:54 PM org.apache.maven.cli.event.ExecutionEventLogger logStats
INFO: Finished at: Tue Jul 23 23:58:54 UTC 2013
Jul 23, 2013 11:58:54 PM org.apache.maven.cli.event.ExecutionEventLogger logStats
INFO: Final Memory: 35M/301M
Jul 23, 2013 11:58:54 PM org.apache.maven.cli.event.ExecutionEventLogger sessionEnded
INFO: ------------------------------------------------------------------------
[JENKINS] Archiving <https://builds.apache.org/job/mahout-nightly/ws/trunk/buildtools/pom.xml>
to /home/hudson/hudson/jobs/mahout-nightly/modules/org.apache.mahout$mahout-buildtools/builds/2013-07-23_23-35-49/archive/org.apache.mahout/mahout-buildtools/0.9-SNAPSHOT/mahout-buildtools-0.9-SNAPSHOT.pom
[JENKINS] Archiving <https://builds.apache.org/job/mahout-nightly/ws/trunk/buildtools/target/mahout-buildtools-0.9-SNAPSHOT.jar>
to /home/hudson/hudson/jobs/mahout-nightly/modules/org.apache.mahout$mahout-buildtools/builds/2013-07-23_23-35-49/archive/org.apache.mahout/mahout-buildtools/0.9-20130723.233600-14/mahout-buildtools-0.9-20130723.233600-14.jar
[JENKINS] Archiving <https://builds.apache.org/job/mahout-nightly/ws/trunk/examples/pom.xml>
to /home/hudson/hudson/jobs/mahout-nightly/modules/org.apache.mahout$mahout-examples/builds/2013-07-23_23-35-49/archive/org.apache.mahout/mahout-examples/0.9-SNAPSHOT/mahout-examples-0.9-SNAPSHOT.pom
[JENKINS] Archiving <https://builds.apache.org/job/mahout-nightly/ws/trunk/distribution/pom.xml>
to /home/hudson/hudson/jobs/mahout-nightly/modules/org.apache.mahout$mahout-distribution/builds/2013-07-23_23-35-49/archive/org.apache.mahout/mahout-distribution/0.9-SNAPSHOT/mahout-distribution-0.9-SNAPSHOT.pom
[JENKINS] Archiving <https://builds.apache.org/job/mahout-nightly/ws/trunk/pom.xml>
to /home/hudson/hudson/jobs/mahout-nightly/modules/org.apache.mahout$mahout/builds/2013-07-23_23-35-49/archive/org.apache.mahout/mahout/0.9-SNAPSHOT/mahout-0.9-SNAPSHOT.pom
[JENKINS] Archiving <https://builds.apache.org/job/mahout-nightly/ws/trunk/integration/pom.xml>
to /home/hudson/hudson/jobs/mahout-nightly/modules/org.apache.mahout$mahout-integration/builds/2013-07-23_23-35-49/archive/org.apache.mahout/mahout-integration/0.9-SNAPSHOT/mahout-integration-0.9-SNAPSHOT.pom
[JENKINS] Archiving <https://builds.apache.org/job/mahout-nightly/ws/trunk/core/pom.xml>
to /home/hudson/hudson/jobs/mahout-nightly/modules/org.apache.mahout$mahout-core/builds/2013-07-23_23-35-49/archive/org.apache.mahout/mahout-core/0.9-SNAPSHOT/mahout-core-0.9-SNAPSHOT.pom
[JENKINS] Archiving <https://builds.apache.org/job/mahout-nightly/ws/trunk/core/target/mahout-core-0.9-SNAPSHOT.jar>
to /home/hudson/hudson/jobs/mahout-nightly/modules/org.apache.mahout$mahout-core/builds/2013-07-23_23-35-49/archive/org.apache.mahout/mahout-core/0.9-20130723.235741-12/mahout-core-0.9-20130723.235741-12.jar
[JENKINS] Archiving <https://builds.apache.org/job/mahout-nightly/ws/trunk/core/target/mahout-core-0.9-SNAPSHOT-tests.jar>
to /home/hudson/hudson/jobs/mahout-nightly/modules/org.apache.mahout$mahout-core/builds/2013-07-23_23-35-49/archive/org.apache.mahout/mahout-core/0.9-20130723.235741-12/mahout-core-0.9-20130723.235741-12-tests.jar
[JENKINS] Archiving <https://builds.apache.org/job/mahout-nightly/ws/trunk/core/target/mahout-core-0.9-SNAPSHOT-job.jar>
to /home/hudson/hudson/jobs/mahout-nightly/modules/org.apache.mahout$mahout-core/builds/2013-07-23_23-35-49/archive/org.apache.mahout/mahout-core/0.9-20130723.235741-12/mahout-core-0.9-20130723.235741-12-job.jar
[JENKINS] Archiving <https://builds.apache.org/job/mahout-nightly/ws/trunk/core/target/mahout-core-0.9-SNAPSHOT-sources.jar>
to /home/hudson/hudson/jobs/mahout-nightly/modules/org.apache.mahout$mahout-core/builds/2013-07-23_23-35-49/archive/org.apache.mahout/mahout-core/0.9-20130723.235741-12/mahout-core-0.9-20130723.235741-12-sources.jar
[JENKINS] Archiving <https://builds.apache.org/job/mahout-nightly/ws/trunk/math/pom.xml>
to /home/hudson/hudson/jobs/mahout-nightly/modules/org.apache.mahout$mahout-math/builds/2013-07-23_23-35-49/archive/org.apache.mahout/mahout-math/0.9-SNAPSHOT/mahout-math-0.9-SNAPSHOT.pom
[JENKINS] Archiving <https://builds.apache.org/job/mahout-nightly/ws/trunk/math/target/mahout-math-0.9-SNAPSHOT.jar>
to /home/hudson/hudson/jobs/mahout-nightly/modules/org.apache.mahout$mahout-math/builds/2013-07-23_23-35-49/archive/org.apache.mahout/mahout-math/0.9-20130723.233741-13/mahout-math-0.9-20130723.233741-13.jar
[JENKINS] Archiving <https://builds.apache.org/job/mahout-nightly/ws/trunk/math/target/mahout-math-0.9-SNAPSHOT-tests.jar>
to /home/hudson/hudson/jobs/mahout-nightly/modules/org.apache.mahout$mahout-math/builds/2013-07-23_23-35-49/archive/org.apache.mahout/mahout-math/0.9-20130723.233741-13/mahout-math-0.9-20130723.233741-13-tests.jar
[JENKINS] Archiving <https://builds.apache.org/job/mahout-nightly/ws/trunk/math/target/mahout-math-0.9-SNAPSHOT-sources.jar>
to /home/hudson/hudson/jobs/mahout-nightly/modules/org.apache.mahout$mahout-math/builds/2013-07-23_23-35-49/archive/org.apache.mahout/mahout-math/0.9-20130723.233741-13/mahout-math-0.9-20130723.233741-13-sources.jar
Waiting for Jenkins to finish collecting data
mavenExecutionResult exceptions not empty
message : Failed to execute goal org.apache.maven.plugins:maven-surefire-plugin:2.15:test
(default-test) on project mahout-integration: There are test failures.

Please refer to <https://builds.apache.org/job/mahout-nightly/ws/trunk/integration/target/surefire-reports>
for the individual test results.
cause : There are test failures.

Please refer to <https://builds.apache.org/job/mahout-nightly/ws/trunk/integration/target/surefire-reports>
for the individual test results.
Stack trace : 
org.apache.maven.lifecycle.LifecycleExecutionException: Failed to execute goal org.apache.maven.plugins:maven-surefire-plugin:2.15:test
(default-test) on project mahout-integration: There are test failures.

Please refer to <https://builds.apache.org/job/mahout-nightly/ws/trunk/integration/target/surefire-reports>
for the individual test results.
	at org.apache.maven.lifecycle.internal.MojoExecutor.execute(MojoExecutor.java:213)
	at org.apache.maven.lifecycle.internal.MojoExecutor.execute(MojoExecutor.java:153)
	at org.apache.maven.lifecycle.internal.MojoExecutor.execute(MojoExecutor.java:145)
	at org.apache.maven.lifecycle.internal.LifecycleModuleBuilder.buildProject(LifecycleModuleBuilder.java:84)
	at org.apache.maven.lifecycle.internal.LifecycleModuleBuilder.buildProject(LifecycleModuleBuilder.java:59)
	at org.apache.maven.lifecycle.internal.LifecycleStarter.singleThreadedBuild(LifecycleStarter.java:183)
	at org.apache.maven.lifecycle.internal.LifecycleStarter.execute(LifecycleStarter.java:161)
	at org.apache.maven.DefaultMaven.doExecute(DefaultMaven.java:320)
	at org.apache.maven.DefaultMaven.execute(DefaultMaven.java:156)
	at org.jvnet.hudson.maven3.launcher.Maven3Launcher.main(Maven3Launcher.java:117)
	at sun.reflect.NativeMethodAccessorImpl.invoke0(Native Method)
	at sun.reflect.NativeMethodAccessorImpl.invoke(NativeMethodAccessorImpl.java:39)
	at sun.reflect.DelegatingMethodAccessorImpl.invoke(DelegatingMethodAccessorImpl.java:25)
	at java.lang.reflect.Method.invoke(Method.java:597)
	at org.codehaus.plexus.classworlds.launcher.Launcher.launchStandard(Launcher.java:329)
	at org.codehaus.plexus.classworlds.launcher.Launcher.launch(Launcher.java:239)
	at org.jvnet.hudson.maven3.agent.Maven3Main.launch(Maven3Main.java:178)
	at sun.reflect.NativeMethodAccessorImpl.invoke0(Native Method)
	at sun.reflect.NativeMethodAccessorImpl.invoke(NativeMethodAccessorImpl.java:39)
	at sun.reflect.DelegatingMethodAccessorImpl.invoke(DelegatingMethodAccessorImpl.java:25)
	at java.lang.reflect.Method.invoke(Method.java:597)
	at hudson.maven.Maven3Builder.call(Maven3Builder.java:129)
	at hudson.maven.Maven3Builder.call(Maven3Builder.java:67)
	at hudson.remoting.UserRequest.perform(UserRequest.java:118)
	at hudson.remoting.UserRequest.perform(UserRequest.java:48)
	at hudson.remoting.Request$2.run(Request.java:326)
	at hudson.remoting.InterceptingExecutorService$1.call(InterceptingExecutorService.java:72)
	at java.util.concurrent.FutureTask$Sync.innerRun(FutureTask.java:303)
	at java.util.concurrent.FutureTask.run(FutureTask.java:138)
	at java.util.concurrent.ThreadPoolExecutor$Worker.runTask(ThreadPoolExecutor.java:895)
	at java.util.concurrent.ThreadPoolExecutor$Worker.run(ThreadPoolExecutor.java:918)
	at java.lang.Thread.run(Thread.java:662)
Caused by: org.apache.maven.plugin.MojoFailureException: There are test failures.

Please refer to <https://builds.apache.org/job/mahout-nightly/ws/trunk/integration/target/surefire-reports>
for the individual test results.
	at org.apache.maven.plugin.surefire.SurefireHelper.reportExecution(SurefireHelper.java:82)
	at org.apache.maven.plugin.surefire.SurefirePlugin.handleSummary(SurefirePlugin.java:169)
	at org.apache.maven.plugin.surefire.AbstractSurefireMojo.executeAfterPreconditionsChecked(AbstractSurefireMojo.java:777)
	at org.apache.maven.plugin.surefire.AbstractSurefireMojo.execute(AbstractSurefireMojo.java:645)
	at org.apache.maven.plugin.DefaultBuildPluginManager.executeMojo(DefaultBuildPluginManager.java:101)
	at org.apache.maven.lifecycle.internal.MojoExecutor.execute(MojoExecutor.java:209)
	... 31 more
Sending e-mails to: dev@mahout.apache.org
channel stopped

Mime
View raw message