mahout-dev mailing list archives

Site index · List index
Message view « Date » · « Thread »
Top « Date » · « Thread »
From Apache Jenkins Server <jenk...@builds.apache.org>
Subject Build failed in Jenkins: Mahout-Examples-Cluster-Reuters-II #504
Date Thu, 06 Jun 2013 18:30:02 GMT
See <https://builds.apache.org/job/Mahout-Examples-Cluster-Reuters-II/504/changes>

Changes:

[gsingers] MAHOUT-944: progress up to main compiling except for the file name filter.  haven't
run tests

[robinanil] MAHOUT-1240 correcting the randomized testing jar version to be same as in math

------------------------------------------
[...truncated 3627 lines...]
                                                  
Downloaded: http://repo.maven.apache.org/maven2/org/apache/lucene/lucene-queries/4.3.0/lucene-queries-4.3.0.jar
(198 KB at 1498.4 KB/sec)
36/36 KB   4/45 KB                                
36/36 KB   7/45 KB   
36/36 KB   11/45 KB   
36/36 KB   15/45 KB   
36/36 KB   19/45 KB   
36/36 KB   23/45 KB   
36/36 KB   27/45 KB   
36/36 KB   31/45 KB   
36/36 KB   35/45 KB   
36/36 KB   39/45 KB   
36/36 KB   43/45 KB   
36/36 KB   45/45 KB   
                      
Downloaded: http://repo.maven.apache.org/maven2/org/apache/lucene/lucene-sandbox/4.3.0/lucene-sandbox-4.3.0.jar
(45 KB at 625.8 KB/sec)
36/36 KB   4/257 KB   
36/36 KB   7/257 KB   
36/36 KB   11/257 KB   
36/36 KB   15/257 KB   
36/36 KB   19/257 KB   
36/36 KB   23/257 KB   
36/36 KB   27/257 KB   
36/36 KB   30/257 KB   
36/36 KB   32/257 KB   
36/36 KB   33/257 KB   
36/36 KB   37/257 KB   
36/36 KB   41/257 KB   
36/36 KB   45/257 KB   
36/36 KB   49/257 KB   
36/36 KB   53/257 KB   
36/36 KB   57/257 KB   
36/36 KB   61/257 KB   
36/36 KB   65/257 KB   
36/36 KB   69/257 KB   
36/36 KB   73/257 KB   
36/36 KB   77/257 KB   
36/36 KB   81/257 KB   
36/36 KB   82/257 KB   
36/36 KB   86/257 KB   
36/36 KB   90/257 KB   
36/36 KB   94/257 KB   
36/36 KB   98/257 KB   
36/36 KB   102/257 KB   
36/36 KB   106/257 KB   
36/36 KB   110/257 KB   
36/36 KB   114/257 KB   
36/36 KB   114/257 KB   
36/36 KB   118/257 KB   
36/36 KB   122/257 KB   
36/36 KB   126/257 KB   
36/36 KB   130/257 KB   
36/36 KB   134/257 KB   
36/36 KB   138/257 KB   
36/36 KB   142/257 KB   
36/36 KB   146/257 KB   
36/36 KB   150/257 KB   
36/36 KB   151/257 KB   
36/36 KB   155/257 KB   
36/36 KB   159/257 KB   
36/36 KB   163/257 KB   
36/36 KB   167/257 KB   
36/36 KB   171/257 KB   
36/36 KB   175/257 KB   
36/36 KB   179/257 KB   
36/36 KB   183/257 KB   
36/36 KB   187/257 KB   
36/36 KB   191/257 KB   
36/36 KB   195/257 KB   
36/36 KB   196/257 KB   
36/36 KB   200/257 KB   
36/36 KB   204/257 KB   
36/36 KB   208/257 KB   
36/36 KB   212/257 KB   
36/36 KB   216/257 KB   
36/36 KB   220/257 KB   
36/36 KB   223/257 KB   
36/36 KB   227/257 KB   
36/36 KB   231/257 KB   
36/36 KB   235/257 KB   
36/36 KB   239/257 KB   
36/36 KB   243/257 KB   
36/36 KB   246/257 KB   
36/36 KB   250/257 KB   
36/36 KB   254/257 KB   
36/36 KB   257/257 KB   
36/36 KB   257/257 KB   4/337 KB   
36/36 KB   257/257 KB   7/337 KB   
36/36 KB   257/257 KB   11/337 KB   
36/36 KB   257/257 KB   15/337 KB   
36/36 KB   257/257 KB   19/337 KB   
36/36 KB   257/257 KB   23/337 KB   
36/36 KB   257/257 KB   27/337 KB   
36/36 KB   257/257 KB   31/337 KB   
36/36 KB   257/257 KB   35/337 KB   
36/36 KB   257/257 KB   39/337 KB   
36/36 KB   257/257 KB   43/337 KB   
36/36 KB   257/257 KB   47/337 KB   
36/36 KB   257/257 KB   51/337 KB   
36/36 KB   257/257 KB   55/337 KB   
36/36 KB   257/257 KB   59/337 KB   
36/36 KB   257/257 KB   63/337 KB   
36/36 KB   257/257 KB   67/337 KB   
36/36 KB   257/257 KB   71/337 KB   
36/36 KB   257/257 KB   75/337 KB   
36/36 KB   257/257 KB   79/337 KB   
36/36 KB   257/257 KB   83/337 KB   
36/36 KB   257/257 KB   87/337 KB   
36/36 KB   257/257 KB   91/337 KB   
36/36 KB   257/257 KB   95/337 KB   
36/36 KB   257/257 KB   99/337 KB   
36/36 KB   257/257 KB   103/337 KB   
36/36 KB   257/257 KB   107/337 KB   
36/36 KB   257/257 KB   111/337 KB   
36/36 KB   257/257 KB   111/337 KB   
36/36 KB   257/257 KB   115/337 KB   
36/36 KB   257/257 KB   119/337 KB   
36/36 KB   257/257 KB   123/337 KB   
36/36 KB   257/257 KB   127/337 KB   
36/36 KB   257/257 KB   131/337 KB   
36/36 KB   257/257 KB   135/337 KB   
36/36 KB   257/257 KB   139/337 KB   
36/36 KB   257/257 KB   143/337 KB   
36/36 KB   257/257 KB   147/337 KB   
36/36 KB   257/257 KB   151/337 KB   
36/36 KB   257/257 KB   155/337 KB   
36/36 KB   257/257 KB   159/337 KB   
36/36 KB   257/257 KB   163/337 KB   
36/36 KB   257/257 KB   167/337 KB   
36/36 KB   257/257 KB   171/337 KB   
36/36 KB   257/257 KB   175/337 KB   
36/36 KB   257/257 KB   179/337 KB   
36/36 KB   257/257 KB   183/337 KB   
36/36 KB   257/257 KB   187/337 KB   
36/36 KB   257/257 KB   191/337 KB   
36/36 KB   257/257 KB   195/337 KB   
36/36 KB   257/257 KB   199/337 KB   
36/36 KB   257/257 KB   203/337 KB   
36/36 KB   257/257 KB   207/337 KB   
36/36 KB   257/257 KB   211/337 KB   
36/36 KB   257/257 KB   215/337 KB   
36/36 KB   257/257 KB   219/337 KB   
36/36 KB   257/257 KB   223/337 KB   
36/36 KB   257/257 KB   227/337 KB   
36/36 KB   257/257 KB   231/337 KB   
36/36 KB   257/257 KB   235/337 KB   
36/36 KB   257/257 KB   239/337 KB   
36/36 KB   257/257 KB   243/337 KB   
36/36 KB   257/257 KB   247/337 KB   
36/36 KB   257/257 KB   251/337 KB   
36/36 KB   257/257 KB   255/337 KB   
36/36 KB   257/257 KB   259/337 KB   
36/36 KB   257/257 KB   263/337 KB   
36/36 KB   257/257 KB   267/337 KB   
36/36 KB   257/257 KB   271/337 KB   
36/36 KB   257/257 KB   275/337 KB   
36/36 KB   257/257 KB   279/337 KB   
36/36 KB   257/257 KB   283/337 KB   
36/36 KB   257/257 KB   287/337 KB   
36/36 KB   257/257 KB   291/337 KB   
36/36 KB   257/257 KB   295/337 KB   
36/36 KB   257/257 KB   299/337 KB   
36/36 KB   257/257 KB   303/337 KB   
36/36 KB   257/257 KB   307/337 KB   
36/36 KB   257/257 KB   311/337 KB   
36/36 KB   257/257 KB   315/337 KB   
36/36 KB   257/257 KB   319/337 KB   
36/36 KB   257/257 KB   323/337 KB   
36/36 KB   257/257 KB   327/337 KB   
36/36 KB   257/257 KB   331/337 KB   
36/36 KB   257/257 KB   335/337 KB   
36/36 KB   257/257 KB   337/337 KB   
                                     
Downloaded: http://repo.maven.apache.org/maven2/org/apache/lucene/lucene-benchmark/4.3.0/lucene-benchmark-4.3.0.jar
(257 KB at 487.6 KB/sec)
                                     
Downloaded: http://repo.maven.apache.org/maven2/org/apache/lucene/lucene-memory/4.3.0/lucene-memory-4.3.0.jar
(36 KB at 47.4 KB/sec)
                                     
Downloaded: http://repo.maven.apache.org/maven2/org/apache/lucene/lucene-facet/4.3.0/lucene-facet-4.3.0.jar
(337 KB at 495.3 KB/sec)
[INFO] 
[INFO] --- maven-clean-plugin:2.4.1:clean (default-clean) @ mahout-integration ---
[INFO] 
[INFO] --- maven-resources-plugin:2.6:resources (default-resources) @ mahout-integration ---
[INFO] Using 'UTF-8' encoding to copy filtered resources.
[INFO] Copying 0 resource
[INFO] 
[INFO] --- maven-compiler-plugin:3.1:compile (default-compile) @ mahout-integration ---
[INFO] Changes detected - recompiling the module!
[INFO] Compiling 124 source files to /zonestorage/hudson_solaris/home/hudson/hudson-slave/workspace/Mahout-Examples-Cluster-Reuters-II/trunk/integration/target/classes
[INFO] -------------------------------------------------------------
[WARNING] COMPILATION WARNING : 
[INFO] -------------------------------------------------------------
[WARNING] Note: Some input files use or override a deprecated API.
[WARNING] Note: Recompile with -Xlint:deprecation for details.
[WARNING] Note: /zonestorage/hudson_solaris/home/hudson/hudson-slave/workspace/Mahout-Examples-Cluster-Reuters-II/trunk/integration/src/main/java/org/apache/mahout/cf/taste/impl/model/mongodb/MongoDBDataModel.java
uses unchecked or unsafe operations.
[WARNING] Note: Recompile with -Xlint:unchecked for details.
[INFO] 4 warnings 
[INFO] -------------------------------------------------------------
[INFO] -------------------------------------------------------------
[ERROR] COMPILATION ERROR : 
[INFO] -------------------------------------------------------------
[ERROR] /zonestorage/hudson_solaris/home/hudson/hudson-slave/workspace/Mahout-Examples-Cluster-Reuters-II/trunk/integration/src/main/java/org/apache/mahout/text/LuceneIndexFileNameFilter.java:[23,31]
cannot find symbol
symbol  : class IndexFileNameFilter
location: package org.apache.lucene.index
[ERROR] /zonestorage/hudson_solaris/home/hudson/hudson-slave/workspace/Mahout-Examples-Cluster-Reuters-II/trunk/integration/src/main/java/org/apache/mahout/text/LuceneIndexFileNameFilter.java:[45,17]
cannot find symbol
symbol  : class IndexFileNameFilter
location: class org.apache.mahout.text.LuceneIndexFileNameFilter
[ERROR] /zonestorage/hudson_solaris/home/hudson/hudson-slave/workspace/Mahout-Examples-Cluster-Reuters-II/trunk/integration/src/main/java/org/apache/mahout/text/LuceneIndexFileNameFilter.java:[48,34]
cannot find symbol
symbol  : method getFilter()
location: class org.apache.lucene.index.IndexFileNames
[INFO] 3 errors 
[INFO] -------------------------------------------------------------
[INFO] ------------------------------------------------------------------------
[INFO] Reactor Summary:
[INFO] 
[INFO] Apache Mahout ..................................... SUCCESS [8.604s]
[INFO] Mahout Build Tools ................................ SUCCESS [10.195s]
[INFO] Mahout Math ....................................... SUCCESS [35.149s]
[INFO] Mahout Core ....................................... SUCCESS [1:00.155s]
[INFO] Mahout Integration ................................ FAILURE [14.969s]
[INFO] Mahout Examples ................................... SKIPPED
[INFO] Mahout Release Package ............................ SKIPPED
[INFO] ------------------------------------------------------------------------
[INFO] BUILD FAILURE
[INFO] ------------------------------------------------------------------------
[INFO] Total time: 2:09.894s
[INFO] Finished at: Thu Jun 06 18:29:46 GMT+00:00 2013
[INFO] Final Memory: 33M/372M
[INFO] ------------------------------------------------------------------------
[ERROR] Failed to execute goal org.apache.maven.plugins:maven-compiler-plugin:3.1:compile
(default-compile) on project mahout-integration: Compilation failure: Compilation failure:
[ERROR] /zonestorage/hudson_solaris/home/hudson/hudson-slave/workspace/Mahout-Examples-Cluster-Reuters-II/trunk/integration/src/main/java/org/apache/mahout/text/LuceneIndexFileNameFilter.java:[23,31]
cannot find symbol
[ERROR] symbol  : class IndexFileNameFilter
[ERROR] location: package org.apache.lucene.index
[ERROR] /zonestorage/hudson_solaris/home/hudson/hudson-slave/workspace/Mahout-Examples-Cluster-Reuters-II/trunk/integration/src/main/java/org/apache/mahout/text/LuceneIndexFileNameFilter.java:[45,17]
cannot find symbol
[ERROR] symbol  : class IndexFileNameFilter
[ERROR] location: class org.apache.mahout.text.LuceneIndexFileNameFilter
[ERROR] /zonestorage/hudson_solaris/home/hudson/hudson-slave/workspace/Mahout-Examples-Cluster-Reuters-II/trunk/integration/src/main/java/org/apache/mahout/text/LuceneIndexFileNameFilter.java:[48,34]
cannot find symbol
[ERROR] symbol  : method getFilter()
[ERROR] location: class org.apache.lucene.index.IndexFileNames
[ERROR] -> [Help 1]
[ERROR] 
[ERROR] To see the full stack trace of the errors, re-run Maven with the -e switch.
[ERROR] Re-run Maven using the -X switch to enable full debug logging.
[ERROR] 
[ERROR] For more information about the errors and possible solutions, please read the following
articles:
[ERROR] [Help 1] http://cwiki.apache.org/confluence/display/MAVEN/MojoFailureException
[ERROR] 
[ERROR] After correcting the problems, you can resume the build with the command
[ERROR]   mvn <goals> -rf :mahout-integration
Build step 'Invoke top-level Maven targets' marked build as failure

Mime
View raw message