mahout-dev mailing list archives

Site index · List index
Message view « Date » · « Thread »
Top « Date » · « Thread »
From Apache Jenkins Server <jenk...@builds.apache.org>
Subject Build failed in Jenkins: Mahout-Quality #2107
Date Tue, 25 Jun 2013 22:15:12 GMT
See <https://builds.apache.org/job/Mahout-Quality/2107/>

------------------------------------------
[...truncated 7199 lines...]
	at org.apache.maven.lifecycle.internal.LifecycleStarter.execute(LifecycleStarter.java:161)
	at org.apache.maven.DefaultMaven.doExecute(DefaultMaven.java:320)
	at org.apache.maven.DefaultMaven.execute(DefaultMaven.java:156)
	at org.apache.maven.cli.MavenCli.execute(MavenCli.java:537)
	at org.apache.maven.cli.MavenCli.doMain(MavenCli.java:196)
	at org.apache.maven.cli.MavenCli.main(MavenCli.java:141)
	at sun.reflect.NativeMethodAccessorImpl.invoke0(Native Method)
	at sun.reflect.NativeMethodAccessorImpl.invoke(NativeMethodAccessorImpl.java:39)
	at sun.reflect.DelegatingMethodAccessorImpl.invoke(DelegatingMethodAccessorImpl.java:25)
	at java.lang.reflect.Method.invoke(Method.java:597)
	at org.codehaus.plexus.classworlds.launcher.Launcher.launchEnhanced(Launcher.java:290)
	at org.codehaus.plexus.classworlds.launcher.Launcher.launch(Launcher.java:230)
	at org.codehaus.plexus.classworlds.launcher.Launcher.mainWithExitCode(Launcher.java:409)
	at org.codehaus.plexus.classworlds.launcher.Launcher.main(Launcher.java:352)
[WARNING] Failure executing PMD: Couldn't find the class Can't find resource rulesets/basic.xml.
 Make sure the resource is a valid file or URL or is on the CLASSPATH.  Here's the current
classpath: /home/hudson/tools/maven/apache-maven-3.0.4/boot/plexus-classworlds-2.4.jar
java.lang.RuntimeException: Couldn't find the class Can't find resource rulesets/basic.xml.
 Make sure the resource is a valid file or URL or is on the CLASSPATH.  Here's the current
classpath: /home/hudson/tools/maven/apache-maven-3.0.4/boot/plexus-classworlds-2.4.jar
	at net.sourceforge.pmd.RuleSetFactory.classNotFoundProblem(RuleSetFactory.java:244)
	at net.sourceforge.pmd.RuleSetFactory.parseRuleSetNode(RuleSetFactory.java:234)
	at net.sourceforge.pmd.RuleSetFactory.createRuleSet(RuleSetFactory.java:161)
	at net.sourceforge.pmd.RuleSetFactory.createRuleSets(RuleSetFactory.java:126)
	at net.sourceforge.pmd.RuleSetFactory.createRuleSets(RuleSetFactory.java:111)
	at net.sourceforge.pmd.processor.AbstractPMDProcessor.createRuleSets(AbstractPMDProcessor.java:56)
	at net.sourceforge.pmd.processor.MonoThreadProcessor.processFiles(MonoThreadProcessor.java:41)
	at net.sourceforge.pmd.PMD.processFiles(PMD.java:271)
	at org.apache.maven.plugin.pmd.PmdReport.generateReport(PmdReport.java:296)
	at org.apache.maven.plugin.pmd.PmdReport.execute(PmdReport.java:194)
	at org.apache.maven.plugin.pmd.PmdReport.executeReport(PmdReport.java:168)
	at org.apache.maven.reporting.AbstractMavenReport.generate(AbstractMavenReport.java:190)
	at org.apache.maven.reporting.AbstractMavenReport.execute(AbstractMavenReport.java:99)
	at org.apache.maven.plugin.DefaultBuildPluginManager.executeMojo(DefaultBuildPluginManager.java:101)
	at org.apache.maven.lifecycle.internal.MojoExecutor.execute(MojoExecutor.java:209)
	at org.apache.maven.lifecycle.internal.MojoExecutor.execute(MojoExecutor.java:153)
	at org.apache.maven.lifecycle.internal.MojoExecutor.execute(MojoExecutor.java:145)
	at org.apache.maven.lifecycle.internal.LifecycleModuleBuilder.buildProject(LifecycleModuleBuilder.java:84)
	at org.apache.maven.lifecycle.internal.LifecycleModuleBuilder.buildProject(LifecycleModuleBuilder.java:59)
	at org.apache.maven.lifecycle.internal.LifecycleStarter.singleThreadedBuild(LifecycleStarter.java:183)
	at org.apache.maven.lifecycle.internal.LifecycleStarter.execute(LifecycleStarter.java:161)
	at org.apache.maven.DefaultMaven.doExecute(DefaultMaven.java:320)
	at org.apache.maven.DefaultMaven.execute(DefaultMaven.java:156)
	at org.apache.maven.cli.MavenCli.execute(MavenCli.java:537)
	at org.apache.maven.cli.MavenCli.doMain(MavenCli.java:196)
	at org.apache.maven.cli.MavenCli.main(MavenCli.java:141)
	at sun.reflect.NativeMethodAccessorImpl.invoke0(Native Method)
	at sun.reflect.NativeMethodAccessorImpl.invoke(NativeMethodAccessorImpl.java:39)
	at sun.reflect.DelegatingMethodAccessorImpl.invoke(DelegatingMethodAccessorImpl.java:25)
	at java.lang.reflect.Method.invoke(Method.java:597)
	at org.codehaus.plexus.classworlds.launcher.Launcher.launchEnhanced(Launcher.java:290)
	at org.codehaus.plexus.classworlds.launcher.Launcher.launch(Launcher.java:230)
	at org.codehaus.plexus.classworlds.launcher.Launcher.mainWithExitCode(Launcher.java:409)
	at org.codehaus.plexus.classworlds.launcher.Launcher.main(Launcher.java:352)
[INFO]                                                                         
[INFO] ------------------------------------------------------------------------
[INFO] Building Mahout Integration 0.8-SNAPSHOT
[INFO] ------------------------------------------------------------------------
[WARNING] The POM for com.atlassian.maven.plugins:maven-clover2-plugin:jar:3.1.11.1 is missing,
no dependency information available
[WARNING] Failed to retrieve plugin descriptor for com.atlassian.maven.plugins:maven-clover2-plugin:3.1.11.1:
Plugin com.atlassian.maven.plugins:maven-clover2-plugin:3.1.11.1 or one of its dependencies
could not be resolved: Failed to read artifact descriptor for com.atlassian.maven.plugins:maven-clover2-plugin:jar:3.1.11.1
[WARNING] The POM for com.atlassian.maven.plugins:maven-clover2-plugin:jar:3.1.11.1 is missing,
no dependency information available
[WARNING] Failed to retrieve plugin descriptor for com.atlassian.maven.plugins:maven-clover2-plugin:3.1.11.1:
Plugin com.atlassian.maven.plugins:maven-clover2-plugin:3.1.11.1 or one of its dependencies
could not be resolved: Failed to read artifact descriptor for com.atlassian.maven.plugins:maven-clover2-plugin:jar:3.1.11.1
[WARNING] The POM for org.eclipse.m2e:lifecycle-mapping:jar:1.0.0 is missing, no dependency
information available
[WARNING] Failed to retrieve plugin descriptor for org.eclipse.m2e:lifecycle-mapping:1.0.0:
Plugin org.eclipse.m2e:lifecycle-mapping:1.0.0 or one of its dependencies could not be resolved:
Failed to read artifact descriptor for org.eclipse.m2e:lifecycle-mapping:jar:1.0.0
[WARNING] The POM for com.atlassian.maven.plugins:maven-clover2-plugin:jar:3.1.11.1 is missing,
no dependency information available
[WARNING] Failed to retrieve plugin descriptor for com.atlassian.maven.plugins:maven-clover2-plugin:3.1.11.1:
Plugin com.atlassian.maven.plugins:maven-clover2-plugin:3.1.11.1 or one of its dependencies
could not be resolved: Failed to read artifact descriptor for com.atlassian.maven.plugins:maven-clover2-plugin:jar:3.1.11.1
[WARNING] The POM for org.eclipse.m2e:lifecycle-mapping:jar:1.0.0 is missing, no dependency
information available
[WARNING] Failed to retrieve plugin descriptor for org.eclipse.m2e:lifecycle-mapping:1.0.0:
Plugin org.eclipse.m2e:lifecycle-mapping:1.0.0 or one of its dependencies could not be resolved:
Failed to read artifact descriptor for org.eclipse.m2e:lifecycle-mapping:jar:1.0.0
[INFO] 
[INFO] --- maven-clean-plugin:2.4.1:clean (default-clean) @ mahout-integration ---
[INFO] 
[INFO] --- maven-resources-plugin:2.6:resources (default-resources) @ mahout-integration ---
[INFO] Using 'UTF-8' encoding to copy filtered resources.
[INFO] Copying 0 resource
[INFO] 
[INFO] --- maven-compiler-plugin:3.1:compile (default-compile) @ mahout-integration ---
[INFO] Changes detected - recompiling the module!
[INFO] Compiling 131 source files to <https://builds.apache.org/job/Mahout-Quality/2107/artifact/trunk/integration/target/classes>
[WARNING] Note: Some input files use or override a deprecated API.
[WARNING] Note: Recompile with -Xlint:deprecation for details.
[WARNING] Note: <https://builds.apache.org/job/Mahout-Quality/ws/trunk/integration/src/main/java/org/apache/mahout/cf/taste/impl/model/mongodb/MongoDBDataModel.java>
uses unchecked or unsafe operations.
[WARNING] Note: Recompile with -Xlint:unchecked for details.
[INFO] 
[INFO] --- maven-resources-plugin:2.6:testResources (default-testResources) @ mahout-integration
---
[INFO] Using 'UTF-8' encoding to copy filtered resources.
[INFO] Copying 10 resources
[INFO] 
[INFO] --- maven-compiler-plugin:3.1:testCompile (default-testCompile) @ mahout-integration
---
[INFO] Changes detected - recompiling the module!
[INFO] Compiling 39 source files to <https://builds.apache.org/job/Mahout-Quality/2107/artifact/trunk/integration/target/test-classes>
[WARNING] Note: Some input files use or override a deprecated API.
[WARNING] Note: Recompile with -Xlint:deprecation for details.
[INFO] 
[INFO] --- maven-surefire-plugin:2.14.1:test (default-test) @ mahout-integration ---
[INFO] Surefire report directory: <https://builds.apache.org/job/Mahout-Quality/2107/artifact/trunk/integration/target/surefire-reports>

-------------------------------------------------------
 T E S T S
-------------------------------------------------------

-------------------------------------------------------
 T E S T S
-------------------------------------------------------
parallel='classes', perCoreThreadCount=false, threadCount=1, useUnlimitedThreads=false
parallel='classes', perCoreThreadCount=false, threadCount=1, useUnlimitedThreads=false
parallel='classes', perCoreThreadCount=false, threadCount=1, useUnlimitedThreads=false
parallel='classes', perCoreThreadCount=false, threadCount=1, useUnlimitedThreads=false
parallel='classes', perCoreThreadCount=false, threadCount=1, useUnlimitedThreads=false
parallel='classes', perCoreThreadCount=false, threadCount=1, useUnlimitedThreads=false
parallel='classes', perCoreThreadCount=false, threadCount=1, useUnlimitedThreads=false
parallel='classes', perCoreThreadCount=false, threadCount=1, useUnlimitedThreads=false
parallel='classes', perCoreThreadCount=false, threadCount=1, useUnlimitedThreads=false
parallel='classes', perCoreThreadCount=false, threadCount=1, useUnlimitedThreads=false
parallel='classes', perCoreThreadCount=false, threadCount=1, useUnlimitedThreads=false
Running org.apache.mahout.utils.vectors.io.VectorWriterTest
parallel='classes', perCoreThreadCount=false, threadCount=1, useUnlimitedThreads=false
Running org.apache.mahout.utils.vectors.VectorHelperTest
Running org.apache.mahout.utils.nlp.collocations.llr.BloomTokenFilterTest
Running org.apache.mahout.clustering.cdbw.TestCDbwEvaluator
Running org.apache.mahout.clustering.dirichlet.TestL1ModelClustering
Tests run: 3, Failures: 0, Errors: 0, Skipped: 0, Time elapsed: 0.101 sec
Tests run: 5, Failures: 0, Errors: 0, Skipped: 0, Time elapsed: 0.089 sec
Running org.apache.mahout.utils.Bump125Test
Running org.apache.mahout.clustering.TestClusterDumper
Running org.apache.mahout.utils.regex.RegexMapperTest
Running org.apache.mahout.cf.taste.impl.similarity.jdbc.MySQLJDBCInMemoryItemSimilarityTest
Tests run: 1, Failures: 0, Errors: 0, Skipped: 0, Time elapsed: 0.026 sec
Running org.apache.mahout.utils.regex.RegexUtilsTest
Running org.apache.mahout.utils.vectors.csv.CSVVectorIteratorTest
Tests run: 1, Failures: 0, Errors: 0, Skipped: 0, Time elapsed: 0.042 sec
Running org.apache.mahout.clustering.TestClusterEvaluator
Tests run: 1, Failures: 0, Errors: 0, Skipped: 0, Time elapsed: 0.288 sec
parallel='classes', perCoreThreadCount=false, threadCount=1, useUnlimitedThreads=false
Tests run: 1, Failures: 0, Errors: 0, Skipped: 0, Time elapsed: 0.467 sec
Running org.apache.mahout.utils.vectors.arff.ARFFVectorIterableTest
parallel='classes', perCoreThreadCount=false, threadCount=1, useUnlimitedThreads=false
parallel='classes', perCoreThreadCount=false, threadCount=1, useUnlimitedThreads=false
parallel='classes', perCoreThreadCount=false, threadCount=1, useUnlimitedThreads=false
Tests run: 8, Failures: 0, Errors: 0, Skipped: 0, Time elapsed: 0.271 sec
Running org.apache.mahout.utils.vectors.arff.MapBackedARFFModelTest
Tests run: 1, Failures: 0, Errors: 0, Skipped: 0, Time elapsed: 0.037 sec
Running org.apache.mahout.utils.vectors.arff.DriverTest
Tests run: 2, Failures: 0, Errors: 0, Skipped: 0, Time elapsed: 1.463 sec
parallel='classes', perCoreThreadCount=false, threadCount=1, useUnlimitedThreads=false
Running org.apache.mahout.utils.vectors.arff.ARFFTypeTest
Tests run: 1, Failures: 0, Errors: 0, Skipped: 0, Time elapsed: 0.025 sec
parallel='classes', perCoreThreadCount=false, threadCount=1, useUnlimitedThreads=false
Running org.apache.mahout.utils.vectors.lucene.DriverTest
Tests run: 3, Failures: 0, Errors: 0, Skipped: 0, Time elapsed: 1.542 sec
Running org.apache.mahout.utils.vectors.lucene.LuceneIterableTest
parallel='classes', perCoreThreadCount=false, threadCount=1, useUnlimitedThreads=false
parallel='classes', perCoreThreadCount=false, threadCount=1, useUnlimitedThreads=false
Tests run: 2, Failures: 0, Errors: 0, Skipped: 0, Time elapsed: 0.812 sec
parallel='classes', perCoreThreadCount=false, threadCount=1, useUnlimitedThreads=false
Running org.apache.mahout.utils.vectors.lucene.CachedTermInfoTest
parallel='classes', perCoreThreadCount=false, threadCount=1, useUnlimitedThreads=false
Running org.apache.mahout.utils.email.MailProcessorTest
Running org.apache.mahout.utils.TestConcatenateVectorsJob
parallel='classes', perCoreThreadCount=false, threadCount=1, useUnlimitedThreads=false
Running org.apache.mahout.utils.SplitInputTest
Running org.apache.mahout.text.MailArchivesClusteringAnalyzerTest
Tests run: 2, Failures: 0, Errors: 0, Skipped: 0, Time elapsed: 0.325 sec
Tests run: 1, Failures: 0, Errors: 0, Skipped: 0, Time elapsed: 0.099 sec
parallel='classes', perCoreThreadCount=false, threadCount=1, useUnlimitedThreads=false
Tests run: 4, Failures: 0, Errors: 0, Skipped: 0, Time elapsed: 2.944 sec
Tests run: 1, Failures: 0, Errors: 0, Skipped: 0, Time elapsed: 0.933 sec
Running org.apache.mahout.text.LuceneSegmentInputSplitTest
Tests run: 3, Failures: 0, Errors: 0, Skipped: 0, Time elapsed: 1.45 sec
parallel='classes', perCoreThreadCount=false, threadCount=1, useUnlimitedThreads=false
parallel='classes', perCoreThreadCount=false, threadCount=1, useUnlimitedThreads=false
Running org.apache.mahout.text.TestSequenceFilesFromDirectory
parallel='classes', perCoreThreadCount=false, threadCount=1, useUnlimitedThreads=false
Running org.apache.mahout.text.SequenceFilesFromLuceneStorageDriverTest
Tests run: 1, Failures: 0, Errors: 0, Skipped: 0, Time elapsed: 1.698 sec
parallel='classes', perCoreThreadCount=false, threadCount=1, useUnlimitedThreads=false
parallel='classes', perCoreThreadCount=false, threadCount=1, useUnlimitedThreads=false
Running org.apache.mahout.text.LuceneSegmentInputFormatTest
Running org.apache.mahout.text.SequenceFilesFromLuceneStorageMRJobTest
Running org.apache.mahout.text.LuceneSegmentRecordReaderTest
Tests run: 1, Failures: 0, Errors: 0, Skipped: 0, Time elapsed: 3.412 sec
parallel='classes', perCoreThreadCount=false, threadCount=1, useUnlimitedThreads=false
Running org.apache.mahout.text.SequenceFilesFromLuceneStorageTest
parallel='classes', perCoreThreadCount=false, threadCount=1, useUnlimitedThreads=false
Running org.apache.mahout.text.LuceneStorageConfigurationTest
Tests run: 2, Failures: 0, Errors: 0, Skipped: 0, Time elapsed: 4.086 sec
Tests run: 2, Failures: 0, Errors: 0, Skipped: 0, Time elapsed: 0.945 sec
Tests run: 1, Failures: 0, Errors: 0, Skipped: 0, Time elapsed: 3.629 sec
parallel='classes', perCoreThreadCount=false, threadCount=1, useUnlimitedThreads=false
Running org.apache.mahout.text.SequenceFilesFromMailArchivesTest
Tests run: 2, Failures: 0, Errors: 0, Skipped: 0, Time elapsed: 4.981 sec
Tests run: 1, Failures: 0, Errors: 0, Skipped: 0, Time elapsed: 4.062 sec
Tests run: 2, Failures: 1, Errors: 0, Skipped: 0, Time elapsed: 2.899 sec <<< FAILURE!
testMapReduce(org.apache.mahout.text.SequenceFilesFromMailArchivesTest)  Time elapsed: 1.599
sec  <<< FAILURE!
java.lang.AssertionError: expected:<1> but was:<0>
	at org.junit.Assert.fail(Assert.java:88)
	at org.junit.Assert.failNotEquals(Assert.java:743)
	at org.junit.Assert.assertEquals(Assert.java:118)
	at org.junit.Assert.assertEquals(Assert.java:555)
	at org.junit.Assert.assertEquals(Assert.java:542)
	at org.apache.mahout.text.SequenceFilesFromMailArchivesTest.testMapReduce(SequenceFilesFromMailArchivesTest.java:154)

Tests run: 12, Failures: 0, Errors: 0, Skipped: 0, Time elapsed: 8.923 sec
Tests run: 1, Failures: 0, Errors: 0, Skipped: 0, Time elapsed: 6.988 sec
Tests run: 6, Failures: 0, Errors: 0, Skipped: 0, Time elapsed: 12.257 sec
Tests run: 5, Failures: 0, Errors: 0, Skipped: 0, Time elapsed: 9.027 sec
Tests run: 12, Failures: 0, Errors: 0, Skipped: 0, Time elapsed: 13.486 sec
Tests run: 6, Failures: 0, Errors: 0, Skipped: 0, Time elapsed: 8.976 sec
Tests run: 12, Failures: 0, Errors: 0, Skipped: 0, Time elapsed: 21.888 sec

Results :

Failed tests: 
  SequenceFilesFromMailArchivesTest.testMapReduce:154->Assert.assertEquals:542->Assert.assertEquals:555->Assert.assertEquals:118->Assert.failNotEquals:743->Assert.fail:88
expected:<1> but was:<0>

Tests run: 106, Failures: 1, Errors: 0, Skipped: 0

[INFO] ------------------------------------------------------------------------
[INFO] Reactor Summary:
[INFO] 
[INFO] Apache Mahout ..................................... SUCCESS [6.335s]
[INFO] Mahout Build Tools ................................ SUCCESS [2.395s]
[INFO] Mahout Math ....................................... SUCCESS [1:23.211s]
[INFO] Mahout Core ....................................... SUCCESS [5:35.586s]
[INFO] Mahout Integration ................................ FAILURE [26.026s]
[INFO] Mahout Examples ................................... SKIPPED
[INFO] Mahout Release Package ............................ SKIPPED
[INFO] ------------------------------------------------------------------------
[INFO] BUILD FAILURE
[INFO] ------------------------------------------------------------------------
[INFO] Total time: 7:37.224s
[INFO] Finished at: Tue Jun 25 22:14:35 UTC 2013
[INFO] Final Memory: 50M/375M
[INFO] ------------------------------------------------------------------------
[ERROR] Failed to execute goal org.apache.maven.plugins:maven-surefire-plugin:2.14.1:test
(default-test) on project mahout-integration: There are test failures.
[ERROR] 
[ERROR] Please refer to <https://builds.apache.org/job/Mahout-Quality/2107/artifact/trunk/integration/target/surefire-reports>
for the individual test results.
[ERROR] -> [Help 1]
[ERROR] 
[ERROR] To see the full stack trace of the errors, re-run Maven with the -e switch.
[ERROR] Re-run Maven using the -X switch to enable full debug logging.
[ERROR] 
[ERROR] For more information about the errors and possible solutions, please read the following
articles:
[ERROR] [Help 1] http://cwiki.apache.org/confluence/display/MAVEN/MojoFailureException
[ERROR] 
[ERROR] After correcting the problems, you can resume the build with the command
[ERROR]   mvn <goals> -rf :mahout-integration
Build step 'Invoke top-level Maven targets' marked build as failure
[FINDBUGS] Skipping publisher since build result is FAILURE
[PMD] Skipping publisher since build result is FAILURE
[TASKS] Skipping publisher since build result is FAILURE
Archiving artifacts
Recording test results
Publishing Javadoc

Mime
View raw message