mahout-dev mailing list archives

Site index · List index
Message view « Date » · « Thread »
Top « Date » · « Thread »
From Apache Jenkins Server <jenk...@builds.apache.org>
Subject Build failed in Jenkins: Mahout-Quality #2053
Date Fri, 07 Jun 2013 18:47:41 GMT
See <https://builds.apache.org/job/Mahout-Quality/2053/>

------------------------------------------
[...truncated 8628 lines...]
377/377 KB   36/36 KB   137/337 KB   
377/377 KB   36/36 KB   141/337 KB   
377/377 KB   36/36 KB   145/337 KB   
377/377 KB   36/36 KB   149/337 KB   
377/377 KB   36/36 KB   153/337 KB   
377/377 KB   36/36 KB   157/337 KB   
377/377 KB   36/36 KB   161/337 KB   
377/377 KB   36/36 KB   165/337 KB   
377/377 KB   36/36 KB   169/337 KB   
377/377 KB   36/36 KB   173/337 KB   
377/377 KB   36/36 KB   177/337 KB   
377/377 KB   36/36 KB   181/337 KB   
377/377 KB   36/36 KB   185/337 KB   
377/377 KB   36/36 KB   189/337 KB   
377/377 KB   36/36 KB   193/337 KB   
377/377 KB   36/36 KB   197/337 KB   
377/377 KB   36/36 KB   201/337 KB   
377/377 KB   36/36 KB   205/337 KB   
377/377 KB   36/36 KB   206/337 KB   
                                     
Downloaded: http://repo.maven.apache.org/maven2/org/apache/lucene/lucene-queryparser/4.3.0/lucene-queryparser-4.3.0.jar
(377 KB at 1384.4 KB/sec)
36/36 KB   207/337 KB                
36/36 KB   210/337 KB   
36/36 KB   214/337 KB   
36/36 KB   218/337 KB   
36/36 KB   222/337 KB   
36/36 KB   226/337 KB   
36/36 KB   228/337 KB   
36/36 KB   232/337 KB   
36/36 KB   236/337 KB   
36/36 KB   240/337 KB   
36/36 KB   244/337 KB   
36/36 KB   248/337 KB   
36/36 KB   252/337 KB   
36/36 KB   256/337 KB   
36/36 KB   260/337 KB   
36/36 KB   264/337 KB   
36/36 KB   268/337 KB   
36/36 KB   272/337 KB   
36/36 KB   276/337 KB   
36/36 KB   280/337 KB   
36/36 KB   284/337 KB   
36/36 KB   288/337 KB   
36/36 KB   292/337 KB   
36/36 KB   296/337 KB   
36/36 KB   300/337 KB   
36/36 KB   303/337 KB   
36/36 KB   307/337 KB   
36/36 KB   308/337 KB   
36/36 KB   312/337 KB   
36/36 KB   316/337 KB   
36/36 KB   320/337 KB   
36/36 KB   324/337 KB   
36/36 KB   328/337 KB   
36/36 KB   332/337 KB   
36/36 KB   336/337 KB   
36/36 KB   337/337 KB   
                        
Downloaded: http://repo.maven.apache.org/maven2/org/apache/lucene/lucene-memory/4.3.0/lucene-memory-4.3.0.jar
(36 KB at 112.7 KB/sec)
                        
Downloaded: http://repo.maven.apache.org/maven2/org/apache/lucene/lucene-facet/4.3.0/lucene-facet-4.3.0.jar
(337 KB at 2495.1 KB/sec)
[INFO] 
[INFO] --- maven-clean-plugin:2.4.1:clean (default-clean) @ mahout-integration ---
[INFO] 
[INFO] --- maven-resources-plugin:2.6:resources (default-resources) @ mahout-integration ---
[INFO] Using 'UTF-8' encoding to copy filtered resources.
[INFO] Copying 0 resource
[INFO] 
[INFO] --- maven-compiler-plugin:3.1:compile (default-compile) @ mahout-integration ---
[INFO] Changes detected - recompiling the module!
[INFO] Compiling 125 source files to /home/hudson/jenkins-slave/workspace/Mahout-Quality/trunk/integration/target/classes
[WARNING] Note: Some input files use or override a deprecated API.
[WARNING] Note: Recompile with -Xlint:deprecation for details.
[WARNING] Note: /home/hudson/jenkins-slave/workspace/Mahout-Quality/trunk/integration/src/main/java/org/apache/mahout/cf/taste/impl/model/mongodb/MongoDBDataModel.java
uses unchecked or unsafe operations.
[WARNING] Note: Recompile with -Xlint:unchecked for details.
[INFO] 
[INFO] --- maven-resources-plugin:2.6:testResources (default-testResources) @ mahout-integration
---
[INFO] Using 'UTF-8' encoding to copy filtered resources.
[INFO] Copying 1 resource
[INFO] 
[INFO] --- maven-compiler-plugin:3.1:testCompile (default-testCompile) @ mahout-integration
---
[INFO] Changes detected - recompiling the module!
[INFO] Compiling 35 source files to /home/hudson/jenkins-slave/workspace/Mahout-Quality/trunk/integration/target/test-classes
[WARNING] Note: Some input files use or override a deprecated API.
[WARNING] Note: Recompile with -Xlint:deprecation for details.
[INFO] 
[INFO] --- maven-surefire-plugin:2.14.1:test (default-test) @ mahout-integration ---
[INFO] Surefire report directory: /home/hudson/jenkins-slave/workspace/Mahout-Quality/trunk/integration/target/surefire-reports

-------------------------------------------------------
 T E S T S
-------------------------------------------------------

-------------------------------------------------------
 T E S T S
-------------------------------------------------------
parallel='classes', perCoreThreadCount=false, threadCount=1, useUnlimitedThreads=false
parallel='classes', perCoreThreadCount=false, threadCount=1, useUnlimitedThreads=false
parallel='classes', perCoreThreadCount=false, threadCount=1, useUnlimitedThreads=false
parallel='classes', perCoreThreadCount=false, threadCount=1, useUnlimitedThreads=false
parallel='classes', perCoreThreadCount=false, threadCount=1, useUnlimitedThreads=false
parallel='classes', perCoreThreadCount=false, threadCount=1, useUnlimitedThreads=false
parallel='classes', perCoreThreadCount=false, threadCount=1, useUnlimitedThreads=false
parallel='classes', perCoreThreadCount=false, threadCount=1, useUnlimitedThreads=false
parallel='classes', perCoreThreadCount=false, threadCount=1, useUnlimitedThreads=false
Running org.apache.mahout.utils.vectors.lucene.LuceneIterableTest
parallel='classes', perCoreThreadCount=false, threadCount=1, useUnlimitedThreads=false
parallel='classes', perCoreThreadCount=false, threadCount=1, useUnlimitedThreads=false
parallel='classes', perCoreThreadCount=false, threadCount=1, useUnlimitedThreads=false
Running org.apache.mahout.utils.vectors.csv.CSVVectorIteratorTest
Running org.apache.mahout.utils.Bump125Test
Tests run: 1, Failures: 0, Errors: 0, Skipped: 0, Time elapsed: 0.029 sec
Running org.apache.mahout.utils.vectors.arff.ARFFVectorIterableTest
Running org.apache.mahout.utils.regex.RegexUtilsTest
Running org.apache.mahout.utils.SplitInputTest
Running org.apache.mahout.utils.email.MailProcessorTest
Running org.apache.mahout.utils.vectors.io.VectorWriterTest
Tests run: 1, Failures: 0, Errors: 0, Skipped: 0, Time elapsed: 0.071 sec
Running org.apache.mahout.utils.vectors.arff.ARFFTypeTest
Tests run: 1, Failures: 0, Errors: 0, Skipped: 0, Time elapsed: 0.007 sec
Tests run: 8, Failures: 0, Errors: 0, Skipped: 0, Time elapsed: 0.166 sec
Running org.apache.mahout.utils.vectors.VectorHelperTest
Running org.apache.mahout.utils.regex.RegexMapperTest
Running org.apache.mahout.utils.vectors.lucene.CachedTermInfoTest
Tests run: 2, Failures: 0, Errors: 0, Skipped: 0, Time elapsed: 0.232 sec
Tests run: 3, Failures: 0, Errors: 0, Skipped: 0, Time elapsed: 0.132 sec
Tests run: 1, Failures: 0, Errors: 0, Skipped: 0, Time elapsed: 0.484 sec
parallel='classes', perCoreThreadCount=false, threadCount=1, useUnlimitedThreads=false
parallel='classes', perCoreThreadCount=false, threadCount=1, useUnlimitedThreads=false
parallel='classes', perCoreThreadCount=false, threadCount=1, useUnlimitedThreads=false
Running org.apache.mahout.text.LuceneSegmentInputSplitTest
parallel='classes', perCoreThreadCount=false, threadCount=1, useUnlimitedThreads=false
parallel='classes', perCoreThreadCount=false, threadCount=1, useUnlimitedThreads=false
Running org.apache.mahout.utils.nlp.collocations.llr.BloomTokenFilterTest
parallel='classes', perCoreThreadCount=false, threadCount=1, useUnlimitedThreads=false
parallel='classes', perCoreThreadCount=false, threadCount=1, useUnlimitedThreads=false
Tests run: 5, Failures: 0, Errors: 0, Skipped: 0, Time elapsed: 0.15 sec
Running org.apache.mahout.text.LuceneStorageConfigurationTest
Running org.apache.mahout.text.SequenceFilesFromLuceneStorageTest
Tests run: 1, Failures: 0, Errors: 0, Skipped: 0, Time elapsed: 1.068 sec
Running org.apache.mahout.text.LuceneSegmentInputFormatTest
Running org.apache.mahout.text.MailArchivesClusteringAnalyzerTest
Tests run: 3, Failures: 0, Errors: 0, Skipped: 0, Time elapsed: 1.601 sec
Tests run: 3, Failures: 0, Errors: 0, Skipped: 0, Time elapsed: 1.236 sec
Tests run: 1, Failures: 0, Errors: 0, Skipped: 0, Time elapsed: 0.1 sec
Running org.apache.mahout.text.LuceneSegmentRecordReaderTest
Tests run: 2, Failures: 0, Errors: 0, Skipped: 0, Time elapsed: 1.65 sec
parallel='classes', perCoreThreadCount=false, threadCount=1, useUnlimitedThreads=false
parallel='classes', perCoreThreadCount=false, threadCount=1, useUnlimitedThreads=false
Running org.apache.mahout.text.TestSequenceFilesFromDirectory
parallel='classes', perCoreThreadCount=false, threadCount=1, useUnlimitedThreads=false
Running org.apache.mahout.text.SequenceFilesFromMailArchivesTest
parallel='classes', perCoreThreadCount=false, threadCount=1, useUnlimitedThreads=false
parallel='classes', perCoreThreadCount=false, threadCount=1, useUnlimitedThreads=false
Running org.apache.mahout.text.SequenceFilesFromLuceneStorageMRJobTest
Running org.apache.mahout.cf.taste.impl.similarity.jdbc.MySQLJDBCInMemoryItemSimilarityTest
Tests run: 2, Failures: 0, Errors: 0, Skipped: 0, Time elapsed: 1.243 sec
Running org.apache.mahout.text.SequenceFilesFromLuceneStorageDriverTest
parallel='classes', perCoreThreadCount=false, threadCount=1, useUnlimitedThreads=false
Tests run: 1, Failures: 0, Errors: 0, Skipped: 0, Time elapsed: 0.535 sec
Running org.apache.mahout.clustering.cdbw.TestCDbwEvaluator
parallel='classes', perCoreThreadCount=false, threadCount=1, useUnlimitedThreads=false
Tests run: 1, Failures: 0, Errors: 0, Skipped: 0, Time elapsed: 1.458 sec
parallel='classes', perCoreThreadCount=false, threadCount=1, useUnlimitedThreads=false
Running org.apache.mahout.clustering.dirichlet.TestL1ModelClustering
Tests run: 1, Failures: 0, Errors: 0, Skipped: 0, Time elapsed: 2.459 sec
Tests run: 1, Failures: 0, Errors: 0, Skipped: 0, Time elapsed: 1.865 sec
Running org.apache.mahout.clustering.TestClusterDumper
Tests run: 2, Failures: 0, Errors: 0, Skipped: 0, Time elapsed: 3.343 sec
parallel='classes', perCoreThreadCount=false, threadCount=1, useUnlimitedThreads=false
Running org.apache.mahout.clustering.TestClusterEvaluator
Tests run: 1, Failures: 0, Errors: 0, Skipped: 0, Time elapsed: 3.164 sec
Tests run: 4, Failures: 0, Errors: 0, Skipped: 0, Time elapsed: 2.304 sec
Tests run: 1, Failures: 0, Errors: 0, Skipped: 0, Time elapsed: 5.444 sec
Tests run: 12, Failures: 0, Errors: 0, Skipped: 0, Time elapsed: 8.643 sec
Tests run: 6, Failures: 0, Errors: 0, Skipped: 0, Time elapsed: 8.163 sec
Tests run: 5, Failures: 1, Errors: 0, Skipped: 0, Time elapsed: 7.436 sec <<< FAILURE!
testRun_invalidQuery(org.apache.mahout.text.SequenceFilesFromLuceneStorageDriverTest)  Time
elapsed: 1.823 sec  <<< FAILURE!
java.lang.AssertionError: Expected exception: java.lang.IllegalArgumentException
	at org.junit.internal.runners.statements.ExpectException.evaluate(ExpectException.java:32)
	at org.junit.internal.runners.statements.RunBefores.evaluate(RunBefores.java:26)
	at org.junit.internal.runners.statements.RunAfters.evaluate(RunAfters.java:27)
	at org.junit.runners.ParentRunner.runLeaf(ParentRunner.java:271)
	at org.junit.runners.BlockJUnit4ClassRunner.runChild(BlockJUnit4ClassRunner.java:70)
	at org.junit.runners.BlockJUnit4ClassRunner.runChild(BlockJUnit4ClassRunner.java:50)
	at org.junit.runners.ParentRunner$3.run(ParentRunner.java:238)
	at org.junit.runners.ParentRunner$1.schedule(ParentRunner.java:63)
	at org.junit.runners.ParentRunner.runChildren(ParentRunner.java:236)
	at org.junit.runners.ParentRunner.access$000(ParentRunner.java:53)
	at org.junit.runners.ParentRunner$2.evaluate(ParentRunner.java:229)
	at org.junit.runners.ParentRunner.run(ParentRunner.java:309)
	at org.junit.runners.Suite.runChild(Suite.java:127)
	at org.junit.runners.Suite.runChild(Suite.java:26)
	at org.junit.runners.ParentRunner$3.run(ParentRunner.java:238)
	at java.util.concurrent.Executors$RunnableAdapter.call(Executors.java:439)
	at java.util.concurrent.FutureTask$Sync.innerRun(FutureTask.java:303)
	at java.util.concurrent.FutureTask.run(FutureTask.java:138)
	at java.util.concurrent.ThreadPoolExecutor$Worker.runTask(ThreadPoolExecutor.java:895)
	at java.util.concurrent.ThreadPoolExecutor$Worker.run(ThreadPoolExecutor.java:918)
	at java.lang.Thread.run(Thread.java:662)

Tests run: 6, Failures: 0, Errors: 0, Skipped: 0, Time elapsed: 8.162 sec
Tests run: 12, Failures: 0, Errors: 0, Skipped: 0, Time elapsed: 9.304 sec
Tests run: 12, Failures: 0, Errors: 0, Skipped: 0, Time elapsed: 17.29 sec

Results :

Failed tests: 
   Expected exception: java.lang.IllegalArgumentException

Tests run: 99, Failures: 1, Errors: 0, Skipped: 0

[INFO] ------------------------------------------------------------------------
[INFO] Reactor Summary:
[INFO] 
[INFO] Apache Mahout ..................................... SUCCESS [19.866s]
[INFO] Mahout Build Tools ................................ SUCCESS [2.636s]
[INFO] Mahout Math ....................................... SUCCESS [1:23.929s]
[INFO] Mahout Core ....................................... SUCCESS [5:32.564s]
[INFO] Mahout Integration ................................ FAILURE [29.257s]
[INFO] Mahout Examples ................................... SKIPPED
[INFO] Mahout Release Package ............................ SKIPPED
[INFO] ------------------------------------------------------------------------
[INFO] BUILD FAILURE
[INFO] ------------------------------------------------------------------------
[INFO] Total time: 7:55.156s
[INFO] Finished at: Fri Jun 07 18:46:58 UTC 2013
[INFO] Final Memory: 46M/417M
[INFO] ------------------------------------------------------------------------
[ERROR] Failed to execute goal org.apache.maven.plugins:maven-surefire-plugin:2.14.1:test
(default-test) on project mahout-integration: There are test failures.
[ERROR] 
[ERROR] Please refer to /home/hudson/jenkins-slave/workspace/Mahout-Quality/trunk/integration/target/surefire-reports
for the individual test results.
[ERROR] -> [Help 1]
[ERROR] 
[ERROR] To see the full stack trace of the errors, re-run Maven with the -e switch.
[ERROR] Re-run Maven using the -X switch to enable full debug logging.
[ERROR] 
[ERROR] For more information about the errors and possible solutions, please read the following
articles:
[ERROR] [Help 1] http://cwiki.apache.org/confluence/display/MAVEN/MojoFailureException
[ERROR] 
[ERROR] After correcting the problems, you can resume the build with the command
[ERROR]   mvn <goals> -rf :mahout-integration
Build step 'Invoke top-level Maven targets' marked build as failure
[FINDBUGS] Skipping publisher since build result is FAILURE
[PMD] Skipping publisher since build result is FAILURE
[TASKS] Skipping publisher since build result is FAILURE
Archiving artifacts
Recording test results
Publishing Javadoc

Mime
View raw message