mahout-dev mailing list archives

Site index · List index
Message view « Date » · « Thread »
Top « Date » · « Thread »
From Apache Jenkins Server <jenk...@builds.apache.org>
Subject Build failed in Jenkins: mahout-nightly #927
Date Thu, 05 Jul 2012 00:03:53 GMT
See <https://builds.apache.org/job/mahout-nightly/927/changes>

Changes:

[srowen] MAHOUT-1039 parse --usersFile correctly

[srowen] MAHOUT-1038 use getPreferenceTimeSQL in getPreferenceTime

------------------------------------------
[...truncated 1527 lines...]
Tests run: 3, Failures: 0, Errors: 0, Skipped: 0, Time elapsed: 0.203 sec
Running org.apache.mahout.common.IntPairWritableTest
Tests run: 3, Failures: 0, Errors: 0, Skipped: 0, Time elapsed: 0.011 sec
Running org.apache.mahout.common.distance.TestWeightedEuclideanDistanceMeasureTest
Tests run: 2, Failures: 0, Errors: 0, Skipped: 0, Time elapsed: 0.011 sec
Running org.apache.mahout.common.distance.TestChebyshevMeasure
Tests run: 1, Failures: 0, Errors: 0, Skipped: 0, Time elapsed: 0.005 sec
Running org.apache.mahout.common.distance.TestWeightedManhattanDistanceMeasure
Tests run: 2, Failures: 0, Errors: 0, Skipped: 0, Time elapsed: 0.036 sec
Running org.apache.mahout.common.distance.TestEuclideanDistanceMeasure
Tests run: 1, Failures: 0, Errors: 0, Skipped: 0, Time elapsed: 0.008 sec
Running org.apache.mahout.common.distance.CosineDistanceMeasureTest
Tests run: 1, Failures: 0, Errors: 0, Skipped: 0, Time elapsed: 0.015 sec
Running org.apache.mahout.common.distance.TestTanimotoDistanceMeasure
Tests run: 2, Failures: 0, Errors: 0, Skipped: 0, Time elapsed: 0.019 sec
Running org.apache.mahout.common.distance.TestMinkowskiMeasure
Tests run: 1, Failures: 0, Errors: 0, Skipped: 0, Time elapsed: 0.012 sec
Running org.apache.mahout.common.distance.TestManhattanDistanceMeasure
Tests run: 1, Failures: 0, Errors: 0, Skipped: 0, Time elapsed: 0.011 sec
Running org.apache.mahout.common.distance.TestMahalanobisDistanceMeasure
Tests run: 1, Failures: 0, Errors: 0, Skipped: 0, Time elapsed: 0.014 sec
Running org.apache.mahout.common.StringUtilsTest
Tests run: 2, Failures: 0, Errors: 0, Skipped: 0, Time elapsed: 0.146 sec
Running org.apache.mahout.clustering.meanshift.TestMeanShift
Tests run: 8, Failures: 0, Errors: 0, Skipped: 0, Time elapsed: 57.199 sec
Running org.apache.mahout.clustering.iterator.TestClusterClassifier
Tests run: 15, Failures: 0, Errors: 0, Skipped: 0, Time elapsed: 27.724 sec
Running org.apache.mahout.clustering.lda.cvb.TestCVBModelTrainer
Tests run: 2, Failures: 0, Errors: 0, Skipped: 0, Time elapsed: 210.965 sec
Running org.apache.mahout.clustering.spectral.eigencuts.TestEigencutsSensitivityJob
Tests run: 2, Failures: 0, Errors: 0, Skipped: 0, Time elapsed: 0.014 sec
Running org.apache.mahout.clustering.spectral.eigencuts.TestEigencutsAffinityCutsJob
Tests run: 3, Failures: 0, Errors: 0, Skipped: 0, Time elapsed: 0.021 sec
Running org.apache.mahout.clustering.spectral.common.TestAffinityMatrixInputJob
Tests run: 2, Failures: 0, Errors: 0, Skipped: 0, Time elapsed: 0.013 sec
Running org.apache.mahout.clustering.spectral.common.TestVectorMatrixMultiplicationJob
Tests run: 1, Failures: 0, Errors: 0, Skipped: 0, Time elapsed: 0.006 sec
Running org.apache.mahout.clustering.spectral.common.TestMatrixDiagonalizeJob
Tests run: 2, Failures: 0, Errors: 0, Skipped: 0, Time elapsed: 0.012 sec
Running org.apache.mahout.clustering.spectral.common.TestVectorCache
Tests run: 3, Failures: 0, Errors: 0, Skipped: 0, Time elapsed: 0.034 sec
Running org.apache.mahout.clustering.spectral.common.TestUnitVectorizerJob
Tests run: 1, Failures: 0, Errors: 0, Skipped: 0, Time elapsed: 0.006 sec
Running org.apache.mahout.clustering.TestClusterInterface
Tests run: 12, Failures: 0, Errors: 0, Skipped: 0, Time elapsed: 0.014 sec
Running org.apache.mahout.clustering.fuzzykmeans.TestFuzzyKmeansClustering
Tests run: 3, Failures: 0, Errors: 0, Skipped: 0, Time elapsed: 157.465 sec
Running org.apache.mahout.clustering.kmeans.TestRandomSeedGenerator
Tests run: 1, Failures: 0, Errors: 0, Skipped: 0, Time elapsed: 0.055 sec
Running org.apache.mahout.clustering.kmeans.TestKmeansClustering
Tests run: 3, Failures: 0, Errors: 0, Skipped: 0, Time elapsed: 117.223 sec
Running org.apache.mahout.clustering.topdown.postprocessor.ClusterCountReaderTest
Tests run: 1, Failures: 0, Errors: 0, Skipped: 0, Time elapsed: 0.224 sec
Running org.apache.mahout.clustering.topdown.postprocessor.ClusterOutputPostProcessorTest
Tests run: 1, Failures: 0, Errors: 0, Skipped: 0, Time elapsed: 0.144 sec
Running org.apache.mahout.clustering.topdown.PathDirectoryTest
Tests run: 5, Failures: 0, Errors: 0, Skipped: 0, Time elapsed: 0.005 sec
Running org.apache.mahout.clustering.classify.ClusterClassificationDriverTest
Tests run: 3, Failures: 0, Errors: 0, Skipped: 0, Time elapsed: 8.147 sec
Running org.apache.mahout.clustering.dirichlet.TestDistributions
Tests run: 9, Failures: 0, Errors: 0, Skipped: 0, Time elapsed: 0.037 sec
Running org.apache.mahout.clustering.dirichlet.TestMapReduce
Tests run: 4, Failures: 0, Errors: 0, Skipped: 0, Time elapsed: 79.46 sec
Running org.apache.mahout.clustering.dirichlet.TestDirichletClustering
Tests run: 2, Failures: 0, Errors: 0, Skipped: 0, Time elapsed: 11.188 sec
Running org.apache.mahout.clustering.minhash.TestMinHashClustering
Tests run: 4, Failures: 0, Errors: 0, Skipped: 0, Time elapsed: 28.354 sec
Running org.apache.mahout.clustering.canopy.TestCanopyCreation
Tests run: 17, Failures: 0, Errors: 0, Skipped: 0, Time elapsed: 62.232 sec
Running org.apache.mahout.clustering.TestGaussianAccumulators
Tests run: 6, Failures: 0, Errors: 0, Skipped: 0, Time elapsed: 1.194 sec
Running org.apache.mahout.classifier.discriminative.WinnowTrainerTest
Tests run: 1, Failures: 0, Errors: 0, Skipped: 0, Time elapsed: 0.004 sec
Running org.apache.mahout.classifier.discriminative.PerceptronTrainerTest
Tests run: 1, Failures: 0, Errors: 0, Skipped: 0, Time elapsed: 0.013 sec
Running org.apache.mahout.classifier.discriminative.LinearModelTest
Tests run: 3, Failures: 0, Errors: 0, Skipped: 0, Time elapsed: 0.005 sec
Running org.apache.mahout.classifier.ConfusionMatrixTest
Tests run: 2, Failures: 0, Errors: 0, Skipped: 0, Time elapsed: 0.003 sec
Running org.apache.mahout.classifier.naivebayes.training.IndexInstancesMapperTest
Tests run: 2, Failures: 0, Errors: 0, Skipped: 0, Time elapsed: 0.025 sec
Running org.apache.mahout.classifier.naivebayes.training.ThetaMapperTest
Tests run: 1, Failures: 0, Errors: 0, Skipped: 0, Time elapsed: 0.028 sec
Running org.apache.mahout.classifier.naivebayes.training.WeightsMapperTest
Tests run: 1, Failures: 0, Errors: 0, Skipped: 0, Time elapsed: 0.003 sec
Running org.apache.mahout.classifier.naivebayes.ComplementaryNaiveBayesClassifierTest
Tests run: 1, Failures: 0, Errors: 0, Skipped: 0, Time elapsed: 0.003 sec
Running org.apache.mahout.classifier.naivebayes.NaiveBayesModelTest
Tests run: 1, Failures: 0, Errors: 0, Skipped: 0, Time elapsed: 0.008 sec
Running org.apache.mahout.classifier.naivebayes.StandardNaiveBayesClassifierTest
Tests run: 1, Failures: 0, Errors: 0, Skipped: 0, Time elapsed: 0.002 sec
Running org.apache.mahout.classifier.naivebayes.NaiveBayesTest
Tests run: 2, Failures: 0, Errors: 0, Skipped: 0, Time elapsed: 28.666 sec
Running org.apache.mahout.classifier.sequencelearning.hmm.HMMModelTest
Tests run: 1, Failures: 0, Errors: 0, Skipped: 0, Time elapsed: 0.012 sec
Running org.apache.mahout.classifier.sequencelearning.hmm.HMMEvaluatorTest
Tests run: 2, Failures: 0, Errors: 0, Skipped: 0, Time elapsed: 0.008 sec
Running org.apache.mahout.classifier.sequencelearning.hmm.HMMUtilsTest
Tests run: 7, Failures: 0, Errors: 0, Skipped: 0, Time elapsed: 0.021 sec
Running org.apache.mahout.classifier.sequencelearning.hmm.HMMTrainerTest
Tests run: 4, Failures: 0, Errors: 0, Skipped: 0, Time elapsed: 0.034 sec
Running org.apache.mahout.classifier.sequencelearning.hmm.HMMAlgorithmsTest
Tests run: 6, Failures: 0, Errors: 0, Skipped: 0, Time elapsed: 0.018 sec
Running org.apache.mahout.classifier.evaluation.AucTest
Tests run: 3, Failures: 0, Errors: 0, Skipped: 0, Time elapsed: 0.499 sec
Running org.apache.mahout.classifier.df.data.DescriptorUtilsTest
Tests run: 2, Failures: 0, Errors: 0, Skipped: 0, Time elapsed: 0.006 sec
Running org.apache.mahout.classifier.df.data.DataConverterTest
Tests run: 1, Failures: 0, Errors: 0, Skipped: 0, Time elapsed: 0.091 sec
Running org.apache.mahout.classifier.df.data.DataLoaderTest
Tests run: 4, Failures: 0, Errors: 0, Skipped: 0, Time elapsed: 0.282 sec
Running org.apache.mahout.classifier.df.data.DatasetTest
Tests run: 1, Failures: 0, Errors: 0, Skipped: 0, Time elapsed: 0.006 sec
Running org.apache.mahout.classifier.df.data.DataTest
Tests run: 10, Failures: 0, Errors: 0, Skipped: 0, Time elapsed: 0.3 sec
Running org.apache.mahout.classifier.df.tools.VisualizerTest
Tests run: 3, Failures: 0, Errors: 0, Skipped: 0, Time elapsed: 0.015 sec
Running org.apache.mahout.classifier.df.DecisionForestTest
Tests run: 3, Failures: 0, Errors: 0, Skipped: 0, Time elapsed: 0.013 sec
Running org.apache.mahout.classifier.df.node.NodeTest
Tests run: 3, Failures: 0, Errors: 0, Skipped: 0, Time elapsed: 0.007 sec
Running org.apache.mahout.classifier.df.mapreduce.partial.Step1MapperTest
Tests run: 1, Failures: 0, Errors: 0, Skipped: 0, Time elapsed: 0.014 sec
Running org.apache.mahout.classifier.df.mapreduce.partial.TreeIDTest
Tests run: 1, Failures: 0, Errors: 0, Skipped: 0, Time elapsed: 0.226 sec
Running org.apache.mahout.classifier.df.mapreduce.partial.PartialBuilderTest
Tests run: 2, Failures: 0, Errors: 0, Skipped: 0, Time elapsed: 0.021 sec
Running org.apache.mahout.classifier.df.mapreduce.inmem.InMemInputFormatTest
Tests run: 2, Failures: 0, Errors: 0, Skipped: 0, Time elapsed: 0.014 sec
Running org.apache.mahout.classifier.df.mapreduce.inmem.InMemInputSplitTest
Tests run: 2, Failures: 0, Errors: 0, Skipped: 0, Time elapsed: 0.004 sec
Running org.apache.mahout.classifier.df.builder.DecisionTreeBuilderTest
Tests run: 1, Failures: 0, Errors: 0, Skipped: 0, Time elapsed: 0.025 sec
Running org.apache.mahout.classifier.df.builder.DefaultTreeBuilderTest
Tests run: 1, Failures: 0, Errors: 0, Skipped: 0, Time elapsed: 0.031 sec
Running org.apache.mahout.classifier.df.builder.InfiniteRecursionTest
Tests run: 1, Failures: 0, Errors: 0, Skipped: 0, Time elapsed: 0.003 sec
Running org.apache.mahout.classifier.df.split.OptIgSplitTest
Tests run: 1, Failures: 0, Errors: 0, Skipped: 0, Time elapsed: 0.191 sec
Running org.apache.mahout.classifier.df.split.DefaultIgSplitTest
Tests run: 1, Failures: 0, Errors: 0, Skipped: 0, Time elapsed: 0.008 sec
Running org.apache.mahout.classifier.sgd.OnlineLogisticRegressionTest
Tests run: 4, Failures: 0, Errors: 0, Skipped: 0, Time elapsed: 33.306 sec
Running org.apache.mahout.classifier.sgd.CsvRecordFactoryTest
Tests run: 2, Failures: 0, Errors: 0, Skipped: 0, Time elapsed: 0.008 sec
Running org.apache.mahout.classifier.sgd.AdaptiveLogisticRegressionTest
Tests run: 5, Failures: 0, Errors: 0, Skipped: 0, Time elapsed: 11.352 sec
Running org.apache.mahout.classifier.sgd.GradientMachineTest
Tests run: 1, Failures: 0, Errors: 0, Skipped: 0, Time elapsed: 0.036 sec
Running org.apache.mahout.classifier.sgd.ModelSerializerTest
Tests run: 4, Failures: 0, Errors: 0, Skipped: 0, Time elapsed: 0.572 sec
Running org.apache.mahout.classifier.sgd.PassiveAggressiveTest
Tests run: 1, Failures: 0, Errors: 0, Skipped: 0, Time elapsed: 0.02 sec
Running org.apache.mahout.classifier.RegressionResultAnalyzerTest
Tests run: 2, Failures: 0, Errors: 0, Skipped: 0, Time elapsed: 0.024 sec

Results :

Tests in error: 
  testDistributedLanczosSolverEVJCLI(org.apache.mahout.math.hadoop.decomposer.TestDistributedLanczosSolverCLI):
java.io.IOException: Job failed!

Tests run: 675, Failures: 0, Errors: 1, Skipped: 0

mojoFailed org.apache.maven.plugins:maven-surefire-plugin:2.12(default-test)
[JENKINS] Recording test results
projectFailed org.apache.mahout:mahout-core:0.8-SNAPSHOT
sessionEnded
[INFO] ------------------------------------------------------------------------
[INFO] Reactor Summary:
[INFO] 
[INFO] Apache Mahout ..................................... SUCCESS [21.144s]
[INFO] Mahout Build Tools ................................ SUCCESS [7.376s]
[INFO] Mahout Math ....................................... SUCCESS [1:01.996s]
[INFO] Mahout Core ....................................... FAILURE [50:58.041s]
[INFO] Mahout Integration ................................ SKIPPED
[INFO] Mahout Examples ................................... SKIPPED
[INFO] Mahout Release Package ............................ SKIPPED
[INFO] ------------------------------------------------------------------------
[INFO] BUILD FAILURE
[INFO] ------------------------------------------------------------------------
[INFO] Total time: 52:31.476s
[INFO] Finished at: Thu Jul 05 00:03:02 UTC 2012
[INFO] Final Memory: 18M/200M
[INFO] ------------------------------------------------------------------------
Projects to build: [MavenProject: org.apache.mahout:mahout:0.8-SNAPSHOT @ <https://builds.apache.org/job/mahout-nightly/ws/trunk/pom.xml,>
MavenProject: org.apache.mahout:mahout-buildtools:0.8-SNAPSHOT @ <https://builds.apache.org/job/mahout-nightly/ws/trunk/buildtools/pom.xml,>
MavenProject: org.apache.mahout:mahout-math:0.8-SNAPSHOT @ <https://builds.apache.org/job/mahout-nightly/ws/trunk/math/pom.xml,>
MavenProject: org.apache.mahout:mahout-core:0.8-SNAPSHOT @ <https://builds.apache.org/job/mahout-nightly/ws/trunk/core/pom.xml,>
MavenProject: org.apache.mahout:mahout-integration:0.8-SNAPSHOT @ <https://builds.apache.org/job/mahout-nightly/ws/trunk/integration/pom.xml,>
MavenProject: org.apache.mahout:mahout-examples:0.8-SNAPSHOT @ <https://builds.apache.org/job/mahout-nightly/ws/trunk/examples/pom.xml,>
MavenProject: org.apache.mahout:mahout-distribution:0.8-SNAPSHOT @ <https://builds.apache.org/job/mahout-nightly/ws/trunk/distribution/pom.xml]>
[JENKINS] Archiving <https://builds.apache.org/job/mahout-nightly/ws/trunk/buildtools/pom.xml>
to /home/hudson/hudson/jobs/mahout-nightly/modules/org.apache.mahout$mahout-buildtools/builds/2012-07-04_23-10-16/archive/org.apache.mahout/mahout-buildtools/0.8-SNAPSHOT/mahout-buildtools-0.8-SNAPSHOT.pom
[JENKINS] Archiving <https://builds.apache.org/job/mahout-nightly/ws/trunk/buildtools/target/mahout-buildtools-0.8-SNAPSHOT.jar>
to /home/hudson/hudson/jobs/mahout-nightly/modules/org.apache.mahout$mahout-buildtools/builds/2012-07-04_23-10-16/archive/org.apache.mahout/mahout-buildtools/0.8-20120704.231100-26/mahout-buildtools-0.8-20120704.231100-26.jar
[JENKINS] Archiving <https://builds.apache.org/job/mahout-nightly/ws/trunk/examples/pom.xml>
to /home/hudson/hudson/jobs/mahout-nightly/modules/org.apache.mahout$mahout-examples/builds/2012-07-04_23-10-16/archive/org.apache.mahout/mahout-examples/0.8-SNAPSHOT/mahout-examples-0.8-SNAPSHOT.pom
[JENKINS] Archiving <https://builds.apache.org/job/mahout-nightly/ws/trunk/distribution/pom.xml>
to /home/hudson/hudson/jobs/mahout-nightly/modules/org.apache.mahout$mahout-distribution/builds/2012-07-04_23-10-16/archive/org.apache.mahout/mahout-distribution/0.8-SNAPSHOT/mahout-distribution-0.8-SNAPSHOT.pom
[JENKINS] Archiving <https://builds.apache.org/job/mahout-nightly/ws/trunk/pom.xml>
to /home/hudson/hudson/jobs/mahout-nightly/modules/org.apache.mahout$mahout/builds/2012-07-04_23-10-16/archive/org.apache.mahout/mahout/0.8-SNAPSHOT/mahout-0.8-SNAPSHOT.pom
[JENKINS] Archiving <https://builds.apache.org/job/mahout-nightly/ws/trunk/integration/pom.xml>
to /home/hudson/hudson/jobs/mahout-nightly/modules/org.apache.mahout$mahout-integration/builds/2012-07-04_23-10-16/archive/org.apache.mahout/mahout-integration/0.8-SNAPSHOT/mahout-integration-0.8-SNAPSHOT.pom
[JENKINS] Archiving <https://builds.apache.org/job/mahout-nightly/ws/trunk/core/pom.xml>
to /home/hudson/hudson/jobs/mahout-nightly/modules/org.apache.mahout$mahout-core/builds/2012-07-04_23-10-16/archive/org.apache.mahout/mahout-core/0.8-SNAPSHOT/mahout-core-0.8-SNAPSHOT.pom
[JENKINS] Archiving <https://builds.apache.org/job/mahout-nightly/ws/trunk/math/pom.xml>
to /home/hudson/hudson/jobs/mahout-nightly/modules/org.apache.mahout$mahout-math/builds/2012-07-04_23-10-16/archive/org.apache.mahout/mahout-math/0.8-SNAPSHOT/mahout-math-0.8-SNAPSHOT.pom
[JENKINS] Archiving <https://builds.apache.org/job/mahout-nightly/ws/trunk/math/target/mahout-math-0.8-SNAPSHOT.jar>
to /home/hudson/hudson/jobs/mahout-nightly/modules/org.apache.mahout$mahout-math/builds/2012-07-04_23-10-16/archive/org.apache.mahout/mahout-math/0.8-20120704.231159-26/mahout-math-0.8-20120704.231159-26.jar
[JENKINS] Archiving <https://builds.apache.org/job/mahout-nightly/ws/trunk/math/target/mahout-math-0.8-SNAPSHOT-tests.jar>
to /home/hudson/hudson/jobs/mahout-nightly/modules/org.apache.mahout$mahout-math/builds/2012-07-04_23-10-16/archive/org.apache.mahout/mahout-math/0.8-20120704.231159-26/mahout-math-0.8-20120704.231159-26-tests.jar
[JENKINS] Archiving <https://builds.apache.org/job/mahout-nightly/ws/trunk/math/target/mahout-math-0.8-SNAPSHOT-sources.jar>
to /home/hudson/hudson/jobs/mahout-nightly/modules/org.apache.mahout$mahout-math/builds/2012-07-04_23-10-16/archive/org.apache.mahout/mahout-math/0.8-20120704.231159-26/mahout-math-0.8-20120704.231159-26-sources.jar
Waiting for Jenkins to finish collecting data
mavenExecutionResult exceptions not empty
message : Failed to execute goal org.apache.maven.plugins:maven-surefire-plugin:2.12:test
(default-test) on project mahout-core: There are test failures.

Please refer to <https://builds.apache.org/job/mahout-nightly/ws/trunk/core/target/surefire-reports>
for the individual test results.
cause : There are test failures.

Please refer to <https://builds.apache.org/job/mahout-nightly/ws/trunk/core/target/surefire-reports>
for the individual test results.
Stack trace : 
org.apache.maven.lifecycle.LifecycleExecutionException: Failed to execute goal org.apache.maven.plugins:maven-surefire-plugin:2.12:test
(default-test) on project mahout-core: There are test failures.

Please refer to <https://builds.apache.org/job/mahout-nightly/ws/trunk/core/target/surefire-reports>
for the individual test results.
	at org.apache.maven.lifecycle.internal.MojoExecutor.execute(MojoExecutor.java:213)
	at org.apache.maven.lifecycle.internal.MojoExecutor.execute(MojoExecutor.java:153)
	at org.apache.maven.lifecycle.internal.MojoExecutor.execute(MojoExecutor.java:145)
	at org.apache.maven.lifecycle.internal.LifecycleModuleBuilder.buildProject(LifecycleModuleBuilder.java:84)
	at org.apache.maven.lifecycle.internal.LifecycleModuleBuilder.buildProject(LifecycleModuleBuilder.java:59)
	at org.apache.maven.lifecycle.internal.LifecycleStarter.singleThreadedBuild(LifecycleStarter.java:183)
	at org.apache.maven.lifecycle.internal.LifecycleStarter.execute(LifecycleStarter.java:161)
	at org.apache.maven.DefaultMaven.doExecute(DefaultMaven.java:319)
	at org.apache.maven.DefaultMaven.execute(DefaultMaven.java:156)
	at org.jvnet.hudson.maven3.launcher.Maven3Launcher.main(Maven3Launcher.java:79)
	at sun.reflect.NativeMethodAccessorImpl.invoke0(Native Method)
	at sun.reflect.NativeMethodAccessorImpl.invoke(NativeMethodAccessorImpl.java:39)
	at sun.reflect.DelegatingMethodAccessorImpl.invoke(DelegatingMethodAccessorImpl.java:25)
	at java.lang.reflect.Method.invoke(Method.java:597)
	at org.codehaus.plexus.classworlds.launcher.Launcher.launchStandard(Launcher.java:329)
	at org.codehaus.plexus.classworlds.launcher.Launcher.launch(Launcher.java:239)
	at org.jvnet.hudson.maven3.agent.Maven3Main.launch(Maven3Main.java:158)
	at hudson.maven.Maven3Builder.call(Maven3Builder.java:98)
	at hudson.maven.Maven3Builder.call(Maven3Builder.java:64)
	at hudson.remoting.UserRequest.perform(UserRequest.java:118)
	at hudson.remoting.UserRequest.perform(UserRequest.java:48)
	at hudson.remoting.Request$2.run(Request.java:326)
	at hudson.remoting.InterceptingExecutorService$1.call(InterceptingExecutorService.java:72)
	at java.util.concurrent.FutureTask$Sync.innerRun(FutureTask.java:303)
	at java.util.concurrent.FutureTask.run(FutureTask.java:138)
	at java.util.concurrent.ThreadPoolExecutor$Worker.runTask(ThreadPoolExecutor.java:886)
	at java.util.concurrent.ThreadPoolExecutor$Worker.run(ThreadPoolExecutor.java:908)
	at java.lang.Thread.run(Thread.java:662)
Caused by: org.apache.maven.plugin.MojoFailureException: There are test failures.

Please refer to <https://builds.apache.org/job/mahout-nightly/ws/trunk/core/target/surefire-reports>
for the individual test results.
	at org.apache.maven.plugin.surefire.SurefireHelper.reportExecution(SurefireHelper.java:83)
	at org.apache.maven.plugin.surefire.SurefirePlugin.writeSummary(SurefirePlugin.java:673)
	at org.apache.maven.plugin.surefire.SurefirePlugin.handleSummary(SurefirePlugin.java:647)
	at org.apache.maven.plugin.surefire.AbstractSurefireMojo.executeAfterPreconditionsChecked(AbstractSurefireMojo.java:137)
	at org.apache.maven.plugin.surefire.AbstractSurefireMojo.execute(AbstractSurefireMojo.java:98)
	at org.apache.maven.plugin.DefaultBuildPluginManager.executeMojo(DefaultBuildPluginManager.java:101)
	at org.apache.maven.lifecycle.internal.MojoExecutor.execute(MojoExecutor.java:209)
	... 27 more
Sending e-mails to: dev@mahout.apache.org srowen@gmail.com
channel stopped

Mime
View raw message