mahout-dev mailing list archives

Site index · List index
Message view « Date » · « Thread »
Top « Date » · « Thread »
From Apache Jenkins Server <jenk...@builds.apache.org>
Subject Build failed in Jenkins: Mahout-Quality #1297
Date Sun, 08 Jan 2012 23:04:21 GMT
See <https://builds.apache.org/job/Mahout-Quality/1297/>

------------------------------------------
[...truncated 33253 lines...]
Tests run: 4, Failures: 0, Errors: 0, Skipped: 0, Time elapsed: 0.002 sec
Running org.apache.mahout.cf.taste.common.TopKMinKTest
Tests run: 6, Failures: 0, Errors: 0, Skipped: 0, Time elapsed: 0.36 sec
Running org.apache.mahout.cf.taste.common.CommonTest
Tests run: 3, Failures: 0, Errors: 0, Skipped: 0, Time elapsed: 0.003 sec
Running org.apache.mahout.cf.taste.hadoop.item.ToUserVectorsReducerTest
Tests run: 2, Failures: 0, Errors: 0, Skipped: 0, Time elapsed: 0.018 sec
Running org.apache.mahout.cf.taste.hadoop.item.RecommenderJobTest
Tests run: 21, Failures: 0, Errors: 0, Skipped: 0, Time elapsed: 229.761 sec
Running org.apache.mahout.cf.taste.hadoop.similarity.item.ItemSimilarityJobTest
Tests run: 4, Failures: 0, Errors: 0, Skipped: 0, Time elapsed: 98.34 sec
Running org.apache.mahout.cf.taste.hadoop.als.ParallelALSFactorizationJobTest
Tests run: 2, Failures: 0, Errors: 0, Skipped: 0, Time elapsed: 122.601 sec
Running org.apache.mahout.cf.taste.impl.common.RefreshHelperTest
Tests run: 4, Failures: 0, Errors: 0, Skipped: 0, Time elapsed: 0.004 sec
Running org.apache.mahout.cf.taste.impl.common.InvertedRunningAverageTest
Tests run: 8, Failures: 0, Errors: 0, Skipped: 0, Time elapsed: 0.003 sec
Running org.apache.mahout.cf.taste.impl.common.CacheTest
Tests run: 2, Failures: 0, Errors: 0, Skipped: 0, Time elapsed: 0.706 sec
Running org.apache.mahout.cf.taste.impl.common.RunningAverageTest
Tests run: 2, Failures: 0, Errors: 0, Skipped: 0, Time elapsed: 0.001 sec
Running org.apache.mahout.cf.taste.impl.common.FastMapTest
Tests run: 14, Failures: 0, Errors: 0, Skipped: 0, Time elapsed: 0.318 sec
Running org.apache.mahout.cf.taste.impl.common.BitSetTest
Tests run: 5, Failures: 0, Errors: 0, Skipped: 0, Time elapsed: 0.002 sec
Running org.apache.mahout.cf.taste.impl.common.FastByIDMapTest
Tests run: 9, Failures: 0, Errors: 0, Skipped: 0, Time elapsed: 0.282 sec
Running org.apache.mahout.cf.taste.impl.common.LongPrimitiveArrayIteratorTest
Tests run: 3, Failures: 0, Errors: 0, Skipped: 0, Time elapsed: 0.002 sec
Running org.apache.mahout.cf.taste.impl.common.WeightedRunningAverageTest
Tests run: 2, Failures: 0, Errors: 0, Skipped: 0, Time elapsed: 0.002 sec
Running org.apache.mahout.cf.taste.impl.common.RunningAverageAndStdDevTest
Tests run: 3, Failures: 0, Errors: 0, Skipped: 0, Time elapsed: 0.027 sec
Running org.apache.mahout.cf.taste.impl.common.FastIDSetTest
Tests run: 10, Failures: 0, Errors: 0, Skipped: 0, Time elapsed: 0.263 sec
Running org.apache.mahout.cf.taste.impl.common.SamplingLongPrimitiveIteratorTest
Tests run: 3, Failures: 0, Errors: 0, Skipped: 0, Time elapsed: 0.002 sec
Running org.apache.mahout.cf.taste.impl.model.BooleanUserPreferenceArrayTest
Tests run: 6, Failures: 0, Errors: 0, Skipped: 0, Time elapsed: 0.004 sec
Running org.apache.mahout.cf.taste.impl.model.BooleanItemPreferenceArrayTest
Tests run: 6, Failures: 0, Errors: 0, Skipped: 0, Time elapsed: 0.003 sec
Running org.apache.mahout.cf.taste.impl.model.GenericDataModelTest
Tests run: 1, Failures: 0, Errors: 0, Skipped: 0, Time elapsed: 0.013 sec
Running org.apache.mahout.cf.taste.impl.model.GenericUserPreferenceArrayTest
Tests run: 7, Failures: 0, Errors: 0, Skipped: 0, Time elapsed: 0.003 sec
Running org.apache.mahout.cf.taste.impl.model.MemoryIDMigratorTest
Tests run: 3, Failures: 0, Errors: 0, Skipped: 0, Time elapsed: 0.003 sec
Running org.apache.mahout.cf.taste.impl.model.GenericItemPreferenceArrayTest
Tests run: 7, Failures: 0, Errors: 0, Skipped: 0, Time elapsed: 0.004 sec
Running org.apache.mahout.cf.taste.impl.model.file.FileDataModelTest
Tests run: 10, Failures: 0, Errors: 0, Skipped: 0, Time elapsed: 3.085 sec
Running org.apache.mahout.cf.taste.impl.model.file.FileIDMigratorTest
Tests run: 3, Failures: 0, Errors: 0, Skipped: 0, Time elapsed: 4.006 sec
Running org.apache.mahout.cf.taste.impl.eval.AverageAbsoluteDifferenceRecommenderEvaluatorTest
Tests run: 1, Failures: 0, Errors: 0, Skipped: 0, Time elapsed: 0.011 sec
Running org.apache.mahout.cf.taste.impl.eval.RMSRecommenderEvaluatorTest
Tests run: 1, Failures: 0, Errors: 0, Skipped: 0, Time elapsed: 0.005 sec
Running org.apache.mahout.cf.taste.impl.eval.GenericRecommenderIRStatsEvaluatorImplTest
Tests run: 1, Failures: 0, Errors: 0, Skipped: 0, Time elapsed: 0.008 sec
Running org.apache.mahout.cf.taste.impl.recommender.SamplingCandidateItemsStrategyTest
Tests run: 1, Failures: 0, Errors: 0, Skipped: 0, Time elapsed: 0.003 sec
Running org.apache.mahout.cf.taste.impl.recommender.GenericItemBasedRecommenderTest
Tests run: 11, Failures: 0, Errors: 0, Skipped: 0, Time elapsed: 0.022 sec
Running org.apache.mahout.cf.taste.impl.recommender.ItemAverageRecommenderTest
Tests run: 1, Failures: 0, Errors: 0, Skipped: 0, Time elapsed: 0.003 sec
Running org.apache.mahout.cf.taste.impl.recommender.svd.SVDRecommenderTest
Tests run: 2, Failures: 0, Errors: 0, Skipped: 0, Time elapsed: 0.015 sec
Running org.apache.mahout.cf.taste.impl.recommender.svd.ALSWRFactorizerTest
Tests run: 5, Failures: 0, Errors: 0, Skipped: 0, Time elapsed: 0.032 sec
Running org.apache.mahout.cf.taste.impl.recommender.svd.FilePersistenceStrategyTest
Tests run: 1, Failures: 0, Errors: 0, Skipped: 0, Time elapsed: 0.003 sec
Running org.apache.mahout.cf.taste.impl.recommender.TopItemsTest
Tests run: 7, Failures: 0, Errors: 0, Skipped: 0, Time elapsed: 0.006 sec
Running org.apache.mahout.cf.taste.impl.recommender.TreeClusteringRecommenderTest
Tests run: 5, Failures: 0, Errors: 0, Skipped: 0, Time elapsed: 0.012 sec
Running org.apache.mahout.cf.taste.impl.recommender.NullRescorerTest
Tests run: 2, Failures: 0, Errors: 0, Skipped: 0, Time elapsed: 0.002 sec
Running org.apache.mahout.cf.taste.impl.recommender.GenericUserBasedRecommenderTest
Tests run: 7, Failures: 0, Errors: 0, Skipped: 0, Time elapsed: 0.006 sec
Running org.apache.mahout.cf.taste.impl.recommender.knn.KnnItemBasedRecommenderTest
Tests run: 5, Failures: 0, Errors: 0, Skipped: 0, Time elapsed: 0.007 sec
Running org.apache.mahout.cf.taste.impl.recommender.ItemUserAverageRecommenderTest
Tests run: 1, Failures: 0, Errors: 0, Skipped: 0, Time elapsed: 0.002 sec
Running org.apache.mahout.cf.taste.impl.recommender.RandomRecommenderTest
Tests run: 1, Failures: 0, Errors: 0, Skipped: 0, Time elapsed: 0.002 sec
Running org.apache.mahout.cf.taste.impl.recommender.AllUnknownItemsCandidateItemsStrategyTest
Tests run: 1, Failures: 0, Errors: 0, Skipped: 0, Time elapsed: 0.002 sec
Running org.apache.mahout.cf.taste.impl.recommender.slopeone.SlopeOneRecommenderTest
Tests run: 6, Failures: 0, Errors: 0, Skipped: 0, Time elapsed: 0.007 sec
Running org.apache.mahout.cf.taste.impl.recommender.slopeone.MemoryDiffStorageTest
Tests run: 9, Failures: 0, Errors: 0, Skipped: 0, Time elapsed: 0.008 sec
Running org.apache.mahout.cf.taste.impl.recommender.CachingRecommenderTest
Tests run: 1, Failures: 0, Errors: 0, Skipped: 0, Time elapsed: 0.005 sec
Running org.apache.mahout.cf.taste.impl.recommender.PreferredItemsNeighborhoodCandidateItemsStrategyTest
Tests run: 1, Failures: 0, Errors: 0, Skipped: 0, Time elapsed: 0.001 sec
Running org.apache.mahout.cf.taste.impl.neighborhood.NearestNNeighborhoodTest
Tests run: 1, Failures: 0, Errors: 0, Skipped: 0, Time elapsed: 0.001 sec
Running org.apache.mahout.cf.taste.impl.neighborhood.ThresholdNeighborhoodTest
Tests run: 1, Failures: 0, Errors: 0, Skipped: 0, Time elapsed: 0.002 sec
Running org.apache.mahout.cf.taste.impl.similarity.AveragingPreferenceInferrerTest
Tests run: 1, Failures: 0, Errors: 0, Skipped: 0, Time elapsed: 0.002 sec
Running org.apache.mahout.cf.taste.impl.similarity.SpearmanCorrelationSimilarityTest
Tests run: 5, Failures: 0, Errors: 0, Skipped: 0, Time elapsed: 0.004 sec
Running org.apache.mahout.cf.taste.impl.similarity.GenericItemSimilarityTest
Tests run: 4, Failures: 0, Errors: 0, Skipped: 0, Time elapsed: 0.003 sec
Running org.apache.mahout.cf.taste.impl.similarity.PearsonCorrelationSimilarityTest
Tests run: 18, Failures: 0, Errors: 0, Skipped: 0, Time elapsed: 0.011 sec
Running org.apache.mahout.cf.taste.impl.similarity.LogLikelihoodSimilarityTest
Tests run: 3, Failures: 0, Errors: 0, Skipped: 0, Time elapsed: 0.003 sec
Running org.apache.mahout.cf.taste.impl.similarity.file.FileItemSimilarityTest
Tests run: 6, Failures: 0, Errors: 0, Skipped: 0, Time elapsed: 4.008 sec
Running org.apache.mahout.cf.taste.impl.similarity.EuclideanDistanceSimilarityTest
Tests run: 17, Failures: 0, Errors: 0, Skipped: 0, Time elapsed: 0.013 sec
Running org.apache.mahout.cf.taste.impl.similarity.TanimotoCoefficientSimilarityTest
Tests run: 8, Failures: 0, Errors: 0, Skipped: 0, Time elapsed: 0.006 sec
Running org.apache.mahout.cf.taste.impl.transforms.InverseUserFrequencyTest
Tests run: 1, Failures: 0, Errors: 0, Skipped: 0, Time elapsed: 0.003 sec
Running org.apache.mahout.cf.taste.impl.transforms.CaseAmplificationTest
Tests run: 2, Failures: 0, Errors: 0, Skipped: 0, Time elapsed: 0.002 sec
Running org.apache.mahout.cf.taste.impl.transforms.ZScoreTest
Tests run: 4, Failures: 0, Errors: 0, Skipped: 0, Time elapsed: 0.004 sec
Running org.apache.mahout.driver.MahoutDriverTest
Tests run: 1, Failures: 0, Errors: 0, Skipped: 0, Time elapsed: 0.044 sec
Running org.apache.mahout.clustering.canopy.TestCanopyCreation
Tests run: 17, Failures: 0, Errors: 0, Skipped: 0, Time elapsed: 54.381 sec
Running org.apache.mahout.clustering.topdown.postprocessor.ClusterCountReaderTest
Tests run: 1, Failures: 0, Errors: 0, Skipped: 0, Time elapsed: 0.039 sec
Running org.apache.mahout.clustering.topdown.postprocessor.ClusterOutputPostProcessorTest
Tests run: 1, Failures: 0, Errors: 0, Skipped: 0, Time elapsed: 0.058 sec
Running org.apache.mahout.clustering.topdown.PathDirectoryTest
Tests run: 5, Failures: 0, Errors: 0, Skipped: 0, Time elapsed: 0.002 sec
Running org.apache.mahout.clustering.fuzzykmeans.TestFuzzyKmeansClustering
Tests run: 8, Failures: 0, Errors: 0, Skipped: 0, Time elapsed: 163.424 sec
Running org.apache.mahout.clustering.minhash.TestMinHashClustering
Tests run: 4, Failures: 0, Errors: 0, Skipped: 0, Time elapsed: 28.165 sec
Running org.apache.mahout.clustering.spectral.common.TestAffinityMatrixInputJob
Tests run: 2, Failures: 0, Errors: 0, Skipped: 0, Time elapsed: 0.012 sec
Running org.apache.mahout.clustering.spectral.common.TestVectorMatrixMultiplicationJob
Tests run: 1, Failures: 0, Errors: 0, Skipped: 0, Time elapsed: 0.007 sec
Running org.apache.mahout.clustering.spectral.common.TestUnitVectorizerJob
Tests run: 1, Failures: 0, Errors: 0, Skipped: 0, Time elapsed: 0.006 sec
Running org.apache.mahout.clustering.spectral.common.TestMatrixDiagonalizeJob
Tests run: 2, Failures: 0, Errors: 0, Skipped: 0, Time elapsed: 0.012 sec
Running org.apache.mahout.clustering.spectral.common.TestVectorCache
Tests run: 3, Failures: 0, Errors: 0, Skipped: 0, Time elapsed: 0.036 sec
Running org.apache.mahout.clustering.spectral.eigencuts.TestEigencutsSensitivityJob
Tests run: 2, Failures: 0, Errors: 0, Skipped: 0, Time elapsed: 0.012 sec
Running org.apache.mahout.clustering.spectral.eigencuts.TestEigencutsAffinityCutsJob
Tests run: 3, Failures: 0, Errors: 0, Skipped: 0, Time elapsed: 0.018 sec
Running org.apache.mahout.clustering.TestClusterClassifier
Tests run: 13, Failures: 0, Errors: 0, Skipped: 0, Time elapsed: 0.113 sec
Running org.apache.mahout.clustering.TestClusterInterface
Tests run: 12, Failures: 0, Errors: 0, Skipped: 0, Time elapsed: 0.005 sec
Running org.apache.mahout.clustering.TestGaussianAccumulators
Tests run: 6, Failures: 0, Errors: 0, Skipped: 0, Time elapsed: 0.808 sec
Running org.apache.mahout.clustering.meanshift.TestMeanShift
Tests run: 8, Failures: 0, Errors: 0, Skipped: 0, Time elapsed: 76.496 sec
Running org.apache.mahout.clustering.lda.TestMapReduce
Tests run: 2, Failures: 0, Errors: 0, Skipped: 1, Time elapsed: 0.14 sec
Running org.apache.mahout.clustering.lda.TestLDAInference
Tests run: 3, Failures: 0, Errors: 0, Skipped: 0, Time elapsed: 0.184 sec
Running org.apache.mahout.clustering.lda.cvb.TestCVBModelTrainer
Tests run: 2, Failures: 0, Errors: 0, Skipped: 0, Time elapsed: 233.214 sec
Running org.apache.mahout.clustering.kmeans.TestRandomSeedGenerator
Tests run: 1, Failures: 0, Errors: 0, Skipped: 0, Time elapsed: 0.019 sec
Running org.apache.mahout.clustering.kmeans.TestKmeansClustering
Tests run: 8, Failures: 0, Errors: 0, Skipped: 0, Time elapsed: 243.978 sec
Running org.apache.mahout.clustering.dirichlet.TestDistributions
Tests run: 9, Failures: 0, Errors: 0, Skipped: 0, Time elapsed: 0.024 sec
Running org.apache.mahout.clustering.dirichlet.TestDirichletClustering
Tests run: 3, Failures: 0, Errors: 0, Skipped: 0, Time elapsed: 0.15 sec
Running org.apache.mahout.clustering.dirichlet.TestMapReduce
Tests run: 8, Failures: 0, Errors: 0, Skipped: 0, Time elapsed: 127.268 sec
Running org.apache.mahout.vectorizer.DictionaryVectorizerTest
Tests run: 4, Failures: 0, Errors: 0, Skipped: 0, Time elapsed: 185.177 sec
Running org.apache.mahout.vectorizer.collocations.llr.GramKeyTest
Tests run: 2, Failures: 0, Errors: 0, Skipped: 0, Time elapsed: 0.005 sec
Running org.apache.mahout.vectorizer.collocations.llr.CollocReducerTest
Tests run: 1, Failures: 0, Errors: 0, Skipped: 0, Time elapsed: 0.003 sec
Running org.apache.mahout.vectorizer.collocations.llr.LLRReducerTest
Tests run: 1, Failures: 0, Errors: 0, Skipped: 0, Time elapsed: 0.011 sec
Running org.apache.mahout.vectorizer.collocations.llr.CollocMapperTest
Tests run: 2, Failures: 0, Errors: 0, Skipped: 0, Time elapsed: 0.026 sec
Running org.apache.mahout.vectorizer.collocations.llr.GramKeyPartitionerTest
Tests run: 1, Failures: 0, Errors: 0, Skipped: 0, Time elapsed: 0.002 sec
Running org.apache.mahout.vectorizer.collocations.llr.GramTest
Tests run: 7, Failures: 0, Errors: 0, Skipped: 0, Time elapsed: 0.007 sec
Running org.apache.mahout.vectorizer.collocations.llr.GramKeyGroupComparatorTest
Tests run: 1, Failures: 0, Errors: 0, Skipped: 0, Time elapsed: 0.002 sec
Running org.apache.mahout.vectorizer.encoders.WordLikeValueEncoderTest
Tests run: 4, Failures: 0, Errors: 0, Skipped: 0, Time elapsed: 0.009 sec
Running org.apache.mahout.vectorizer.encoders.InteractionValueEncoderTest
Tests run: 3, Failures: 0, Errors: 0, Skipped: 0, Time elapsed: 0.005 sec
Running org.apache.mahout.vectorizer.encoders.ContinuousValueEncoderTest
Tests run: 2, Failures: 0, Errors: 0, Skipped: 0, Time elapsed: 0.003 sec
Running org.apache.mahout.vectorizer.encoders.TextValueEncoderTest
Tests run: 3, Failures: 0, Errors: 0, Skipped: 0, Time elapsed: 0.035 sec
Running org.apache.mahout.vectorizer.encoders.ConstantValueEncoderTest
Tests run: 2, Failures: 0, Errors: 0, Skipped: 0, Time elapsed: 0.003 sec
Running org.apache.mahout.vectorizer.DocumentProcessorTest
Tests run: 1, Failures: 0, Errors: 0, Skipped: 0, Time elapsed: 4.039 sec
Running org.apache.mahout.vectorizer.EncodedVectorsFromSequenceFilesTest
Tests run: 4, Failures: 0, Errors: 0, Skipped: 0, Time elapsed: 16.218 sec
Running org.apache.mahout.vectorizer.HighDFWordsPrunerTest
Tests run: 2, Failures: 0, Errors: 0, Skipped: 0, Time elapsed: 113.535 sec
Running org.apache.mahout.vectorizer.SparseVectorsFromSequenceFilesTest
Tests run: 5, Failures: 0, Errors: 0, Skipped: 0, Time elapsed: 252.233 sec
Running org.apache.mahout.fpm.pfpgrowth.PFPGrowthRetailDataTest
Tests run: 1, Failures: 0, Errors: 0, Skipped: 0, Time elapsed: 87.027 sec
Running org.apache.mahout.fpm.pfpgrowth.PFPGrowthTest
Tests run: 1, Failures: 0, Errors: 0, Skipped: 0, Time elapsed: 28.296 sec
Running org.apache.mahout.fpm.pfpgrowth.fpgrowth.FrequentPatternMaxHeapTest
Tests run: 1, Failures: 0, Errors: 0, Skipped: 0, Time elapsed: 0.059 sec
Running org.apache.mahout.fpm.pfpgrowth.FPGrowthTest
Tests run: 4, Failures: 0, Errors: 0, Skipped: 0, Time elapsed: 0.038 sec
Running org.apache.mahout.fpm.pfpgrowth.FPGrowthRetailDataTest
Tests run: 1, Failures: 0, Errors: 0, Skipped: 0, Time elapsed: 1.304 sec
Running org.apache.mahout.fpm.pfpgrowth.TransactionTreeTest
Tests run: 1, Failures: 0, Errors: 0, Skipped: 0, Time elapsed: 4.481 sec

Results :

Failed tests: 
  testSingularValues(org.apache.mahout.math.ssvd.SequentialOutOfCoreSvdTest): expected:<0.0>
but was:<3723400.0000000102>

Tests run: 681, Failures: 1, Errors: 0, Skipped: 1

[INFO] ------------------------------------------------------------------------
[ERROR] BUILD FAILURE
[INFO] ------------------------------------------------------------------------
[INFO] There are test failures.

Please refer to <https://builds.apache.org/job/Mahout-Quality/1297/artifact/trunk/core/target/surefire-reports>
for the individual test results.
[INFO] ------------------------------------------------------------------------
[INFO] For more information, run Maven with the -e switch
[INFO] ------------------------------------------------------------------------
[INFO] Total time: 55 minutes 4 seconds
[INFO] Finished at: Sun Jan 08 23:03:49 UTC 2012
[INFO] Final Memory: 98M/397M
[INFO] ------------------------------------------------------------------------
Build step 'Invoke top-level Maven targets' marked build as failure
[FINDBUGS] Skipping publisher since build result is FAILURE
[PMD] Skipping publisher since build result is FAILURE
[TASKS] Skipping publisher since build result is FAILURE
Archiving artifacts
Recording test results
Publishing Javadoc
Publishing Clover coverage report...
No Clover report will be published due to a Build Failure


Mime
View raw message