mahout-dev mailing list archives

Site index · List index
Message view « Date » · « Thread »
Top « Date » · « Thread »
From Apache Jenkins Server <jenk...@builds.apache.org>
Subject Build failed in Jenkins: Mahout-Quality #1307
Date Sun, 15 Jan 2012 17:58:56 GMT
See <https://builds.apache.org/job/Mahout-Quality/1307/changes>

Changes:

[robinanil] MAHOUT-890 MAHOUT-920 MAHOUT-921 MAHOUT-927 FpGrowth2 Implementation and fixes
to existing Mapreduce classes in pfpgrowth

------------------------------------------
[...truncated 33145 lines...]
Tests run: 17, Failures: 0, Errors: 0, Skipped: 0, Time elapsed: 0.015 sec
Running org.apache.mahout.cf.taste.impl.similarity.PearsonCorrelationSimilarityTest
Tests run: 18, Failures: 0, Errors: 0, Skipped: 0, Time elapsed: 0.013 sec
Running org.apache.mahout.cf.taste.impl.model.MemoryIDMigratorTest
Tests run: 3, Failures: 0, Errors: 0, Skipped: 0, Time elapsed: 0.003 sec
Running org.apache.mahout.cf.taste.impl.model.GenericDataModelTest
Tests run: 1, Failures: 0, Errors: 0, Skipped: 0, Time elapsed: 0.009 sec
Running org.apache.mahout.cf.taste.impl.model.BooleanUserPreferenceArrayTest
Tests run: 6, Failures: 0, Errors: 0, Skipped: 0, Time elapsed: 0.005 sec
Running org.apache.mahout.cf.taste.impl.model.BooleanItemPreferenceArrayTest
Tests run: 6, Failures: 0, Errors: 0, Skipped: 0, Time elapsed: 0.004 sec
Running org.apache.mahout.cf.taste.impl.model.file.FileIDMigratorTest
Tests run: 3, Failures: 0, Errors: 0, Skipped: 0, Time elapsed: 4.056 sec
Running org.apache.mahout.cf.taste.impl.model.file.FileDataModelTest
Tests run: 10, Failures: 0, Errors: 0, Skipped: 0, Time elapsed: 3.13 sec
Running org.apache.mahout.cf.taste.impl.model.GenericUserPreferenceArrayTest
Tests run: 7, Failures: 0, Errors: 0, Skipped: 0, Time elapsed: 0.004 sec
Running org.apache.mahout.cf.taste.impl.model.GenericItemPreferenceArrayTest
Tests run: 7, Failures: 0, Errors: 0, Skipped: 0, Time elapsed: 0.005 sec
Running org.apache.mahout.cf.taste.impl.neighborhood.ThresholdNeighborhoodTest
Tests run: 1, Failures: 0, Errors: 0, Skipped: 0, Time elapsed: 0.003 sec
Running org.apache.mahout.cf.taste.impl.neighborhood.NearestNNeighborhoodTest
Tests run: 1, Failures: 0, Errors: 0, Skipped: 0, Time elapsed: 0.001 sec
Running org.apache.mahout.cf.taste.impl.transforms.CaseAmplificationTest
Tests run: 2, Failures: 0, Errors: 0, Skipped: 0, Time elapsed: 0.002 sec
Running org.apache.mahout.cf.taste.impl.transforms.InverseUserFrequencyTest
Tests run: 1, Failures: 0, Errors: 0, Skipped: 0, Time elapsed: 0.003 sec
Running org.apache.mahout.cf.taste.impl.transforms.ZScoreTest
Tests run: 4, Failures: 0, Errors: 0, Skipped: 0, Time elapsed: 0.005 sec
Running org.apache.mahout.common.iterator.CountingIteratorTest
Tests run: 2, Failures: 0, Errors: 0, Skipped: 0, Time elapsed: 0.002 sec
Running org.apache.mahout.common.iterator.TestSamplingIterator
Tests run: 5, Failures: 0, Errors: 0, Skipped: 0, Time elapsed: 0.037 sec
Running org.apache.mahout.common.iterator.TestFixedSizeSampler
Tests run: 5, Failures: 0, Errors: 0, Skipped: 0, Time elapsed: 0.015 sec
Running org.apache.mahout.common.iterator.TestStableFixedSizeSampler
Tests run: 5, Failures: 0, Errors: 0, Skipped: 0, Time elapsed: 0.016 sec
Running org.apache.mahout.common.AbstractJobTest
Tests run: 3, Failures: 0, Errors: 0, Skipped: 0, Time elapsed: 0.11 sec
Running org.apache.mahout.common.IntPairWritableTest
Tests run: 3, Failures: 0, Errors: 0, Skipped: 0, Time elapsed: 0.01 sec
Running org.apache.mahout.common.distance.TestWeightedEuclideanDistanceMeasureTest
Tests run: 2, Failures: 0, Errors: 0, Skipped: 0, Time elapsed: 0.009 sec
Running org.apache.mahout.common.distance.TestChebyshevMeasure
Tests run: 1, Failures: 0, Errors: 0, Skipped: 0, Time elapsed: 0.004 sec
Running org.apache.mahout.common.distance.TestWeightedManhattanDistanceMeasure
Tests run: 2, Failures: 0, Errors: 0, Skipped: 0, Time elapsed: 0.008 sec
Running org.apache.mahout.common.distance.TestEuclideanDistanceMeasure
Tests run: 1, Failures: 0, Errors: 0, Skipped: 0, Time elapsed: 0.005 sec
Running org.apache.mahout.common.distance.CosineDistanceMeasureTest
Tests run: 1, Failures: 0, Errors: 0, Skipped: 0, Time elapsed: 0.004 sec
Running org.apache.mahout.common.distance.TestTanimotoDistanceMeasure
Tests run: 2, Failures: 0, Errors: 0, Skipped: 0, Time elapsed: 0.009 sec
Running org.apache.mahout.common.distance.TestMinkowskiMeasure
Tests run: 1, Failures: 0, Errors: 0, Skipped: 0, Time elapsed: 0.004 sec
Running org.apache.mahout.common.distance.TestManhattanDistanceMeasure
Tests run: 1, Failures: 0, Errors: 0, Skipped: 0, Time elapsed: 0.005 sec
Running org.apache.mahout.common.distance.TestMahalanobisDistanceMeasure
Tests run: 1, Failures: 0, Errors: 0, Skipped: 0, Time elapsed: 0.004 sec
Running org.apache.mahout.common.StringUtilsTest
Tests run: 2, Failures: 0, Errors: 0, Skipped: 0, Time elapsed: 0.142 sec
Running org.apache.mahout.clustering.meanshift.TestMeanShift
Tests run: 8, Failures: 0, Errors: 0, Skipped: 0, Time elapsed: 76.661 sec
Running org.apache.mahout.clustering.lda.TestMapReduce
Tests run: 2, Failures: 0, Errors: 0, Skipped: 1, Time elapsed: 0.126 sec
Running org.apache.mahout.clustering.lda.cvb.TestCVBModelTrainer
Tests run: 2, Failures: 0, Errors: 0, Skipped: 0, Time elapsed: 233.142 sec
Running org.apache.mahout.clustering.lda.TestLDAInference
Tests run: 3, Failures: 0, Errors: 0, Skipped: 0, Time elapsed: 0.189 sec
Running org.apache.mahout.clustering.spectral.eigencuts.TestEigencutsSensitivityJob
Tests run: 2, Failures: 0, Errors: 0, Skipped: 0, Time elapsed: 0.013 sec
Running org.apache.mahout.clustering.spectral.eigencuts.TestEigencutsAffinityCutsJob
Tests run: 3, Failures: 0, Errors: 0, Skipped: 0, Time elapsed: 0.021 sec
Running org.apache.mahout.clustering.spectral.common.TestAffinityMatrixInputJob
Tests run: 2, Failures: 0, Errors: 0, Skipped: 0, Time elapsed: 0.016 sec
Running org.apache.mahout.clustering.spectral.common.TestVectorMatrixMultiplicationJob
Tests run: 1, Failures: 0, Errors: 0, Skipped: 0, Time elapsed: 0.007 sec
Running org.apache.mahout.clustering.spectral.common.TestMatrixDiagonalizeJob
Tests run: 2, Failures: 0, Errors: 0, Skipped: 0, Time elapsed: 0.013 sec
Running org.apache.mahout.clustering.spectral.common.TestVectorCache
Tests run: 3, Failures: 0, Errors: 0, Skipped: 0, Time elapsed: 0.039 sec
Running org.apache.mahout.clustering.spectral.common.TestUnitVectorizerJob
Tests run: 1, Failures: 0, Errors: 0, Skipped: 0, Time elapsed: 0.007 sec
Running org.apache.mahout.clustering.TestClusterInterface
Tests run: 12, Failures: 0, Errors: 0, Skipped: 0, Time elapsed: 0.018 sec
Running org.apache.mahout.clustering.fuzzykmeans.TestFuzzyKmeansClustering
Tests run: 8, Failures: 0, Errors: 0, Skipped: 0, Time elapsed: 163.287 sec
Running org.apache.mahout.clustering.kmeans.TestRandomSeedGenerator
Tests run: 1, Failures: 0, Errors: 0, Skipped: 0, Time elapsed: 0.018 sec
Running org.apache.mahout.clustering.kmeans.TestKmeansClustering
Tests run: 8, Failures: 0, Errors: 0, Skipped: 0, Time elapsed: 243.962 sec
Running org.apache.mahout.clustering.topdown.postprocessor.ClusterCountReaderTest
Tests run: 1, Failures: 0, Errors: 0, Skipped: 0, Time elapsed: 0.041 sec
Running org.apache.mahout.clustering.topdown.postprocessor.ClusterOutputPostProcessorTest
Tests run: 1, Failures: 0, Errors: 0, Skipped: 0, Time elapsed: 0.06 sec
Running org.apache.mahout.clustering.topdown.PathDirectoryTest
Tests run: 5, Failures: 0, Errors: 0, Skipped: 0, Time elapsed: 0.006 sec
Running org.apache.mahout.clustering.TestClusterClassifier
Tests run: 13, Failures: 0, Errors: 0, Skipped: 0, Time elapsed: 0.108 sec
Running org.apache.mahout.clustering.dirichlet.TestDistributions
Tests run: 9, Failures: 0, Errors: 0, Skipped: 0, Time elapsed: 0.023 sec
Running org.apache.mahout.clustering.dirichlet.TestMapReduce
Tests run: 8, Failures: 0, Errors: 0, Skipped: 0, Time elapsed: 127.376 sec
Running org.apache.mahout.clustering.dirichlet.TestDirichletClustering
Tests run: 3, Failures: 0, Errors: 0, Skipped: 0, Time elapsed: 0.091 sec
Running org.apache.mahout.clustering.minhash.TestMinHashClustering
Tests run: 4, Failures: 0, Errors: 0, Skipped: 0, Time elapsed: 28.171 sec
Running org.apache.mahout.clustering.canopy.TestCanopyCreation
Tests run: 17, Failures: 0, Errors: 0, Skipped: 0, Time elapsed: 54.358 sec
Running org.apache.mahout.clustering.TestGaussianAccumulators
Tests run: 6, Failures: 0, Errors: 0, Skipped: 0, Time elapsed: 0.784 sec
Running org.apache.mahout.classifier.discriminative.WinnowTrainerTest
Tests run: 1, Failures: 0, Errors: 0, Skipped: 0, Time elapsed: 0.004 sec
Running org.apache.mahout.classifier.discriminative.PerceptronTrainerTest
Tests run: 1, Failures: 0, Errors: 0, Skipped: 0, Time elapsed: 0.002 sec
Running org.apache.mahout.classifier.discriminative.LinearModelTest
Tests run: 3, Failures: 0, Errors: 0, Skipped: 0, Time elapsed: 0.003 sec
Running org.apache.mahout.classifier.ConfusionMatrixTest
Tests run: 2, Failures: 0, Errors: 0, Skipped: 0, Time elapsed: 0.003 sec
Running org.apache.mahout.classifier.naivebayes.training.IndexInstancesMapperTest
Tests run: 2, Failures: 0, Errors: 0, Skipped: 0, Time elapsed: 0.004 sec
Running org.apache.mahout.classifier.naivebayes.training.ThetaMapperTest
Tests run: 1, Failures: 0, Errors: 0, Skipped: 0, Time elapsed: 0.009 sec
Running org.apache.mahout.classifier.naivebayes.training.WeightsMapperTest
Tests run: 1, Failures: 0, Errors: 0, Skipped: 0, Time elapsed: 0.002 sec
Running org.apache.mahout.classifier.naivebayes.ComplementaryNaiveBayesClassifierTest
Tests run: 1, Failures: 0, Errors: 0, Skipped: 0, Time elapsed: 0.002 sec
Running org.apache.mahout.classifier.naivebayes.NaiveBayesModelTest
Tests run: 1, Failures: 0, Errors: 0, Skipped: 0, Time elapsed: 0.001 sec
Running org.apache.mahout.classifier.naivebayes.StandardNaiveBayesClassifierTest
Tests run: 1, Failures: 0, Errors: 0, Skipped: 0, Time elapsed: 0.002 sec
Running org.apache.mahout.classifier.naivebayes.NaiveBayesTest
Tests run: 2, Failures: 0, Errors: 0, Skipped: 0, Time elapsed: 42.252 sec
Running org.apache.mahout.classifier.sequencelearning.hmm.HMMModelTest
Tests run: 1, Failures: 0, Errors: 0, Skipped: 0, Time elapsed: 0.01 sec
Running org.apache.mahout.classifier.sequencelearning.hmm.HMMEvaluatorTest
Tests run: 2, Failures: 0, Errors: 0, Skipped: 0, Time elapsed: 0.004 sec
Running org.apache.mahout.classifier.sequencelearning.hmm.HMMUtilsTest
Tests run: 7, Failures: 0, Errors: 0, Skipped: 0, Time elapsed: 0.009 sec
Running org.apache.mahout.classifier.sequencelearning.hmm.HMMTrainerTest
Tests run: 4, Failures: 0, Errors: 0, Skipped: 0, Time elapsed: 0.013 sec
Running org.apache.mahout.classifier.sequencelearning.hmm.HMMAlgorithmsTest
Tests run: 6, Failures: 0, Errors: 0, Skipped: 0, Time elapsed: 0.008 sec
Running org.apache.mahout.classifier.evaluation.AucTest
Tests run: 3, Failures: 0, Errors: 0, Skipped: 0, Time elapsed: 0.258 sec
Running org.apache.mahout.classifier.df.data.DescriptorUtilsTest
Tests run: 2, Failures: 0, Errors: 0, Skipped: 0, Time elapsed: 0.005 sec
Running org.apache.mahout.classifier.df.data.DataConverterTest
Tests run: 1, Failures: 0, Errors: 0, Skipped: 0, Time elapsed: 0.055 sec
Running org.apache.mahout.classifier.df.data.DataLoaderTest
Tests run: 4, Failures: 0, Errors: 0, Skipped: 0, Time elapsed: 0.143 sec
Running org.apache.mahout.classifier.df.data.DatasetTest
Tests run: 1, Failures: 0, Errors: 0, Skipped: 0, Time elapsed: 0.006 sec
Running org.apache.mahout.classifier.df.data.DataTest
Tests run: 10, Failures: 0, Errors: 0, Skipped: 0, Time elapsed: 0.149 sec
Running org.apache.mahout.classifier.df.tools.VisualizerTest
Tests run: 3, Failures: 0, Errors: 0, Skipped: 0, Time elapsed: 0.012 sec
Running org.apache.mahout.classifier.df.node.NodeTest
Tests run: 3, Failures: 0, Errors: 0, Skipped: 0, Time elapsed: 0.005 sec
Running org.apache.mahout.classifier.df.mapreduce.partial.Step1MapperTest
Tests run: 1, Failures: 0, Errors: 0, Skipped: 0, Time elapsed: 0.037 sec
Running org.apache.mahout.classifier.df.mapreduce.partial.TreeIDTest
Tests run: 1, Failures: 0, Errors: 0, Skipped: 0, Time elapsed: 0.227 sec
Running org.apache.mahout.classifier.df.mapreduce.partial.PartialBuilderTest
Tests run: 2, Failures: 0, Errors: 0, Skipped: 0, Time elapsed: 0.02 sec
Running org.apache.mahout.classifier.df.mapreduce.inmem.InMemInputFormatTest
Tests run: 2, Failures: 0, Errors: 0, Skipped: 0, Time elapsed: 0.012 sec
Running org.apache.mahout.classifier.df.mapreduce.inmem.InMemInputSplitTest
Tests run: 2, Failures: 0, Errors: 0, Skipped: 0, Time elapsed: 0.003 sec
Running org.apache.mahout.classifier.df.builder.DecisionTreeBuilderTest
Tests run: 1, Failures: 0, Errors: 0, Skipped: 0, Time elapsed: 0.008 sec
Running org.apache.mahout.classifier.df.builder.DefaultTreeBuilderTest
Tests run: 1, Failures: 0, Errors: 0, Skipped: 0, Time elapsed: 0.005 sec
Running org.apache.mahout.classifier.df.builder.InfiniteRecursionTest
Tests run: 1, Failures: 0, Errors: 0, Skipped: 0, Time elapsed: 0.003 sec
Running org.apache.mahout.classifier.df.split.OptIgSplitTest
Tests run: 1, Failures: 0, Errors: 0, Skipped: 0, Time elapsed: 0.151 sec
Running org.apache.mahout.classifier.df.split.DefaultIgSplitTest
Tests run: 1, Failures: 0, Errors: 0, Skipped: 0, Time elapsed: 0.008 sec
Running org.apache.mahout.classifier.sgd.OnlineLogisticRegressionTest
Tests run: 4, Failures: 0, Errors: 0, Skipped: 0, Time elapsed: 3.257 sec
Running org.apache.mahout.classifier.sgd.CsvRecordFactoryTest
Tests run: 2, Failures: 0, Errors: 0, Skipped: 0, Time elapsed: 0.008 sec
Running org.apache.mahout.classifier.sgd.AdaptiveLogisticRegressionTest
Tests run: 5, Failures: 0, Errors: 0, Skipped: 0, Time elapsed: 5.565 sec
Running org.apache.mahout.classifier.sgd.GradientMachineTest
Tests run: 1, Failures: 0, Errors: 0, Skipped: 0, Time elapsed: 0.02 sec
Running org.apache.mahout.classifier.sgd.ModelSerializerTest
Tests run: 4, Failures: 0, Errors: 0, Skipped: 0, Time elapsed: 0.231 sec
Running org.apache.mahout.classifier.sgd.PassiveAggressiveTest
Tests run: 1, Failures: 0, Errors: 0, Skipped: 0, Time elapsed: 0.017 sec
Running org.apache.mahout.classifier.bayes.BayesClassifierTest
Tests run: 2, Failures: 0, Errors: 0, Skipped: 0, Time elapsed: 0.021 sec
Running org.apache.mahout.classifier.bayes.BayesFeatureMapReduceTest
Tests run: 4, Failures: 0, Errors: 0, Skipped: 0, Time elapsed: 0.111 sec
Running org.apache.mahout.classifier.bayes.BayesFileFormatterTest
Tests run: 2, Failures: 0, Errors: 0, Skipped: 0, Time elapsed: 0.022 sec
Running org.apache.mahout.classifier.bayes.CBayesClassifierTest
Tests run: 2, Failures: 0, Errors: 0, Skipped: 0, Time elapsed: 0.018 sec
Running org.apache.mahout.classifier.bayes.BayesFeatureMapperTest
Tests run: 1, Failures: 0, Errors: 0, Skipped: 0, Time elapsed: 0.022 sec
Running org.apache.mahout.classifier.bayes.BayesClassifierSelfTest
Tests run: 2, Failures: 0, Errors: 0, Skipped: 0, Time elapsed: 85.447 sec
Running org.apache.mahout.ga.watchmaker.EvalMapperTest
Tests run: 1, Failures: 0, Errors: 0, Skipped: 0, Time elapsed: 0.098 sec
Running org.apache.mahout.ga.watchmaker.STFitnessEvaluatorTest
Tests run: 2, Failures: 0, Errors: 0, Skipped: 0, Time elapsed: 0.015 sec
Running org.apache.mahout.ga.watchmaker.MahoutEvaluatorTest
Tests run: 2, Failures: 0, Errors: 0, Skipped: 0, Time elapsed: 7.118 sec
Running org.apache.mahout.graph.AdjacencyMatrixJobTest
Tests run: 2, Failures: 0, Errors: 0, Skipped: 0, Time elapsed: 14.072 sec
Running org.apache.mahout.graph.linkanalysis.PageRankJobTest
Tests run: 1, Failures: 0, Errors: 0, Skipped: 0, Time elapsed: 39.225 sec
Running org.apache.mahout.graph.linkanalysis.RandomWalkWithRestartJobTest
Tests run: 1, Failures: 0, Errors: 0, Skipped: 0, Time elapsed: 32.165 sec

Results :

Failed tests: 
  testSingularValues(org.apache.mahout.math.ssvd.SequentialOutOfCoreSvdTest): expected:<0.0>
but was:<8973428.0>

Tests run: 685, Failures: 1, Errors: 0, Skipped: 1

[INFO] ------------------------------------------------------------------------
[ERROR] BUILD FAILURE
[INFO] ------------------------------------------------------------------------
[INFO] There are test failures.

Please refer to <https://builds.apache.org/job/Mahout-Quality/1307/artifact/trunk/core/target/surefire-reports>
for the individual test results.
[INFO] ------------------------------------------------------------------------
[INFO] For more information, run Maven with the -e switch
[INFO] ------------------------------------------------------------------------
[INFO] Total time: 57 minutes 
[INFO] Finished at: Sun Jan 15 17:58:11 UTC 2012
[INFO] Final Memory: 102M/404M
[INFO] ------------------------------------------------------------------------
Build step 'Invoke top-level Maven targets' marked build as failure
[FINDBUGS] Skipping publisher since build result is FAILURE
[PMD] Skipping publisher since build result is FAILURE
[TASKS] Skipping publisher since build result is FAILURE
Archiving artifacts
Recording test results
Publishing Javadoc
Updating MAHOUT-927
Updating MAHOUT-920
Updating MAHOUT-921
Updating MAHOUT-890
Publishing Clover coverage report...
No Clover report will be published due to a Build Failure


Mime
View raw message