mahout-dev mailing list archives

Site index · List index
Message view « Date » · « Thread »
Top « Date » · « Thread »
From Ted Dunning <ted.dunn...@gmail.com>
Subject Re: Build failed in Hudson: Mahout-Quality #593
Date Sat, 29 Jan 2011 06:07:29 GMT
Does anybody know why the build has started doing this?  I don't see a
relevant change.

On Fri, Jan 28, 2011 at 10:02 PM, Apache Hudson Server <
hudson@hudson.apache.org> wrote:

> See <https://hudson.apache.org/hudson/job/Mahout-Quality/593/changes>
>
> Changes:
>
> [tdunning] MAHOUT-599 - Switched to like() instead of clone() in
> AbstractMatrix
> ...



> [INFO] Apache Mahout ..................................... FAILURE
> [16.513s]
> [INFO] Mahout Build Tools ................................ SKIPPED
> [INFO] Mahout Eclipse .................................... SKIPPED
> [INFO] Mahout Math ....................................... SKIPPED
> [INFO] Mahout Core ....................................... SKIPPED
> [INFO] Mahout Taste Webapp ............................... SKIPPED
> [INFO] Mahout Utilities .................................. SKIPPED
> [INFO] Mahout Examples ................................... SKIPPED
> [INFO] Mahout Release Package ............................ SKIPPED
> [INFO]
> ------------------------------------------------------------------------
> [INFO] BUILD FAILURE
> [INFO]
> ------------------------------------------------------------------------
> [INFO] Total time: 23.255s
> [INFO] Finished at: Sat Jan 29 01:02:47 EST 2011
> [INFO] Final Memory: 21M/186M
> [INFO]
> ------------------------------------------------------------------------
> [ERROR] Failed to execute goal
> com.atlassian.maven.plugins:maven-clover2-plugin:2.6.3:instrumentInternal
> (default-cli) on project mahout: Failed to load resource as file
> [/clover.license]: Could not find resource '/clover.license'. -> [Help 1]
> [ERROR]
> [ERROR] To see the full stack trace of the errors, re-run Maven with the -e
> switch.
> [ERROR] Re-run Maven using the -X switch to enable full debug logging.
> [ERROR]
> [ERROR] For more information about the errors and possible solutions,
> please read the following articles:
> [ERROR] [Help 1]
> http://cwiki.apache.org/confluence/display/MAVEN/MojoExecutionException
> [FINDBUGS] Skipping publisher since build result is FAILURE
> [PMD] Skipping publisher since build result is FAILURE
> [TASKS] Skipping publisher since build result is FAILURE
> Publishing Javadoc
> Archiving artifacts
> Recording test results
> Publishing Clover coverage report...
> No Clover report will be published due to a Build Failure
>
>

Mime
  • Unnamed multipart/alternative (inline, None, 0 bytes)
View raw message