mahout-dev mailing list archives

Site index · List index
Message view « Date » · « Thread »
Top « Date » · « Thread »
From Apache Hudson Server <hud...@hudson.apache.org>
Subject Build failed in Hudson: Mahout-Quality #239
Date Fri, 03 Sep 2010 20:01:17 GMT
See <https://hudson.apache.org/hudson/job/Mahout-Quality/239/changes>

Changes:

[srowen] Attempt to please Hudson by forcing MersenneTwisterRNG to not use /dev/random-based
seed, which causes hangs on Ubuntu.

------------------------------------------
[...truncated 1583 lines...]
[INFO] Copying 3 resources
[INFO] [compiler:testCompile {execution: default-testCompile}]
[INFO] No sources to compile
[INFO] [surefire:test {execution: default-test}]
[INFO] Surefire report directory: <https://hudson.apache.org/hudson/job/Mahout-Quality/239/artifact/trunk/buildtools/target/surefire-reports>

-------------------------------------------------------
 T E S T S
-------------------------------------------------------
There are no tests to run.

Results :

Tests run: 0, Failures: 0, Errors: 0, Skipped: 0

[INFO] [jar:jar {execution: default-jar}]
[INFO] Building jar: <https://hudson.apache.org/hudson/job/Mahout-Quality/239/artifact/trunk/buildtools/target/mahout-buildtools-0.4-SNAPSHOT.jar>
[INFO] [install:install {execution: default-install}]
[INFO] Installing <https://hudson.apache.org/hudson/job/Mahout-Quality/239/artifact/trunk/buildtools/target/mahout-buildtools-0.4-SNAPSHOT.jar>
to /home/hudson/.m2/repository/org/apache/mahout/mahout-buildtools/0.4-SNAPSHOT/mahout-buildtools-0.4-SNAPSHOT.jar
[INFO] Preparing javadoc:javadoc
[INFO] No goals needed for project - skipping
[INFO] [javadoc:javadoc {execution: default-cli}]
[INFO] snapshot org.apache.mahout:mahout-buildtools:0.4-SNAPSHOT: checking for updates from
apache.snapshots
[INFO] snapshot org.apache.mahout:mahout-buildtools:0.4-SNAPSHOT: checking for updates from
apache.snapshots
[INFO] [checkstyle:checkstyle {execution: default-cli}]
[INFO] Source directory does not exist - skipping report.
[INFO] Preparing findbugs:findbugs
[INFO] [remote-resources:process {execution: default}]
[INFO] inceptionYear not specified, defaulting to 2010
[INFO] [resources:resources {execution: default-resources}]
[INFO] Using 'UTF-8' encoding to copy filtered resources.
[INFO] Copying 3 resources
[INFO] Copying 3 resources
[INFO] Copying 3 resources
[INFO] [compiler:compile {execution: default-compile}]
[INFO] No sources to compile
[INFO] [findbugs:findbugs {execution: default-cli}]
[INFO] Preparing clover2:instrument
[INFO] [clover2:instrumentInternal {execution: default-instrumentInternal}]
[INFO] No 'maven.clover.licenseLocation' configured. Using default evaluation license.
[INFO] No Clover instrumentation done on source files in: [<https://hudson.apache.org/hudson/job/Mahout-Quality/ws/trunk/buildtools/src/main/java]>
as no matching sources files found
[INFO] No Clover instrumentation done on source files in: [<https://hudson.apache.org/hudson/job/Mahout-Quality/ws/trunk/buildtools/src/test/java]>
as no matching sources files found
[INFO] [remote-resources:process {execution: default}]
[INFO] inceptionYear not specified, defaulting to 2010
[INFO] [resources:resources {execution: default-resources}]
[INFO] Using 'UTF-8' encoding to copy filtered resources.
[INFO] Copying 3 resources
[INFO] Copying 0 resource
[INFO] Copying 3 resources
[INFO] [compiler:compile {execution: default-compile}]
[INFO] No sources to compile
[INFO] [resources:testResources {execution: default-testResources}]
[INFO] Using 'UTF-8' encoding to copy filtered resources.
[INFO] skip non existing resourceDirectory <https://hudson.apache.org/hudson/job/Mahout-Quality/ws/trunk/buildtools/src/test/resources>
[INFO] Copying 3 resources
[INFO] Copying 3 resources
[INFO] [compiler:testCompile {execution: default-testCompile}]
[INFO] No sources to compile
[INFO] [surefire:test {execution: default-test}]
[INFO] Surefire report directory: <https://hudson.apache.org/hudson/job/Mahout-Quality/ws/trunk/buildtools/target/clover/surefire-reports>

-------------------------------------------------------
 T E S T S
-------------------------------------------------------
There are no tests to run.

Results :

Tests run: 0, Failures: 0, Errors: 0, Skipped: 0

[INFO] [jar:jar {execution: default-jar}]
[INFO] Building jar: <https://hudson.apache.org/hudson/job/Mahout-Quality/ws/trunk/buildtools/target/clover/mahout-buildtools-0.4-SNAPSHOT-clover.jar>
[INFO] [install:install {execution: default-install}]
[INFO] Installing <https://hudson.apache.org/hudson/job/Mahout-Quality/ws/trunk/buildtools/target/clover/mahout-buildtools-0.4-SNAPSHOT-clover.jar>
to /home/hudson/.m2/repository/org/apache/mahout/mahout-buildtools/0.4-SNAPSHOT/mahout-buildtools-0.4-SNAPSHOT-clover.jar
[INFO] [clover2:instrument {execution: default-cli}]
[INFO] ------------------------------------------------------------------------
[INFO] Building Mahout Eclipse
[INFO]    task-segment: [clean, install, javadoc:javadoc, checkstyle:checkstyle, findbugs:findbugs,
clover2:instrument]
[INFO] ------------------------------------------------------------------------
[INFO] [clean:clean {execution: default-clean}]
[INFO] [remote-resources:process {execution: default}]
[INFO] inceptionYear not specified, defaulting to 2010
[INFO] [resources:resources {execution: default-resources}]
[INFO] Using 'UTF-8' encoding to copy filtered resources.
[INFO] Copying 3 resources
[INFO] Copying 3 resources
[INFO] [compiler:compile {execution: default-compile}]
[INFO] No sources to compile
[INFO] [resources:testResources {execution: default-testResources}]
[INFO] Using 'UTF-8' encoding to copy filtered resources.
[INFO] skip non existing resourceDirectory <https://hudson.apache.org/hudson/job/Mahout-Quality/ws/trunk/eclipse/src/test/resources>
[INFO] Copying 3 resources
[INFO] [compiler:testCompile {execution: default-testCompile}]
[INFO] No sources to compile
[INFO] [surefire:test {execution: default-test}]
[INFO] Surefire report directory: <https://hudson.apache.org/hudson/job/Mahout-Quality/239/artifact/trunk/eclipse/target/surefire-reports>

-------------------------------------------------------
 T E S T S
-------------------------------------------------------
There are no tests to run.

Results :

Tests run: 0, Failures: 0, Errors: 0, Skipped: 0

[INFO] [jar:jar {execution: default-jar}]
[INFO] Building jar: <https://hudson.apache.org/hudson/job/Mahout-Quality/239/artifact/trunk/eclipse/target/mahout-eclipse-support-0.4-SNAPSHOT.jar>
[INFO] [install:install {execution: default-install}]
[INFO] Installing <https://hudson.apache.org/hudson/job/Mahout-Quality/239/artifact/trunk/eclipse/target/mahout-eclipse-support-0.4-SNAPSHOT.jar>
to /home/hudson/.m2/repository/org/apache/mahout/mahout-eclipse-support/0.4-SNAPSHOT/mahout-eclipse-support-0.4-SNAPSHOT.jar
[INFO] Preparing javadoc:javadoc
[INFO] No goals needed for project - skipping
[INFO] [javadoc:javadoc {execution: default-cli}]
[INFO] [checkstyle:checkstyle {execution: default-cli}]
[INFO] Source directory does not exist - skipping report.
[INFO] Preparing findbugs:findbugs
[INFO] [remote-resources:process {execution: default}]
[INFO] inceptionYear not specified, defaulting to 2010
[INFO] [resources:resources {execution: default-resources}]
[INFO] Using 'UTF-8' encoding to copy filtered resources.
[INFO] Copying 3 resources
[INFO] Copying 3 resources
[INFO] Copying 3 resources
[INFO] [compiler:compile {execution: default-compile}]
[INFO] No sources to compile
[INFO] [findbugs:findbugs {execution: default-cli}]
[INFO] Preparing clover2:instrument
[INFO] [clover2:instrumentInternal {execution: default-instrumentInternal}]
[INFO] No 'maven.clover.licenseLocation' configured. Using default evaluation license.
[INFO] No Clover instrumentation done on source files in: [<https://hudson.apache.org/hudson/job/Mahout-Quality/ws/trunk/eclipse/src/main/java]>
as no matching sources files found
[INFO] No Clover instrumentation done on source files in: [<https://hudson.apache.org/hudson/job/Mahout-Quality/ws/trunk/eclipse/src/test/java]>
as no matching sources files found
[INFO] [remote-resources:process {execution: default}]
[INFO] inceptionYear not specified, defaulting to 2010
[INFO] [resources:resources {execution: default-resources}]
[INFO] Using 'UTF-8' encoding to copy filtered resources.
[INFO] Copying 3 resources
[INFO] Copying 0 resource
[INFO] Copying 3 resources
[INFO] [compiler:compile {execution: default-compile}]
[INFO] No sources to compile
[INFO] [resources:testResources {execution: default-testResources}]
[INFO] Using 'UTF-8' encoding to copy filtered resources.
[INFO] skip non existing resourceDirectory <https://hudson.apache.org/hudson/job/Mahout-Quality/ws/trunk/eclipse/src/test/resources>
[INFO] Copying 3 resources
[INFO] Copying 3 resources
[INFO] [compiler:testCompile {execution: default-testCompile}]
[INFO] No sources to compile
[INFO] [surefire:test {execution: default-test}]
[INFO] Surefire report directory: <https://hudson.apache.org/hudson/job/Mahout-Quality/ws/trunk/eclipse/target/clover/surefire-reports>

-------------------------------------------------------
 T E S T S
-------------------------------------------------------
There are no tests to run.

Results :

Tests run: 0, Failures: 0, Errors: 0, Skipped: 0

[INFO] [jar:jar {execution: default-jar}]
[INFO] Building jar: <https://hudson.apache.org/hudson/job/Mahout-Quality/ws/trunk/eclipse/target/clover/mahout-eclipse-support-0.4-SNAPSHOT-clover.jar>
[INFO] [install:install {execution: default-install}]
[INFO] Installing <https://hudson.apache.org/hudson/job/Mahout-Quality/ws/trunk/eclipse/target/clover/mahout-eclipse-support-0.4-SNAPSHOT-clover.jar>
to /home/hudson/.m2/repository/org/apache/mahout/mahout-eclipse-support/0.4-SNAPSHOT/mahout-eclipse-support-0.4-SNAPSHOT-clover.jar
[INFO] [clover2:instrument {execution: default-cli}]
[INFO] ------------------------------------------------------------------------
[INFO] Building Apache Mahout
[INFO]    task-segment: [clean, install, javadoc:javadoc, checkstyle:checkstyle, findbugs:findbugs,
clover2:instrument]
[INFO] ------------------------------------------------------------------------
[INFO] [clean:clean {execution: default-clean}]
[INFO] [remote-resources:process {execution: default}]
[INFO] [site:attach-descriptor {execution: default-attach-descriptor}]
[INFO] Unable to load parent project from a relative path: Could not find the model file '<https://hudson.apache.org/hudson/job/Mahout-Quality/ws/pom.xml'.>
for project unknown
[INFO] Parent project loaded from repository.
[INFO] [install:install {execution: default-install}]
[INFO] Installing <https://hudson.apache.org/hudson/job/Mahout-Quality/ws/trunk/pom.xml>
to /home/hudson/.m2/repository/org/apache/mahout/mahout/0.4-SNAPSHOT/mahout-0.4-SNAPSHOT.pom
[INFO] Preparing javadoc:javadoc
[INFO] No goals needed for project - skipping
[INFO] [javadoc:javadoc {execution: default-cli}]
[INFO] [checkstyle:checkstyle {execution: default-cli}]
[INFO] Source directory does not exist - skipping report.
[INFO] Preparing findbugs:findbugs
[INFO] [remote-resources:process {execution: default}]
[INFO] [findbugs:findbugs {execution: default-cli}]
[INFO] Preparing clover2:instrument
[INFO] [clover2:instrumentInternal {execution: default-instrumentInternal}]
[WARNING] The reported language of this project is none, attempting to instrument sources
anyway.
[INFO] No Clover instrumentation done on source files in: [<https://hudson.apache.org/hudson/job/Mahout-Quality/ws/trunk/src/main/java]>
as no matching sources files found
[INFO] No Clover instrumentation done on source files in: [<https://hudson.apache.org/hudson/job/Mahout-Quality/ws/trunk/src/test/java]>
as no matching sources files found
[INFO] [remote-resources:process {execution: default}]
[INFO] [site:attach-descriptor {execution: default-attach-descriptor}]
[INFO] [install:install {execution: default-install}]
[INFO] Installing <https://hudson.apache.org/hudson/job/Mahout-Quality/ws/trunk/pom.xml>
to /home/hudson/.m2/repository/org/apache/mahout/mahout/0.4-SNAPSHOT/mahout-0.4-SNAPSHOT.pom
[INFO] [clover2:instrument {execution: default-cli}]
[INFO] ------------------------------------------------------------------------
[INFO] Building Mahout Math
[INFO]    task-segment: [clean, install, javadoc:javadoc, checkstyle:checkstyle, findbugs:findbugs,
clover2:instrument]
[INFO] ------------------------------------------------------------------------
[INFO] [clean:clean {execution: default-clean}]
[INFO] [resources:resources {execution: default-resources}]
[INFO] Using 'UTF-8' encoding to copy filtered resources.
[INFO] skip non existing resourceDirectory <https://hudson.apache.org/hudson/job/Mahout-Quality/ws/trunk/math/src/main/resources>
[INFO] [compiler:compile {execution: default-compile}]
[INFO] Compiling 129 source files to <https://hudson.apache.org/hudson/job/Mahout-Quality/239/artifact/trunk/math/target/classes>
[INFO] [resources:testResources {execution: default-testResources}]
[INFO] Using 'UTF-8' encoding to copy filtered resources.
[INFO] Copying 2 resources
[INFO] [compiler:testCompile {execution: default-testCompile}]
[INFO] Compiling 29 source files to <https://hudson.apache.org/hudson/job/Mahout-Quality/239/artifact/trunk/math/target/test-classes>
[INFO] [surefire:test {execution: default-test}]
[INFO] Surefire report directory: <https://hudson.apache.org/hudson/job/Mahout-Quality/239/artifact/trunk/math/target/surefire-reports>

-------------------------------------------------------
 T E S T S
-------------------------------------------------------
Running org.apache.mahout.math.jet.random.NormalTest
Tests run: 4, Failures: 0, Errors: 0, Skipped: 0, Time elapsed: 1,277.823 sec
Running org.apache.mahout.math.TestMatrixView
Tests run: 49, Failures: 0, Errors: 0, Skipped: 0, Time elapsed: 0.246 sec
Running org.apache.mahout.math.TestDenseVector
Tests run: 41, Failures: 0, Errors: 0, Skipped: 0, Time elapsed: 0.078 sec
Running org.apache.mahout.math.TestSparseMatrix
Tests run: 58, Failures: 0, Errors: 0, Skipped: 0, Time elapsed: 0.189 sec
Running org.apache.mahout.math.jet.stat.ProbabilityTest
Tests run: 3, Failures: 0, Errors: 0, Skipped: 0, Time elapsed: 0.086 sec
Running org.apache.mahout.math.TestSparseRowMatrix
Tests run: 58, Failures: 0, Errors: 0, Skipped: 0, Time elapsed: 0.09 sec
Running org.apache.mahout.math.stats.LogLikelihoodTest
Tests run: 4, Failures: 0, Errors: 0, Skipped: 0, Time elapsed: 0.005 sec
Running org.apache.mahout.math.TestRandomAccessSparseVector
Tests run: 41, Failures: 0, Errors: 0, Skipped: 0, Time elapsed: 0.034 sec
Running org.apache.mahout.math.TestOrderedIntDoubleMapping
Tests run: 2, Failures: 0, Errors: 0, Skipped: 0, Time elapsed: 0.005 sec
Running org.apache.mahout.math.jet.random.engine.MersenneTwisterTest
Tests run: 4, Failures: 0, Errors: 0, Skipped: 0, Time elapsed: 0.017 sec
Running org.apache.mahout.math.decomposer.hebbian.TestHebbianSolver
Tests run: 1, Failures: 0, Errors: 0, Skipped: 0, Time elapsed: 2.669 sec
Running org.apache.mahout.math.jet.random.NegativeBinomialTest
Build timed out. Aborting
[FINDBUGS] Skipping publisher since build result is FAILURE
[PMD] Skipping publisher since build result is FAILURE
[TASKS] Skipping publisher since build result is FAILURE
Publishing Javadoc
Destroying 1 processes
Destroying process..
Destroyed 1 processes
Archiving artifacts
Recording test results
Publishing Clover coverage report...
No Clover report will be published due to a Build Failure


Mime
View raw message