mahout-dev mailing list archives

Site index · List index
Message view « Date » · « Thread »
Top « Date » · « Thread »
From Apache Hudson Server <hud...@hudson.zones.apache.org>
Subject Build failed in Hudson: Mahout-Quality #183
Date Thu, 12 Aug 2010 03:09:46 GMT
See <http://hudson.zones.apache.org/hudson/job/Mahout-Quality/183/changes>

Changes:

[tdunning] Fixed initialization error in vector aggregation.  Also test for empty vectors.

------------------------------------------
[...truncated 4595 lines...]
Running org.apache.mahout.math.hadoop.similarity.vector.DistributedLoglikelihoodVectorSimilarityTest
Tests run: 1, Failures: 0, Errors: 0, Skipped: 0, Time elapsed: 0.004 sec
Running org.apache.mahout.cf.taste.impl.recommender.slopeone.SlopeOneRecommenderTest
Tests run: 6, Failures: 0, Errors: 0, Skipped: 0, Time elapsed: 0.02 sec
Running org.apache.mahout.cf.taste.impl.recommender.RandomRecommenderTest
Tests run: 1, Failures: 0, Errors: 0, Skipped: 0, Time elapsed: 0.002 sec
Running org.apache.mahout.clustering.lda.TestLDAInference
Tests run: 3, Failures: 0, Errors: 0, Skipped: 0, Time elapsed: 0.269 sec
Running org.apache.mahout.math.hadoop.similarity.vector.DistributedEuclideanDistanceVectorSimilarityTest
Tests run: 1, Failures: 0, Errors: 0, Skipped: 0, Time elapsed: 0.002 sec
Running org.apache.mahout.df.node.NodeTest
Tests run: 4, Failures: 0, Errors: 0, Skipped: 0, Time elapsed: 0.007 sec
Running org.apache.mahout.common.iterator.TestSamplingIterator
Tests run: 5, Failures: 0, Errors: 0, Skipped: 0, Time elapsed: 0.045 sec
Running org.apache.mahout.clustering.kmeans.TestRandomSeedGenerator
Tests run: 1, Failures: 0, Errors: 0, Skipped: 0, Time elapsed: 0.409 sec
Running org.apache.mahout.cf.taste.impl.model.MemoryIDMigratorTest
Tests run: 3, Failures: 0, Errors: 0, Skipped: 0, Time elapsed: 0.006 sec
Running org.apache.mahout.cf.taste.impl.model.BooleanItemPreferenceArrayTest
Tests run: 6, Failures: 0, Errors: 0, Skipped: 0, Time elapsed: 0.006 sec
Running org.apache.mahout.math.hadoop.similarity.vector.DistributedPearsonCorrelationVectorSimilarityTest
Tests run: 1, Failures: 0, Errors: 0, Skipped: 0, Time elapsed: 0.002 sec
Running org.apache.mahout.cf.taste.impl.recommender.AllUnknownItemsCandidateItemsStrategyTest
Tests run: 1, Failures: 0, Errors: 0, Skipped: 0, Time elapsed: 0.093 sec
Running org.apache.mahout.cf.taste.impl.eval.RMSRecommenderEvaluatorTest
Tests run: 1, Failures: 0, Errors: 0, Skipped: 0, Time elapsed: 0.018 sec
Running org.apache.mahout.classifier.bayes.BayesFeatureMapperTest
Tests run: 1, Failures: 0, Errors: 0, Skipped: 0, Time elapsed: 0.074 sec
Running org.apache.mahout.cf.taste.impl.common.RunningAverageTest
Tests run: 2, Failures: 0, Errors: 0, Skipped: 0, Time elapsed: 0.003 sec
Running org.apache.mahout.clustering.dirichlet.TestDirichletClustering
Tests run: 12, Failures: 0, Errors: 0, Skipped: 0, Time elapsed: 3.113 sec
Running org.apache.mahout.df.mapreduce.partial.PartialBuilderTest
Tests run: 2, Failures: 0, Errors: 0, Skipped: 0, Time elapsed: 0.073 sec
Running org.apache.mahout.df.mapreduce.partial.TreeIDTest
Tests run: 1, Failures: 0, Errors: 0, Skipped: 0, Time elapsed: 0.246 sec
Running org.apache.mahout.cf.taste.impl.common.RefreshHelperTest
Tests run: 4, Failures: 0, Errors: 0, Skipped: 0, Time elapsed: 0.005 sec
Running org.apache.mahout.clustering.TestClusterInterface
Tests run: 22, Failures: 0, Errors: 0, Skipped: 0, Time elapsed: 0.061 sec
Running org.apache.mahout.cf.taste.impl.recommender.slopeone.MemoryDiffStorageTest
Tests run: 3, Failures: 0, Errors: 0, Skipped: 0, Time elapsed: 0.004 sec
Running org.apache.mahout.common.distance.CosineDistanceMeasureTest
Tests run: 1, Failures: 0, Errors: 0, Skipped: 0, Time elapsed: 0.002 sec
Running org.apache.mahout.cf.taste.impl.common.RunningAverageAndStdDevTest
Tests run: 2, Failures: 0, Errors: 0, Skipped: 0, Time elapsed: 0.002 sec
Running org.apache.mahout.clustering.lda.TestMapReduce
Tests run: 1, Failures: 0, Errors: 0, Skipped: 0, Time elapsed: 0.13 sec
Running org.apache.mahout.fpm.pfpgrowth.fpgrowth.FrequentPatternMaxHeapTest
Tests run: 1, Failures: 0, Errors: 0, Skipped: 0, Time elapsed: 0.065 sec
Running org.apache.mahout.cf.taste.impl.eval.GenericRecommenderIRStatsEvaluatorImplTest
Tests run: 1, Failures: 0, Errors: 0, Skipped: 0, Time elapsed: 0.008 sec
Running org.apache.mahout.clustering.kmeans.TestKmeansClustering
Tests run: 7, Failures: 0, Errors: 0, Skipped: 0, Time elapsed: 38.732 sec
Running org.apache.mahout.math.hadoop.similarity.vector.DistributedUncenteredZeroAssumingCosineVectorSimilarityTest
Tests run: 1, Failures: 0, Errors: 0, Skipped: 0, Time elapsed: 0.002 sec
Running org.apache.mahout.cf.taste.impl.recommender.TreeClusteringRecommenderTest
Tests run: 5, Failures: 0, Errors: 0, Skipped: 0, Time elapsed: 0.011 sec
Running org.apache.mahout.cf.taste.hadoop.item.RecommenderJobTest
Tests run: 17, Failures: 0, Errors: 0, Skipped: 0, Time elapsed: 16.509 sec
Running org.apache.mahout.math.hadoop.similarity.vector.DistributedTanimotoCoefficientVectorSimilarityTest
Tests run: 1, Failures: 0, Errors: 0, Skipped: 0, Time elapsed: 0.002 sec
Running org.apache.mahout.common.IntPairWritableTest
Tests run: 3, Failures: 0, Errors: 0, Skipped: 0, Time elapsed: 0.022 sec
Running org.apache.mahout.fpm.pfpgrowth.PFPGrowthTest
Tests run: 3, Failures: 0, Errors: 0, Skipped: 0, Time elapsed: 5.507 sec
Running org.apache.mahout.cf.taste.impl.transforms.CaseAmplificationTest
Tests run: 2, Failures: 0, Errors: 0, Skipped: 0, Time elapsed: 0.003 sec
Running org.apache.mahout.df.data.DatasetTest
Tests run: 1, Failures: 0, Errors: 0, Skipped: 0, Time elapsed: 0.009 sec
Running org.apache.mahout.cf.taste.impl.similarity.AveragingPreferenceInferrerTest
Tests run: 1, Failures: 0, Errors: 0, Skipped: 0, Time elapsed: 0.005 sec
Running org.apache.mahout.df.data.DataTest
Tests run: 10, Failures: 0, Errors: 0, Skipped: 0, Time elapsed: 0.346 sec
Running org.apache.mahout.cf.taste.impl.common.InvertedRunningAverageTest
Tests run: 4, Failures: 0, Errors: 0, Skipped: 0, Time elapsed: 0.004 sec
Running org.apache.mahout.cf.taste.impl.similarity.EuclideanDistanceSimilarityTest
Tests run: 17, Failures: 0, Errors: 0, Skipped: 0, Time elapsed: 0.016 sec
Running org.apache.mahout.cf.taste.impl.eval.AverageAbsoluteDifferenceRecommenderEvaluatorTest
Tests run: 1, Failures: 0, Errors: 0, Skipped: 0, Time elapsed: 0.01 sec
Running org.apache.mahout.cf.taste.impl.recommender.GenericItemBasedRecommenderTest
Tests run: 8, Failures: 0, Errors: 0, Skipped: 0, Time elapsed: 0.014 sec
Running org.apache.mahout.math.VarintTest
Tests run: 8, Failures: 0, Errors: 0, Skipped: 0, Time elapsed: 0.005 sec
Running org.apache.mahout.clustering.canopy.TestCanopyCreation
Tests run: 15, Failures: 0, Errors: 0, Skipped: 0, Time elapsed: 10.489 sec
Running org.apache.mahout.clustering.meanshift.TestMeanShift
Tests run: 6, Failures: 0, Errors: 0, Skipped: 0, Time elapsed: 7.894 sec
Running org.apache.mahout.classifier.bayes.CBayesClassifierTest
Tests run: 2, Failures: 0, Errors: 0, Skipped: 0, Time elapsed: 0.004 sec
Running org.apache.mahout.df.mapreduce.partial.InterResultsTest
Tests run: 2, Failures: 0, Errors: 0, Skipped: 0, Time elapsed: 0.122 sec
Running org.apache.mahout.common.iterator.TestFixedSizeSampler
Tests run: 5, Failures: 0, Errors: 0, Skipped: 0, Time elapsed: 0.005 sec
Running org.apache.mahout.df.split.DefaultIgSplitTest
Tests run: 1, Failures: 0, Errors: 0, Skipped: 0, Time elapsed: 0.01 sec
Running org.apache.mahout.cf.taste.hadoop.similarity.item.ItemSimilarityTest
Tests run: 8, Failures: 0, Errors: 0, Skipped: 0, Time elapsed: 19.156 sec
Running org.apache.mahout.ga.watchmaker.EvalMapperTest
Tests run: 1, Failures: 0, Errors: 0, Skipped: 0, Time elapsed: 0.215 sec
Running org.apache.mahout.classifier.discriminative.WinnowTrainerTest
Tests run: 1, Failures: 0, Errors: 0, Skipped: 0, Time elapsed: 0.007 sec
Running org.apache.mahout.df.split.OptIgSplitTest
Tests run: 1, Failures: 0, Errors: 0, Skipped: 0, Time elapsed: 0.167 sec
Running org.apache.mahout.df.mapreduce.partial.Step2MapperTest
Tests run: 1, Failures: 0, Errors: 0, Skipped: 0, Time elapsed: 0.086 sec
Running org.apache.mahout.common.iterator.IteratorUtilsTest
Tests run: 5, Failures: 0, Errors: 0, Skipped: 0, Time elapsed: 0.004 sec
Running org.apache.mahout.cf.taste.impl.recommender.NullRescorerTest
Tests run: 2, Failures: 0, Errors: 0, Skipped: 0, Time elapsed: 0.003 sec
Running org.apache.mahout.cf.taste.impl.common.BitSetTest
Tests run: 4, Failures: 0, Errors: 0, Skipped: 0, Time elapsed: 0.003 sec
Running org.apache.mahout.df.data.DescriptorUtilsTest
Tests run: 2, Failures: 0, Errors: 0, Skipped: 0, Time elapsed: 0.002 sec
Running org.apache.mahout.df.builder.DefaultTreeBuilderTest
Tests run: 1, Failures: 0, Errors: 0, Skipped: 0, Time elapsed: 0.007 sec
Running org.apache.mahout.cf.taste.impl.model.GenericItemPreferenceArrayTest
Tests run: 7, Failures: 0, Errors: 0, Skipped: 0, Time elapsed: 0.004 sec
Running org.apache.mahout.cf.taste.impl.common.SamplingLongPrimitiveIteratorTest
Tests run: 3, Failures: 0, Errors: 0, Skipped: 0, Time elapsed: 0.003 sec
Running org.apache.mahout.cf.taste.impl.model.GenericDataModelTest
Tests run: 1, Failures: 0, Errors: 0, Skipped: 0, Time elapsed: 0.017 sec
Running org.apache.mahout.df.mapreduce.inmem.InMemInputSplitTest
Tests run: 2, Failures: 0, Errors: 0, Skipped: 0, Time elapsed: 0.002 sec
Running org.apache.mahout.df.mapreduce.partial.PartitionBugTest
Tests run: 1, Failures: 0, Errors: 0, Skipped: 0, Time elapsed: 0.077 sec
Running org.apache.mahout.math.hadoop.similarity.vector.DistributedUncenteredCosineVectorSimilarityTest
Tests run: 1, Failures: 0, Errors: 0, Skipped: 0, Time elapsed: 0.001 sec
Running org.apache.mahout.math.hadoop.similarity.TestRowSimilarityJob
Tests run: 8, Failures: 0, Errors: 0, Skipped: 0, Time elapsed: 8.497 sec
Running org.apache.mahout.df.data.DataConverterTest
Tests run: 1, Failures: 0, Errors: 0, Skipped: 0, Time elapsed: 0.005 sec
Running org.apache.mahout.math.VectorWritableTest
Tests run: 3, Failures: 0, Errors: 0, Skipped: 0, Time elapsed: 0.002 sec
Running org.apache.mahout.common.StringUtilsTest
Tests run: 1, Failures: 0, Errors: 0, Skipped: 0, Time elapsed: 0.004 sec
Running org.apache.mahout.common.distance.TestEuclideanDistanceMeasure
Tests run: 1, Failures: 0, Errors: 0, Skipped: 0, Time elapsed: 0.021 sec
Running org.apache.mahout.cf.taste.impl.recommender.GenericUserBasedRecommenderTest
Tests run: 7, Failures: 0, Errors: 0, Skipped: 0, Time elapsed: 0.01 sec
Running org.apache.mahout.classifier.bayes.BayesFeatureMapReduceTest
Tests run: 4, Failures: 0, Errors: 0, Skipped: 0, Time elapsed: 0.085 sec
Running org.apache.mahout.classifier.discriminative.PerceptronTrainerTest
Tests run: 1, Failures: 0, Errors: 0, Skipped: 0, Time elapsed: 0.003 sec
Running org.apache.mahout.ga.watchmaker.MahoutEvaluatorTest
Tests run: 2, Failures: 0, Errors: 0, Skipped: 0, Time elapsed: 1.759 sec
Running org.apache.mahout.fpm.pfpgrowth.FPGrowthTest
Tests run: 2, Failures: 0, Errors: 0, Skipped: 0, Time elapsed: 0.065 sec
Running org.apache.mahout.clustering.dirichlet.TestMapReduce
Tests run: 12, Failures: 0, Errors: 0, Skipped: 0, Time elapsed: 31.863 sec
Running org.apache.mahout.common.iterator.TestStableFixedSizeSampler
Tests run: 5, Failures: 0, Errors: 0, Skipped: 0, Time elapsed: 0.005 sec
Running org.apache.mahout.common.distance.TestWeightedManhattanDistanceMeasure
Tests run: 2, Failures: 0, Errors: 0, Skipped: 0, Time elapsed: 0.023 sec
Running org.apache.mahout.common.iterator.EmptyIteratorTest
Tests run: 2, Failures: 0, Errors: 0, Skipped: 0, Time elapsed: 0.005 sec
Running org.apache.mahout.cf.taste.impl.similarity.SpearmanCorrelationSimilarityTest
Tests run: 5, Failures: 0, Errors: 0, Skipped: 0, Time elapsed: 0.011 sec
Running org.apache.mahout.cf.taste.impl.similarity.TanimotoCoefficientSimilarityTest
Tests run: 6, Failures: 0, Errors: 0, Skipped: 0, Time elapsed: 0.012 sec
Running org.apache.mahout.cf.taste.impl.similarity.file.FileItemSimilarityTest
Tests run: 6, Failures: 0, Errors: 0, Skipped: 0, Time elapsed: 4.014 sec
Running org.apache.mahout.cf.taste.impl.recommender.CachingRecommenderTest
Tests run: 1, Failures: 0, Errors: 0, Skipped: 0, Time elapsed: 0.007 sec
Running org.apache.mahout.ga.watchmaker.STFitnessEvaluatorTest
Tests run: 2, Failures: 0, Errors: 0, Skipped: 0, Time elapsed: 0.008 sec
Running org.apache.mahout.classifier.discriminative.LinearModelTest
Tests run: 3, Failures: 0, Errors: 0, Skipped: 0, Time elapsed: 0.005 sec
Running org.apache.mahout.cf.taste.impl.common.CacheTest
Tests run: 2, Failures: 0, Errors: 0, Skipped: 0, Time elapsed: 0.751 sec
Running org.apache.mahout.common.distance.TestManhattanDistanceMeasure
Tests run: 1, Failures: 0, Errors: 0, Skipped: 0, Time elapsed: 0.019 sec
Running org.apache.mahout.cf.taste.impl.recommender.ItemAverageRecommenderTest
Tests run: 1, Failures: 0, Errors: 0, Skipped: 0, Time elapsed: 0.004 sec
Running org.apache.mahout.cf.taste.impl.transforms.ZScoreTest
Tests run: 4, Failures: 0, Errors: 0, Skipped: 0, Time elapsed: 0.006 sec
Running org.apache.mahout.cf.taste.impl.similarity.GenericItemSimilarityTest
Tests run: 2, Failures: 0, Errors: 0, Skipped: 0, Time elapsed: 0.003 sec
Running org.apache.mahout.cf.taste.impl.recommender.SamplingCandidateItemsStrategyTest
Tests run: 1, Failures: 0, Errors: 0, Skipped: 0, Time elapsed: 0.003 sec
Running org.apache.mahout.cf.taste.common.CommonTest
Tests run: 3, Failures: 0, Errors: 0, Skipped: 0, Time elapsed: 0.004 sec
Running org.apache.mahout.common.distance.TestTanimotoDistanceMeasure
Tests run: 2, Failures: 0, Errors: 0, Skipped: 0, Time elapsed: 0.018 sec
Running org.apache.mahout.common.AbstractJobTest
Tests run: 3, Failures: 0, Errors: 0, Skipped: 0, Time elapsed: 0.104 sec
Running org.apache.mahout.df.mapreduce.partial.Step1MapperTest
Tests run: 1, Failures: 0, Errors: 0, Skipped: 0, Time elapsed: 0.013 sec
Running org.apache.mahout.cf.taste.impl.recommender.PreferredItemsNeighborhoodCandidateItemsStrategyTest
Tests run: 1, Failures: 0, Errors: 0, Skipped: 0, Time elapsed: 0.002 sec
Running org.apache.mahout.common.distance.TestMahalanobisDistanceMeasure
Tests run: 1, Failures: 0, Errors: 0, Skipped: 0, Time elapsed: 0.004 sec
Running org.apache.mahout.cf.taste.impl.common.LongPrimitiveArrayIteratorTest
Tests run: 3, Failures: 0, Errors: 0, Skipped: 0, Time elapsed: 0.003 sec
Running org.apache.mahout.clustering.fuzzykmeans.TestFuzzyKmeansClustering
Tests run: 8, Failures: 0, Errors: 0, Skipped: 0, Time elapsed: 39.707 sec
Running org.apache.mahout.cf.taste.impl.recommender.ItemUserAverageRecommenderTest
Tests run: 1, Failures: 0, Errors: 0, Skipped: 0, Time elapsed: 0.004 sec
Running org.apache.mahout.cf.taste.impl.common.FastIDSetTest
Tests run: 10, Failures: 0, Errors: 0, Skipped: 0, Time elapsed: 0.274 sec
Running org.apache.mahout.cf.taste.impl.model.file.FileIDMigratorTest
Tests run: 3, Failures: 0, Errors: 0, Skipped: 0, Time elapsed: 4.006 sec
Running org.apache.mahout.math.hadoop.TestDistributedRowMatrix
Tests run: 4, Failures: 0, Errors: 1, Skipped: 0, Time elapsed: 6.045 sec <<< FAILURE!
Running org.apache.mahout.cf.taste.impl.model.file.FileDataModelTest
Tests run: 9, Failures: 0, Errors: 0, Skipped: 0, Time elapsed: 3.018 sec
Running org.apache.mahout.cf.taste.impl.neighborhood.ThresholdNeighborhoodTest
Tests run: 1, Failures: 0, Errors: 0, Skipped: 0, Time elapsed: 0.002 sec
Running org.apache.mahout.cf.taste.impl.common.FastMapTest
Tests run: 13, Failures: 0, Errors: 0, Skipped: 0, Time elapsed: 0.317 sec
Running org.apache.mahout.df.mapreduce.partial.Step0JobTest
Tests run: 2, Failures: 0, Errors: 0, Skipped: 0, Time elapsed: 0.312 sec
Running org.apache.mahout.classifier.bayes.BayesClassifierSelfTest
Tests run: 2, Failures: 0, Errors: 0, Skipped: 0, Time elapsed: 13.993 sec
Running org.apache.mahout.math.hadoop.decomposer.TestDistributedLanczosSolver
Tests run: 1, Failures: 0, Errors: 0, Skipped: 0, Time elapsed: 67.341 sec
Running org.apache.mahout.cf.taste.impl.similarity.LogLikelihoodSimilarityTest
Tests run: 2, Failures: 0, Errors: 0, Skipped: 0, Time elapsed: 0.003 sec
Running org.apache.mahout.df.data.DataLoaderTest
Tests run: 4, Failures: 0, Errors: 0, Skipped: 0, Time elapsed: 0.064 sec

Results :

Tests in error: 
  testTranspose(org.apache.mahout.math.hadoop.TestDistributedRowMatrix)

Tests run: 458, Failures: 0, Errors: 1, Skipped: 0

[INFO] ------------------------------------------------------------------------
[ERROR] BUILD FAILURE
[INFO] ------------------------------------------------------------------------
[INFO] There are test failures.

Please refer to <http://hudson.zones.apache.org/hudson/job/Mahout-Quality/183/artifact/trunk/core/target/surefire-reports>
for the individual test results.
[INFO] ------------------------------------------------------------------------
[INFO] For more information, run Maven with the -e switch
[INFO] ------------------------------------------------------------------------
[INFO] Total time: 6 minutes 46 seconds
[INFO] Finished at: Thu Aug 12 03:09:27 UTC 2010
[INFO] Final Memory: 86M/441M
[INFO] ------------------------------------------------------------------------
[PMD] Skipping publisher since build result is FAILURE
[TASKS] Skipping publisher since build result is FAILURE
[FINDBUGS] Skipping publisher since build result is FAILURE
Publishing Javadoc
Archiving artifacts
Recording test results
Publishing Clover coverage report...
No Clover report will be published due to a Build Failure


Mime
View raw message