mahout-dev mailing list archives

Site index · List index
Message view « Date » · « Thread »
Top « Date » · « Thread »
From Apache Hudson Server <hud...@hudson.zones.apache.org>
Subject Build failed in Hudson: Mahout-Quality #23
Date Wed, 26 May 2010 19:57:14 GMT
See <http://hudson.zones.apache.org/hudson/job/Mahout-Quality/23/changes>

Changes:

[srowen] MAHOUT-392

------------------------------------------
[...truncated 7992 lines...]
Generating <http://hudson.zones.apache.org/hudson/job/Mahout-Quality/ws/trunk/utils/target/site/apidocs/org/apache/mahout/benchmark//package-use.html...>
Generating <http://hudson.zones.apache.org/hudson/job/Mahout-Quality/ws/trunk/utils/target/site/apidocs/org/apache/mahout/clustering/cdbw//package-use.html...>
Generating <http://hudson.zones.apache.org/hudson/job/Mahout-Quality/ws/trunk/utils/target/site/apidocs/org/apache/mahout/clustering/lda//package-use.html...>
Generating <http://hudson.zones.apache.org/hudson/job/Mahout-Quality/ws/trunk/utils/target/site/apidocs/org/apache/mahout/text//package-use.html...>
Generating <http://hudson.zones.apache.org/hudson/job/Mahout-Quality/ws/trunk/utils/target/site/apidocs/org/apache/mahout/utils//package-use.html...>
Generating <http://hudson.zones.apache.org/hudson/job/Mahout-Quality/ws/trunk/utils/target/site/apidocs/org/apache/mahout/utils/clustering//package-use.html...>
Generating <http://hudson.zones.apache.org/hudson/job/Mahout-Quality/ws/trunk/utils/target/site/apidocs/org/apache/mahout/utils/nlp/collocations/llr//package-use.html...>
Generating <http://hudson.zones.apache.org/hudson/job/Mahout-Quality/ws/trunk/utils/target/site/apidocs/org/apache/mahout/utils/vectors//package-use.html...>
Generating <http://hudson.zones.apache.org/hudson/job/Mahout-Quality/ws/trunk/utils/target/site/apidocs/org/apache/mahout/utils/vectors/arff//package-use.html...>
Generating <http://hudson.zones.apache.org/hudson/job/Mahout-Quality/ws/trunk/utils/target/site/apidocs/org/apache/mahout/utils/vectors/common//package-use.html...>
Generating <http://hudson.zones.apache.org/hudson/job/Mahout-Quality/ws/trunk/utils/target/site/apidocs/org/apache/mahout/utils/vectors/io//package-use.html...>
Generating <http://hudson.zones.apache.org/hudson/job/Mahout-Quality/ws/trunk/utils/target/site/apidocs/org/apache/mahout/utils/vectors/lucene//package-use.html...>
Generating <http://hudson.zones.apache.org/hudson/job/Mahout-Quality/ws/trunk/utils/target/site/apidocs/org/apache/mahout/utils/vectors/text//package-use.html...>
Generating <http://hudson.zones.apache.org/hudson/job/Mahout-Quality/ws/trunk/utils/target/site/apidocs/org/apache/mahout/utils/vectors/text/document//package-use.html...>
Generating <http://hudson.zones.apache.org/hudson/job/Mahout-Quality/ws/trunk/utils/target/site/apidocs/org/apache/mahout/utils/vectors/text/term//package-use.html...>
Generating <http://hudson.zones.apache.org/hudson/job/Mahout-Quality/ws/trunk/utils/target/site/apidocs/org/apache/mahout/utils/vectors/tfidf//package-use.html...>
Building index for all the packages and classes...
Generating <http://hudson.zones.apache.org/hudson/job/Mahout-Quality/ws/trunk/utils/target/site/apidocs/overview-tree.html...>
Generating <http://hudson.zones.apache.org/hudson/job/Mahout-Quality/ws/trunk/utils/target/site/apidocs/index-all.html...>
Generating <http://hudson.zones.apache.org/hudson/job/Mahout-Quality/ws/trunk/utils/target/site/apidocs/deprecated-list.html...>
Building index for all classes...
Generating <http://hudson.zones.apache.org/hudson/job/Mahout-Quality/ws/trunk/utils/target/site/apidocs/allclasses-frame.html...>
Generating <http://hudson.zones.apache.org/hudson/job/Mahout-Quality/ws/trunk/utils/target/site/apidocs/allclasses-noframe.html...>
Generating <http://hudson.zones.apache.org/hudson/job/Mahout-Quality/ws/trunk/utils/target/site/apidocs/index.html...>
Generating <http://hudson.zones.apache.org/hudson/job/Mahout-Quality/ws/trunk/utils/target/site/apidocs/overview-summary.html...>
Generating <http://hudson.zones.apache.org/hudson/job/Mahout-Quality/ws/trunk/utils/target/site/apidocs/help-doc.html...>
Generating <http://hudson.zones.apache.org/hudson/job/Mahout-Quality/ws/trunk/utils/target/site/apidocs/stylesheet.css...>
5 warnings
[WARNING] Javadoc Warnings
[WARNING] <http://hudson.zones.apache.org/hudson/job/Mahout-Quality/ws/trunk/utils/src/main/java/org/apache/mahout/utils/vectors/VectorHelper.java>:96:
warning - @return tag has no arguments.
[WARNING] <http://hudson.zones.apache.org/hudson/job/Mahout-Quality/ws/trunk/utils/src/main/java/org/apache/mahout/utils/vectors/VectorHelper.java>:82:
warning - @return tag has no arguments.
[WARNING] <http://hudson.zones.apache.org/hudson/job/Mahout-Quality/ws/trunk/utils/src/main/java/org/apache/mahout/utils/vectors/arff/MapBackedARFFModel.java>:134:
warning - @return tag has no arguments.
[WARNING] <http://hudson.zones.apache.org/hudson/job/Mahout-Quality/ws/trunk/utils/src/main/java/org/apache/mahout/utils/vectors/lucene/ClusterLabels.java>:183:
warning - @return tag has no arguments.
[WARNING] <http://hudson.zones.apache.org/hudson/job/Mahout-Quality/ws/trunk/utils/src/main/java/org/apache/mahout/utils/nlp/collocations/llr/Gram.java>:153:
warning - @return tag has no arguments.
[INFO] [checkstyle:checkstyle {execution: default-cli}]
[INFO] Starting audit...
<http://hudson.zones.apache.org/hudson/job/Mahout-Quality/ws/trunk/utils/src/main/java/org/apache/mahout/text/TextParagraphSplittingJob.java>:31:
Wrong order for 'java.io.IOException' import.
<http://hudson.zones.apache.org/hudson/job/Mahout-Quality/ws/trunk/utils/src/main/java/org/apache/mahout/text/TextParagraphSplittingJob.java>:33:
Missing a Javadoc comment.
<http://hudson.zones.apache.org/hudson/job/Mahout-Quality/ws/trunk/utils/src/main/java/org/apache/mahout/text/TextParagraphSplittingJob.java>:53:
Missing a Javadoc comment.
<http://hudson.zones.apache.org/hudson/job/Mahout-Quality/ws/trunk/utils/src/main/java/org/apache/mahout/text/TextParagraphSplittingJob.java>:59:12:
'while' is not followed by whitespace.
<http://hudson.zones.apache.org/hudson/job/Mahout-Quality/ws/trunk/utils/src/main/java/org/apache/mahout/text/TextParagraphSplittingJob.java>:60:44:
'+' is not preceded with whitespace.
<http://hudson.zones.apache.org/hudson/job/Mahout-Quality/ws/trunk/utils/src/main/java/org/apache/mahout/text/TextParagraphSplittingJob.java>:60:45:
'+' is not followed by whitespace.
<http://hudson.zones.apache.org/hudson/job/Mahout-Quality/ws/trunk/utils/src/main/java/org/apache/mahout/text/TextParagraphSplittingJob.java>:62:45:
Unnecessary parentheses around expression.
<http://hudson.zones.apache.org/hudson/job/Mahout-Quality/ws/trunk/utils/src/main/java/org/apache/mahout/text/DefaultAnalyzer.java>:27:
ctor def modifier at indentation level 8 not at correct indentation, 2
<http://hudson.zones.apache.org/hudson/job/Mahout-Quality/ws/trunk/utils/src/main/java/org/apache/mahout/text/DefaultAnalyzer.java>:28:
ctor def modifier at indentation level 8 not at correct indentation, 2
<http://hudson.zones.apache.org/hudson/job/Mahout-Quality/ws/trunk/utils/src/main/java/org/apache/mahout/text/DefaultAnalyzer.java>:30:
ctor def rcurly at indentation level 8 not at correct indentation, 2
<http://hudson.zones.apache.org/hudson/job/Mahout-Quality/ws/trunk/utils/src/main/java/org/apache/mahout/text/SparseVectorsFromSequenceFiles.java>:48:45:
'{' is not followed by whitespace.
<http://hudson.zones.apache.org/hudson/job/Mahout-Quality/ws/trunk/utils/src/main/java/org/apache/mahout/text/SparseVectorsFromSequenceFiles.java>:48:45:
'}' is not preceded with whitespace.
<http://hudson.zones.apache.org/hudson/job/Mahout-Quality/ws/trunk/utils/src/main/java/org/apache/mahout/text/SparseVectorsFromSequenceFiles.java>:50:3:
Executable statement count is 80 (max allowed is 75).
<http://hudson.zones.apache.org/hudson/job/Mahout-Quality/ws/trunk/utils/src/main/java/org/apache/mahout/text/SparseVectorsFromSequenceFiles.java>:50:3:
Method length is 155 lines (max allowed is 150).
<http://hudson.zones.apache.org/hudson/job/Mahout-Quality/ws/trunk/utils/src/main/java/org/apache/mahout/clustering/lda/LDAPrintTopics.java>:52:
Class LDAPrintTopics should be declared as final.
<http://hudson.zones.apache.org/hudson/job/Mahout-Quality/ws/trunk/utils/src/main/java/org/apache/mahout/clustering/lda/LDAPrintTopics.java>:54:
Missing a Javadoc comment.
<http://hudson.zones.apache.org/hudson/job/Mahout-Quality/ws/trunk/utils/src/main/java/org/apache/mahout/clustering/lda/LDAPrintTopics.java>:246:3:
Constructor definition in wrong order.
<http://hudson.zones.apache.org/hudson/job/Mahout-Quality/ws/trunk/utils/src/main/java/org/apache/mahout/clustering/cdbw/CDbwDriver.java>:20:8:
Unused import - java.io.File.
<http://hudson.zones.apache.org/hudson/job/Mahout-Quality/ws/trunk/utils/src/main/java/org/apache/mahout/clustering/cdbw/CDbwDriver.java>:56:
Class CDbwDriver should be declared as final.
<http://hudson.zones.apache.org/hudson/job/Mahout-Quality/ws/trunk/utils/src/main/java/org/apache/mahout/clustering/cdbw/CDbwDriver.java>:56:
Missing a Javadoc comment.
<http://hudson.zones.apache.org/hudson/job/Mahout-Quality/ws/trunk/utils/src/main/java/org/apache/mahout/clustering/cdbw/CDbwDriver.java>:81:
Line is longer than 120 characters.
<http://hudson.zones.apache.org/hudson/job/Mahout-Quality/ws/trunk/utils/src/main/java/org/apache/mahout/clustering/cdbw/CDbwDriver.java>:85:
Line is longer than 120 characters.
<http://hudson.zones.apache.org/hudson/job/Mahout-Quality/ws/trunk/utils/src/main/java/org/apache/mahout/clustering/cdbw/CDbwDriver.java>:87:
Line is longer than 120 characters.
<http://hudson.zones.apache.org/hudson/job/Mahout-Quality/ws/trunk/utils/src/main/java/org/apache/mahout/clustering/cdbw/CDbwDriver.java>:131:43:
Throws count is 7 (max allowed is 5).
<http://hudson.zones.apache.org/hudson/job/Mahout-Quality/ws/trunk/utils/src/main/java/org/apache/mahout/clustering/cdbw/CDbwDriver.java>:155:
method def throws at indentation level 6 not at correct indentation, 4
<http://hudson.zones.apache.org/hudson/job/Mahout-Quality/ws/trunk/utils/src/main/java/org/apache/mahout/clustering/cdbw/CDbwReducer.java>:35:
Line is longer than 120 characters.
<http://hudson.zones.apache.org/hudson/job/Mahout-Quality/ws/trunk/utils/src/main/java/org/apache/mahout/clustering/cdbw/CDbwReducer.java>:35:
Missing a Javadoc comment.
<http://hudson.zones.apache.org/hudson/job/Mahout-Quality/ws/trunk/utils/src/main/java/org/apache/mahout/clustering/cdbw/CDbwReducer.java>:42:
Line is longer than 120 characters.
<http://hudson.zones.apache.org/hudson/job/Mahout-Quality/ws/trunk/utils/src/main/java/org/apache/mahout/clustering/cdbw/CDbwReducer.java>:42:125:
'output' hides a field.
<http://hudson.zones.apache.org/hudson/job/Mahout-Quality/ws/trunk/utils/src/main/java/org/apache/mahout/clustering/cdbw/CDbwReducer.java>:56:60:
'referencePoints' hides a field.
<http://hudson.zones.apache.org/hudson/job/Mahout-Quality/ws/trunk/utils/src/main/java/org/apache/mahout/clustering/cdbw/CDbwEvaluator.java>:20:8:
Unused import - java.io.File.
<http://hudson.zones.apache.org/hudson/job/Mahout-Quality/ws/trunk/utils/src/main/java/org/apache/mahout/clustering/cdbw/CDbwEvaluator.java>:39:
Missing a Javadoc comment.
<http://hudson.zones.apache.org/hudson/job/Mahout-Quality/ws/trunk/utils/src/main/java/org/apache/mahout/clustering/cdbw/CDbwEvaluator.java>:88:
ctor def throws at indentation level 6 not at correct indentation, 4
<http://hudson.zones.apache.org/hudson/job/Mahout-Quality/ws/trunk/utils/src/main/java/org/apache/mahout/clustering/cdbw/CDbwEvaluator.java>:88:7:
Throws count is 8 (max allowed is 5).
<http://hudson.zones.apache.org/hudson/job/Mahout-Quality/ws/trunk/utils/src/main/java/org/apache/mahout/clustering/cdbw/CDbwEvaluator.java>:101:17:
Name 'CDbw' must match pattern '^[a-z][a-zA-Z0-9]*$'.
<http://hudson.zones.apache.org/hudson/job/Mahout-Quality/ws/trunk/utils/src/main/java/org/apache/mahout/clustering/cdbw/CDbwEvaluator.java>:122:11:
Declaring variables, return values or parameters of type 'HashMap' is not allowed.
<http://hudson.zones.apache.org/hudson/job/Mahout-Quality/ws/trunk/utils/src/main/java/org/apache/mahout/clustering/cdbw/CDbwEvaluator.java>:123:
method def throws at indentation level 6 not at correct indentation, 4
<http://hudson.zones.apache.org/hudson/job/Mahout-Quality/ws/trunk/utils/src/main/java/org/apache/mahout/clustering/cdbw/CDbwEvaluator.java>:124:5:
Declaring variables, return values or parameters of type 'HashMap' is not allowed.
<http://hudson.zones.apache.org/hudson/job/Mahout-Quality/ws/trunk/utils/src/main/java/org/apache/mahout/clustering/cdbw/CDbwEvaluator.java>:124:31:
'clusters' hides a field.
<http://hudson.zones.apache.org/hudson/job/Mahout-Quality/ws/trunk/utils/src/main/java/org/apache/mahout/clustering/cdbw/CDbwMapper.java>:43:
Missing a Javadoc comment.
<http://hudson.zones.apache.org/hudson/job/Mahout-Quality/ws/trunk/utils/src/main/java/org/apache/mahout/clustering/cdbw/CDbwMapper.java>:52:64:
Variable 'output' explicitly initialized to 'null' (default value for its type).
<http://hudson.zones.apache.org/hudson/job/Mahout-Quality/ws/trunk/utils/src/main/java/org/apache/mahout/clustering/cdbw/CDbwMapper.java>:55:
Line is longer than 120 characters.
<http://hudson.zones.apache.org/hudson/job/Mahout-Quality/ws/trunk/utils/src/main/java/org/apache/mahout/clustering/cdbw/CDbwMapper.java>:55:125:
'output' hides a field.
<http://hudson.zones.apache.org/hudson/job/Mahout-Quality/ws/trunk/utils/src/main/java/org/apache/mahout/clustering/cdbw/CDbwMapper.java>:69:
Line is longer than 120 characters.
<http://hudson.zones.apache.org/hudson/job/Mahout-Quality/ws/trunk/utils/src/main/java/org/apache/mahout/clustering/cdbw/CDbwMapper.java>:73:93:
'measure' hides a field.
<http://hudson.zones.apache.org/hudson/job/Mahout-Quality/ws/trunk/utils/src/main/java/org/apache/mahout/benchmark/VectorBenchmarks.java>:28:
Wrong order for 'java.util.Map.Entry' import.
<http://hudson.zones.apache.org/hudson/job/Mahout-Quality/ws/trunk/utils/src/main/java/org/apache/mahout/benchmark/VectorBenchmarks.java>:63:
Missing a Javadoc comment.
<http://hudson.zones.apache.org/hudson/job/Mahout-Quality/ws/trunk/utils/src/main/java/org/apache/mahout/benchmark/VectorBenchmarks.java>:181:8:
'for' is not followed by whitespace.
<http://hudson.zones.apache.org/hudson/job/Mahout-Quality/ws/trunk/utils/src/main/java/org/apache/mahout/benchmark/VectorBenchmarks.java>:181:14:
'=' is not preceded with whitespace.
<http://hudson.zones.apache.org/hudson/job/Mahout-Quality/ws/trunk/utils/src/main/java/org/apache/mahout/benchmark/VectorBenchmarks.java>:181:15:
'=' is not followed by whitespace.
<http://hudson.zones.apache.org/hudson/job/Mahout-Quality/ws/trunk/utils/src/main/java/org/apache/mahout/benchmark/VectorBenchmarks.java>:181:19:
'<' is not preceded with whitespace.
<http://hudson.zones.apache.org/hudson/job/Mahout-Quality/ws/trunk/utils/src/main/java/org/apache/mahout/benchmark/VectorBenchmarks.java>:181:20:
'<' is not followed by whitespace.
<http://hudson.zones.apache.org/hudson/job/Mahout-Quality/ws/trunk/utils/src/main/java/org/apache/mahout/benchmark/VectorBenchmarks.java>:186:8:
'for' is not followed by whitespace.
<http://hudson.zones.apache.org/hudson/job/Mahout-Quality/ws/trunk/utils/src/main/java/org/apache/mahout/benchmark/VectorBenchmarks.java>:186:14:
'=' is not preceded with whitespace.
<http://hudson.zones.apache.org/hudson/job/Mahout-Quality/ws/trunk/utils/src/main/java/org/apache/mahout/benchmark/VectorBenchmarks.java>:186:15:
'=' is not followed by whitespace.
<http://hudson.zones.apache.org/hudson/job/Mahout-Quality/ws/trunk/utils/src/main/java/org/apache/mahout/benchmark/VectorBenchmarks.java>:186:19:
'<' is not preceded with whitespace.
<http://hudson.zones.apache.org/hudson/job/Mahout-Quality/ws/trunk/utils/src/main/java/org/apache/mahout/benchmark/VectorBenchmarks.java>:186:20:
'<' is not followed by whitespace.
<http://hudson.zones.apache.org/hudson/job/Mahout-Quality/ws/trunk/utils/src/main/java/org/apache/mahout/benchmark/VectorBenchmarks.java>:191:7:
'if' is not followed by whitespace.
<http://hudson.zones.apache.org/hudson/job/Mahout-Quality/ws/trunk/utils/src/main/java/org/apache/mahout/benchmark/VectorBenchmarks.java>:192:10:
'for' is not followed by whitespace.
<http://hudson.zones.apache.org/hudson/job/Mahout-Quality/ws/trunk/utils/src/main/java/org/apache/mahout/benchmark/VectorBenchmarks.java>:196:10:
'for' is not followed by whitespace.
<http://hudson.zones.apache.org/hudson/job/Mahout-Quality/ws/trunk/utils/src/main/java/org/apache/mahout/benchmark/VectorBenchmarks.java>:468:3:
Executable statement count is 112 (max allowed is 75).
<http://hudson.zones.apache.org/hudson/job/Mahout-Quality/ws/trunk/utils/src/main/java/org/apache/mahout/benchmark/VectorBenchmarks.java>:468:3:
Method length is 160 lines (max allowed is 150).
<http://hudson.zones.apache.org/hudson/job/Mahout-Quality/ws/trunk/utils/src/main/java/org/apache/mahout/benchmark/VectorBenchmarks.java>:468:3:
NCSS for this method is 117 (max allowed is 100).
<http://hudson.zones.apache.org/hudson/job/Mahout-Quality/ws/trunk/utils/src/main/java/org/apache/mahout/utils/clustering/ClusterDumper.java>:22:8:
Unused import - java.io.FilenameFilter.
<http://hudson.zones.apache.org/hudson/job/Mahout-Quality/ws/trunk/utils/src/main/java/org/apache/mahout/utils/clustering/ClusterDumper.java>:33:8:
Unused import - java.util.SortedMap.
<http://hudson.zones.apache.org/hudson/job/Mahout-Quality/ws/trunk/utils/src/main/java/org/apache/mahout/utils/clustering/ClusterDumper.java>:51:8:
Unused import - org.apache.hadoop.io.Text.
<http://hudson.zones.apache.org/hudson/job/Mahout-Quality/ws/trunk/utils/src/main/java/org/apache/mahout/utils/clustering/ClusterDumper.java>:66:
Missing a Javadoc comment.
<http://hudson.zones.apache.org/hudson/job/Mahout-Quality/ws/trunk/utils/src/main/java/org/apache/mahout/utils/clustering/ClusterDumper.java>:84:54:
Variable 'clusterIdToPoints' explicitly initialized to 'null' (default value for its type).
<http://hudson.zones.apache.org/hudson/job/Mahout-Quality/ws/trunk/utils/src/main/java/org/apache/mahout/utils/clustering/ClusterDumper.java>:86:19:
Variable 'useJSON' explicitly initialized to 'false' (default value for its type).
<http://hudson.zones.apache.org/hudson/job/Mahout-Quality/ws/trunk/utils/src/main/java/org/apache/mahout/utils/clustering/ClusterDumper.java>:194:40:
'termDictionary' hides a field.
<http://hudson.zones.apache.org/hudson/job/Mahout-Quality/ws/trunk/utils/src/main/java/org/apache/mahout/utils/clustering/ClusterDumper.java>:222:
Line is longer than 120 characters.
<http://hudson.zones.apache.org/hudson/job/Mahout-Quality/ws/trunk/utils/src/main/java/org/apache/mahout/utils/clustering/ClusterDumper.java>:225:
Line is longer than 120 characters.
<http://hudson.zones.apache.org/hudson/job/Mahout-Quality/ws/trunk/utils/src/main/java/org/apache/mahout/utils/clustering/ClusterDumper.java>:229:
Line is longer than 120 characters.
<http://hudson.zones.apache.org/hudson/job/Mahout-Quality/ws/trunk/utils/src/main/java/org/apache/mahout/utils/clustering/ClusterDumper.java>:239:
Line is longer than 120 characters.
<http://hudson.zones.apache.org/hudson/job/Mahout-Quality/ws/trunk/utils/src/main/java/org/apache/mahout/utils/clustering/ClusterDumper.java>:311:
method def throws at indentation level 6 not at correct indentation, 4
<http://hudson.zones.apache.org/hudson/job/Mahout-Quality/ws/trunk/utils/src/main/java/org/apache/mahout/utils/clustering/ClusterDumper.java>:351:
Missing a Javadoc comment.
<http://hudson.zones.apache.org/hudson/job/Mahout-Quality/ws/trunk/utils/src/main/java/org/apache/mahout/utils/clustering/ClusterDumper.java>:351:3:
Utility classes should not have a public or default constructor.
<http://hudson.zones.apache.org/hudson/job/Mahout-Quality/ws/trunk/utils/src/main/java/org/apache/mahout/utils/clustering/ClusterDumper.java>:354:20:
Variable 'weight' explicitly initialized to '0' (default value for its type).
<http://hudson.zones.apache.org/hudson/job/Mahout-Quality/ws/trunk/utils/src/main/java/org/apache/mahout/utils/SequenceFileDumper.java>:44:
Class SequenceFileDumper should be declared as final.
<http://hudson.zones.apache.org/hudson/job/Mahout-Quality/ws/trunk/utils/src/main/java/org/apache/mahout/utils/SequenceFileDumper.java>:44:
Missing a Javadoc comment.
<http://hudson.zones.apache.org/hudson/job/Mahout-Quality/ws/trunk/utils/src/main/java/org/apache/mahout/utils/SequenceFileDumper.java>:68:
method call child at indentation level 4 not at correct indentation, 6
<http://hudson.zones.apache.org/hudson/job/Mahout-Quality/ws/trunk/utils/src/main/java/org/apache/mahout/utils/vectors/Weight.java>:20:
Missing a Javadoc comment.
<http://hudson.zones.apache.org/hudson/job/Mahout-Quality/ws/trunk/utils/src/main/java/org/apache/mahout/utils/vectors/text/DictionaryVectorizer.java>:117:22:
More than 7 parameters.
<http://hudson.zones.apache.org/hudson/job/Mahout-Quality/ws/trunk/utils/src/main/java/org/apache/mahout/utils/vectors/text/term/TFPartialVectorReducer.java>:104:7:
'if' is not followed by whitespace.
<http://hudson.zones.apache.org/hudson/job/Mahout-Quality/ws/trunk/utils/src/main/java/org/apache/mahout/utils/vectors/text/DocumentProcessor.java>:24:8:
Unused import - org.apache.hadoop.fs.FileSystem.
<http://hudson.zones.apache.org/hudson/job/Mahout-Quality/ws/trunk/utils/src/main/java/org/apache/mahout/utils/vectors/text/DocumentProcessor.java>:26:8:
Unused import - org.apache.hadoop.io.SequenceFile.
<http://hudson.zones.apache.org/hudson/job/Mahout-Quality/ws/trunk/utils/src/main/java/org/apache/mahout/utils/vectors/VectorHelper.java>:37:8:
Unused import - org.apache.mahout.utils.vectors.text.DictionaryVectorizer.
<http://hudson.zones.apache.org/hudson/job/Mahout-Quality/ws/trunk/utils/src/main/java/org/apache/mahout/utils/vectors/VectorHelper.java>:39:
Class VectorHelper should be declared as final.
<http://hudson.zones.apache.org/hudson/job/Mahout-Quality/ws/trunk/utils/src/main/java/org/apache/mahout/utils/vectors/VectorHelper.java>:39:
Missing a Javadoc comment.
<http://hudson.zones.apache.org/hudson/job/Mahout-Quality/ws/trunk/utils/src/main/java/org/apache/mahout/utils/vectors/tfidf/TFIDFPartialVectorReducer.java>:56:16:
Variable 'featureCount' explicitly initialized to '0' (default value for its type).
<http://hudson.zones.apache.org/hudson/job/Mahout-Quality/ws/trunk/utils/src/main/java/org/apache/mahout/utils/vectors/tfidf/TFIDFConverter.java>:35:8:
Unused import - org.apache.hadoop.io.WritableComparable.
<http://hudson.zones.apache.org/hudson/job/Mahout-Quality/ws/trunk/utils/src/main/java/org/apache/mahout/utils/vectors/tfidf/TFIDFConverter.java>:119:22:
More than 7 parameters.
<http://hudson.zones.apache.org/hudson/job/Mahout-Quality/ws/trunk/utils/src/main/java/org/apache/mahout/utils/vectors/tfidf/TFIDFConverter.java>:259:23:
More than 7 parameters.
<http://hudson.zones.apache.org/hudson/job/Mahout-Quality/ws/trunk/utils/src/main/java/org/apache/mahout/utils/vectors/SequenceFileVectorIterable.java>:37:19:
Variable 'transpose' explicitly initialized to 'false' (default value for its type).
<http://hudson.zones.apache.org/hudson/job/Mahout-Quality/ws/trunk/utils/src/main/java/org/apache/mahout/utils/vectors/SequenceFileVectorIterable.java>:59:
Class SeqFileIterator should be declared as final.
<http://hudson.zones.apache.org/hudson/job/Mahout-Quality/ws/trunk/utils/src/main/java/org/apache/mahout/utils/vectors/SequenceFileVectorIterable.java>:59:
Missing a Javadoc comment.
<http://hudson.zones.apache.org/hudson/job/Mahout-Quality/ws/trunk/utils/src/main/java/org/apache/mahout/utils/vectors/SequenceFileVectorIterable.java>:93:26:
'{' is not preceded with whitespace.
<http://hudson.zones.apache.org/hudson/job/Mahout-Quality/ws/trunk/utils/src/main/java/org/apache/mahout/utils/vectors/io/VectorWriter.java>:24:
Missing a Javadoc comment.
<http://hudson.zones.apache.org/hudson/job/Mahout-Quality/ws/trunk/utils/src/main/java/org/apache/mahout/utils/vectors/io/JWriterVectorWriter.java>:25:
Missing a Javadoc comment.
<http://hudson.zones.apache.org/hudson/job/Mahout-Quality/ws/trunk/utils/src/main/java/org/apache/mahout/utils/vectors/io/TermInfoWriter.java>:24:
Missing a Javadoc comment.
<http://hudson.zones.apache.org/hudson/job/Mahout-Quality/ws/trunk/utils/src/main/java/org/apache/mahout/utils/vectors/TermEntry.java>:20:
Missing a Javadoc comment.
<http://hudson.zones.apache.org/hudson/job/Mahout-Quality/ws/trunk/utils/src/main/java/org/apache/mahout/utils/vectors/TermEntry.java>:21:23:
Variable 'term' must be private and have accessor methods.
<http://hudson.zones.apache.org/hudson/job/Mahout-Quality/ws/trunk/utils/src/main/java/org/apache/mahout/utils/vectors/TermEntry.java>:22:20:
Variable 'termIdx' must be private and have accessor methods.
<http://hudson.zones.apache.org/hudson/job/Mahout-Quality/ws/trunk/utils/src/main/java/org/apache/mahout/utils/vectors/TermEntry.java>:23:20:
Variable 'docFreq' must be private and have accessor methods.
<http://hudson.zones.apache.org/hudson/job/Mahout-Quality/ws/trunk/utils/src/main/java/org/apache/mahout/utils/vectors/RowIdJob.java>:33:
Missing a Javadoc comment.
<http://hudson.zones.apache.org/hudson/job/Mahout-Quality/ws/trunk/utils/src/main/java/org/apache/mahout/utils/vectors/RowIdJob.java>:59:8:
'for' is not followed by whitespace.
<http://hudson.zones.apache.org/hudson/job/Mahout-Quality/ws/trunk/utils/src/main/java/org/apache/mahout/utils/vectors/RowIdJob.java>:61:12:
'while' is not followed by whitespace.
<http://hudson.zones.apache.org/hudson/job/Mahout-Quality/ws/trunk/utils/src/main/java/org/apache/mahout/utils/vectors/TFIDF.java>:23:
Missing a Javadoc comment.
<http://hudson.zones.apache.org/hudson/job/Mahout-Quality/ws/trunk/utils/src/main/java/org/apache/mahout/utils/vectors/arff/ARFFType.java>:20:
Missing a Javadoc comment.
<http://hudson.zones.apache.org/hudson/job/Mahout-Quality/ws/trunk/utils/src/main/java/org/apache/mahout/utils/vectors/arff/ARFFVectorIterable.java>:151:
Class ARFFIterator should be declared as final.
<http://hudson.zones.apache.org/hudson/job/Mahout-Quality/ws/trunk/utils/src/main/java/org/apache/mahout/utils/vectors/arff/ARFFVectorIterable.java>:151:
Missing a Javadoc comment.
<http://hudson.zones.apache.org/hudson/job/Mahout-Quality/ws/trunk/utils/src/main/java/org/apache/mahout/utils/vectors/arff/Driver.java>:51:
Missing a Javadoc comment.
<http://hudson.zones.apache.org/hudson/job/Mahout-Quality/ws/trunk/utils/src/main/java/org/apache/mahout/utils/vectors/arff/MapBackedARFFModel.java>:86:5:
switch without "default" clause.
<http://hudson.zones.apache.org/hudson/job/Mahout-Quality/ws/trunk/utils/src/main/java/org/apache/mahout/utils/vectors/common/PartialVectorMerger.java>:24:8:
Unused import - org.apache.hadoop.fs.FileSystem.
<http://hudson.zones.apache.org/hudson/job/Mahout-Quality/ws/trunk/utils/src/main/java/org/apache/mahout/utils/vectors/common/PartialVectorMerger.java>:26:8:
Unused import - org.apache.hadoop.io.SequenceFile.
<http://hudson.zones.apache.org/hudson/job/Mahout-Quality/ws/trunk/utils/src/main/java/org/apache/mahout/utils/vectors/common/PartialVectorMerger.java>:28:8:
Unused import - org.apache.hadoop.io.WritableComparable.
<http://hudson.zones.apache.org/hudson/job/Mahout-Quality/ws/trunk/utils/src/main/java/org/apache/mahout/utils/vectors/TermInfo.java>:22:
Missing a Javadoc comment.
<http://hudson.zones.apache.org/hudson/job/Mahout-Quality/ws/trunk/utils/src/main/java/org/apache/mahout/utils/vectors/lucene/LuceneIterable.java>:44:3:
Static variable definition in wrong order.
<http://hudson.zones.apache.org/hudson/job/Mahout-Quality/ws/trunk/utils/src/main/java/org/apache/mahout/utils/vectors/lucene/LuceneIterable.java>:44:3:
Variable access definition in wrong order.
<http://hudson.zones.apache.org/hudson/job/Mahout-Quality/ws/trunk/utils/src/main/java/org/apache/mahout/utils/vectors/lucene/LuceneIterable.java>:90:
Class TDIterator should be declared as final.
<http://hudson.zones.apache.org/hudson/job/Mahout-Quality/ws/trunk/utils/src/main/java/org/apache/mahout/utils/vectors/lucene/LuceneIterable.java>:90:
Missing a Javadoc comment.
<http://hudson.zones.apache.org/hudson/job/Mahout-Quality/ws/trunk/utils/src/main/java/org/apache/mahout/utils/vectors/lucene/ClusterLabels.java>:32:
Wrong order for 'java.util.Map.Entry' import.
<http://hudson.zones.apache.org/hudson/job/Mahout-Quality/ws/trunk/utils/src/main/java/org/apache/mahout/utils/vectors/lucene/ClusterLabels.java>:45:8:
Unused import - org.apache.lucene.index.CorruptIndexException.
<http://hudson.zones.apache.org/hudson/job/Mahout-Quality/ws/trunk/utils/src/main/java/org/apache/mahout/utils/vectors/lucene/ClusterLabels.java>:74:
Missing a Javadoc comment.
<http://hudson.zones.apache.org/hudson/job/Mahout-Quality/ws/trunk/utils/src/main/java/org/apache/mahout/utils/vectors/lucene/ClusterLabels.java>:105:3:
Variable access definition in wrong order.
<http://hudson.zones.apache.org/hudson/job/Mahout-Quality/ws/trunk/utils/src/main/java/org/apache/mahout/utils/vectors/lucene/ClusterLabels.java>:107:3:
Variable access definition in wrong order.
<http://hudson.zones.apache.org/hudson/job/Mahout-Quality/ws/trunk/utils/src/main/java/org/apache/mahout/utils/vectors/lucene/ClusterLabels.java>:119:54:
Variable 'clusterIdToPoints' explicitly initialized to 'null' (default value for its type).
<http://hudson.zones.apache.org/hudson/job/Mahout-Quality/ws/trunk/utils/src/main/java/org/apache/mahout/utils/vectors/lucene/ClusterLabels.java>:127:
Line is longer than 120 characters.
<http://hudson.zones.apache.org/hudson/job/Mahout-Quality/ws/trunk/utils/src/main/java/org/apache/mahout/utils/vectors/lucene/ClusterLabels.java>:128:
ctor def throws at indentation level 6 not at correct indentation, 4
<http://hudson.zones.apache.org/hudson/job/Mahout-Quality/ws/trunk/utils/src/main/java/org/apache/mahout/utils/vectors/lucene/ClusterLabels.java>:183:
Line is longer than 120 characters.
<http://hudson.zones.apache.org/hudson/job/Mahout-Quality/ws/trunk/utils/src/main/java/org/apache/mahout/utils/vectors/lucene/ClusterLabels.java>:269:
Line is longer than 120 characters.
<http://hudson.zones.apache.org/hudson/job/Mahout-Quality/ws/trunk/utils/src/main/java/org/apache/mahout/utils/vectors/lucene/ClusterLabels.java>:274:
Line is longer than 120 characters.
<http://hudson.zones.apache.org/hudson/job/Mahout-Quality/ws/trunk/utils/src/main/java/org/apache/mahout/utils/vectors/lucene/ClusterLabels.java>:330:
Line is longer than 120 characters.
<http://hudson.zones.apache.org/hudson/job/Mahout-Quality/ws/trunk/utils/src/main/java/org/apache/mahout/utils/vectors/lucene/ClusterLabels.java>:344:
Line is longer than 120 characters.
<http://hudson.zones.apache.org/hudson/job/Mahout-Quality/ws/trunk/utils/src/main/java/org/apache/mahout/utils/vectors/lucene/ClusterLabels.java>:353:
Line is longer than 120 characters.
<http://hudson.zones.apache.org/hudson/job/Mahout-Quality/ws/trunk/utils/src/main/java/org/apache/mahout/utils/vectors/lucene/Driver.java>:57:
Class Driver should be declared as final.
<http://hudson.zones.apache.org/hudson/job/Mahout-Quality/ws/trunk/utils/src/main/java/org/apache/mahout/utils/vectors/lucene/Driver.java>:57:
Missing a Javadoc comment.
<http://hudson.zones.apache.org/hudson/job/Mahout-Quality/ws/trunk/utils/src/main/java/org/apache/mahout/utils/vectors/lucene/Driver.java>:62:3:
Executable statement count is 82 (max allowed is 75).
<http://hudson.zones.apache.org/hudson/job/Mahout-Quality/ws/trunk/utils/src/main/java/org/apache/mahout/utils/vectors/lucene/CachedTermInfo.java>:50:63:
'{' is not preceded with whitespace.
<http://hudson.zones.apache.org/hudson/job/Mahout-Quality/ws/trunk/utils/src/main/java/org/apache/mahout/utils/vectors/lucene/CachedTermInfo.java>:54:38:
'{' is not preceded with whitespace.
<http://hudson.zones.apache.org/hudson/job/Mahout-Quality/ws/trunk/utils/src/main/java/org/apache/mahout/utils/vectors/lucene/CachedTermInfo.java>:64:32:
'field' hides a field.
<http://hudson.zones.apache.org/hudson/job/Mahout-Quality/ws/trunk/utils/src/main/java/org/apache/mahout/utils/vectors/lucene/CachedTermInfo.java>:69:40:
'field' hides a field.
<http://hudson.zones.apache.org/hudson/job/Mahout-Quality/ws/trunk/utils/src/main/java/org/apache/mahout/utils/vectors/lucene/CachedTermInfo.java>:70:43:
'{' is not preceded with whitespace.
<http://hudson.zones.apache.org/hudson/job/Mahout-Quality/ws/trunk/utils/src/main/java/org/apache/mahout/utils/vectors/lucene/TFDFMapper.java>:58:38:
'field' hides a field.
<http://hudson.zones.apache.org/hudson/job/Mahout-Quality/ws/trunk/utils/src/main/java/org/apache/mahout/utils/vectors/lucene/TFDFMapper.java>:58:49:
'numTerms' hides a field.
<http://hudson.zones.apache.org/hudson/job/Mahout-Quality/ws/trunk/utils/src/main/java/org/apache/mahout/utils/nlp/collocations/llr/GramKeyPartitioner.java>:36:3:
Instance variable definition in wrong order.
<http://hudson.zones.apache.org/hudson/job/Mahout-Quality/ws/trunk/utils/src/main/java/org/apache/mahout/utils/nlp/collocations/llr/GramKeyPartitioner.java>:40:
Line is longer than 120 characters.
<http://hudson.zones.apache.org/hudson/job/Mahout-Quality/ws/trunk/utils/src/main/java/org/apache/mahout/utils/nlp/collocations/llr/GramKeyPartitioner.java>:41:33:
'-' is not preceded with whitespace.
<http://hudson.zones.apache.org/hudson/job/Mahout-Quality/ws/trunk/utils/src/main/java/org/apache/mahout/utils/nlp/collocations/llr/GramKeyPartitioner.java>:41:34:
'-' is not followed by whitespace.
<http://hudson.zones.apache.org/hudson/job/Mahout-Quality/ws/trunk/utils/src/main/java/org/apache/mahout/utils/nlp/collocations/llr/GramKey.java>:124:49:
'-' is not preceded with whitespace.
<http://hudson.zones.apache.org/hudson/job/Mahout-Quality/ws/trunk/utils/src/main/java/org/apache/mahout/utils/nlp/collocations/llr/GramKey.java>:124:50:
'-' is not followed by whitespace.
<http://hudson.zones.apache.org/hudson/job/Mahout-Quality/ws/trunk/utils/src/main/java/org/apache/mahout/utils/nlp/collocations/llr/LLRReducer.java>:52:3:
Variable access definition in wrong order.
<http://hudson.zones.apache.org/hudson/job/Mahout-Quality/ws/trunk/utils/src/main/java/org/apache/mahout/utils/nlp/collocations/llr/LLRReducer.java>:53:3:
Variable access definition in wrong order.
<http://hudson.zones.apache.org/hudson/job/Mahout-Quality/ws/trunk/utils/src/main/java/org/apache/mahout/utils/nlp/collocations/llr/LLRReducer.java>:54:3:
Variable access definition in wrong order.
<http://hudson.zones.apache.org/hudson/job/Mahout-Quality/ws/trunk/utils/src/main/java/org/apache/mahout/utils/nlp/collocations/llr/LLRReducer.java>:112:31:
Inner assignments should be avoided.
<http://hudson.zones.apache.org/hudson/job/Mahout-Quality/ws/trunk/utils/src/main/java/org/apache/mahout/utils/nlp/collocations/llr/CollocReducer.java>:38:3:
Variable access definition in wrong order.
<http://hudson.zones.apache.org/hudson/job/Mahout-Quality/ws/trunk/utils/src/main/java/org/apache/mahout/utils/nlp/collocations/llr/CollocReducer.java>:39:3:
Variable access definition in wrong order.
<http://hudson.zones.apache.org/hudson/job/Mahout-Quality/ws/trunk/utils/src/main/java/org/apache/mahout/utils/nlp/collocations/llr/CollocReducer.java>:41:
Missing a Javadoc comment.
<http://hudson.zones.apache.org/hudson/job/Mahout-Quality/ws/trunk/utils/src/main/java/org/apache/mahout/utils/nlp/collocations/llr/CollocReducer.java>:99:5:
'}' should be on the same line.
<http://hudson.zones.apache.org/hudson/job/Mahout-Quality/ws/trunk/utils/src/main/java/org/apache/mahout/utils/nlp/collocations/llr/CollocReducer.java>:103:5:
'}' should be on the same line.
<http://hudson.zones.apache.org/hudson/job/Mahout-Quality/ws/trunk/utils/src/main/java/org/apache/mahout/utils/nlp/collocations/llr/CollocReducer.java>:156:9:
'}' should be on the same line.
<http://hudson.zones.apache.org/hudson/job/Mahout-Quality/ws/trunk/utils/src/main/java/org/apache/mahout/utils/nlp/collocations/llr/CollocReducer.java>:160:7:
'}' should be on the same line.
<http://hudson.zones.apache.org/hudson/job/Mahout-Quality/ws/trunk/utils/src/main/java/org/apache/mahout/utils/nlp/collocations/llr/CollocReducer.java>:168:11:
'}' should be on the same line.
<http://hudson.zones.apache.org/hudson/job/Mahout-Quality/ws/trunk/utils/src/main/java/org/apache/mahout/utils/nlp/collocations/llr/CollocReducer.java>:175:7:
'}' should be on the same line.
<http://hudson.zones.apache.org/hudson/job/Mahout-Quality/ws/trunk/utils/src/main/java/org/apache/mahout/utils/nlp/collocations/llr/CollocMapper.java>:48:3:
Variable access definition in wrong order.
<http://hudson.zones.apache.org/hudson/job/Mahout-Quality/ws/trunk/utils/src/main/java/org/apache/mahout/utils/nlp/collocations/llr/CollocMapper.java>:49:3:
Variable access definition in wrong order.
<http://hudson.zones.apache.org/hudson/job/Mahout-Quality/ws/trunk/utils/src/main/java/org/apache/mahout/utils/nlp/collocations/llr/CollocMapper.java>:51:
Missing a Javadoc comment.
<http://hudson.zones.apache.org/hudson/job/Mahout-Quality/ws/trunk/utils/src/main/java/org/apache/mahout/utils/nlp/collocations/llr/CollocMapper.java>:182:5:
'}' should be on the same line.
<http://hudson.zones.apache.org/hudson/job/Mahout-Quality/ws/trunk/utils/src/main/java/org/apache/mahout/utils/nlp/collocations/llr/CollocMapper.java>:187:7:
'}' should be on the same line.
<http://hudson.zones.apache.org/hudson/job/Mahout-Quality/ws/trunk/utils/src/main/java/org/apache/mahout/utils/nlp/collocations/llr/CollocDriver.java>:48:8:
Unused import - org.apache.mahout.utils.vectors.text.DictionaryVectorizer.
<http://hudson.zones.apache.org/hudson/job/Mahout-Quality/ws/trunk/utils/src/main/java/org/apache/mahout/utils/nlp/collocations/llr/CollocDriver.java>:54:
Class CollocDriver should be declared as final.
<http://hudson.zones.apache.org/hudson/job/Mahout-Quality/ws/trunk/utils/src/main/java/org/apache/mahout/utils/nlp/collocations/llr/GramKeyGroupComparator.java>:38:
Line is longer than 120 characters.
<http://hudson.zones.apache.org/hudson/job/Mahout-Quality/ws/trunk/utils/src/main/java/org/apache/mahout/utils/nlp/collocations/llr/Gram.java>:39:
Missing a Javadoc comment.
<http://hudson.zones.apache.org/hudson/job/Mahout-Quality/ws/trunk/utils/src/main/java/org/apache/mahout/utils/nlp/collocations/llr/Gram.java>:143:42:
'-' is not preceded with whitespace.
<http://hudson.zones.apache.org/hudson/job/Mahout-Quality/ws/trunk/utils/src/main/java/org/apache/mahout/utils/nlp/collocations/llr/Gram.java>:143:43:
'-' is not followed by whitespace.
<http://hudson.zones.apache.org/hudson/job/Mahout-Quality/ws/trunk/utils/src/main/java/org/apache/mahout/utils/nlp/collocations/llr/Gram.java>:197:8:
'+=' is not preceded with whitespace.
<http://hudson.zones.apache.org/hudson/job/Mahout-Quality/ws/trunk/utils/src/main/java/org/apache/mahout/utils/nlp/collocations/llr/Gram.java>:197:10:
'+=' is not followed by whitespace.
Audit done.

[INFO] There are 177 checkstyle errors.
[WARNING] Unable to locate Source XRef to link to - DISABLED
[INFO] Preparing findbugs:findbugs
[INFO] [resources:resources {execution: default-resources}]
[INFO] Using 'UTF-8' encoding to copy filtered resources.
[INFO] Copying 0 resource
[INFO] [resources:copy-resources {execution: copy-resources}]
[INFO] Using 'UTF-8' encoding to copy filtered resources.
[INFO] Copying 3 resources
[INFO] [compiler:compile {execution: default-compile}]
[INFO] Compiling 57 source files to <http://hudson.zones.apache.org/hudson/job/Mahout-Quality/23/artifact/trunk/utils/target/classes>
[INFO] ------------------------------------------------------------------------
[ERROR] BUILD FAILURE
[INFO] ------------------------------------------------------------------------
[INFO] Compilation failure
<http://hudson.zones.apache.org/hudson/job/Mahout-Quality/ws/trunk/utils/src/main/java/org/apache/mahout/text/TextParagraphSplittingJob.java>:[38,14]
cannot find symbol
symbol  : method prepareJob(org.apache.hadoop.fs.Path,org.apache.hadoop.fs.Path,java.lang.Class<org.apache.hadoop.mapreduce.lib.input.SequenceFileInputFormat>,java.lang.Class<org.apache.mahout.text.TextParagraphSplittingJob.SplitMap>,java.lang.Class<org.apache.hadoop.io.Text>,java.lang.Class<org.apache.hadoop.io.Text>,java.lang.Class<org.apache.hadoop.mapreduce.Reducer>,java.lang.Class<org.apache.hadoop.io.Text>,java.lang.Class<org.apache.hadoop.io.Text>,java.lang.Class<org.apache.hadoop.mapreduce.lib.output.SequenceFileOutputFormat>)
location: class org.apache.mahout.text.TextParagraphSplittingJob


[INFO] ------------------------------------------------------------------------
[INFO] For more information, run Maven with the -e switch
[INFO] ------------------------------------------------------------------------
[INFO] Total time: 7 minutes 2 seconds
[INFO] Finished at: Wed May 26 19:56:58 UTC 2010
[INFO] Final Memory: 107M/419M
[INFO] ------------------------------------------------------------------------
[PMD] Skipping publisher since build result is FAILURE
[TASKS] Skipping publisher since build result is FAILURE
[FINDBUGS] Skipping publisher since build result is FAILURE
Publishing Javadoc
Archiving artifacts
Publishing Clover coverage report...
No Clover report will be published due to a Build Failure


Mime
View raw message