mahout-dev mailing list archives

Site index · List index
Message view « Date » · « Thread »
Top « Date » · « Thread »
From Tamas Jambor <jambo...@googlemail.com>
Subject BUILD FAILURE
Date Thu, 06 May 2010 19:45:24 GMT
just updated the SVN to get Sean's implemetation, but now it fails to 
build the project. I haven't changed any of the configurations recently, 
so it must be a bug.

see the logs below:

   
testDriverMRIterations(org.apache.mahout.clustering.dirichlet.TestMapReduce)
   
testDriverMnRIterations(org.apache.mahout.clustering.dirichlet.TestMapReduce)
   
testDriverMnRnIterations(org.apache.mahout.clustering.dirichlet.TestMapReduce)
   
testDriverMnRnIterationsAsymmetric(org.apache.mahout.clustering.dirichlet.TestMapReduce)

Tests run: 11, Failures: 0, Errors: 4, Skipped: 0, Time elapsed: 0.932 
sec <<< FAILURE!
testDriverMRIterations(org.apache.mahout.clustering.dirichlet.TestMapReduce)  
Time elapsed: 0.079 sec <<< ERROR!
java.io.FileNotFoundException: /part-0 (Permission denied)
     at java.io.FileOutputStream.open(Native Method)
     at java.io.FileOutputStream.<init>(FileOutputStream.java:179)
     at 
org.apache.hadoop.fs.RawLocalFileSystem$LocalFSFileOutputStream.<init>(RawLocalFileSystem.java:180)
     at 
org.apache.hadoop.fs.RawLocalFileSystem$LocalFSFileOutputStream.<init>(RawLocalFileSystem.java:176)
     at 
org.apache.hadoop.fs.RawLocalFileSystem.create(RawLocalFileSystem.java:234)
     at 
org.apache.hadoop.fs.ChecksumFileSystem$ChecksumFSOutputSummer.<init>(ChecksumFileSystem.java:335)
     at 
org.apache.hadoop.fs.ChecksumFileSystem.create(ChecksumFileSystem.java:368)
     at org.apache.hadoop.fs.FileSystem.create(FileSystem.java:484)
     at 
org.apache.hadoop.io.SequenceFile$Writer.<init>(SequenceFile.java:843)
     at 
org.apache.hadoop.io.SequenceFile$Writer.<init>(SequenceFile.java:831)
     at 
org.apache.hadoop.io.SequenceFile$Writer.<init>(SequenceFile.java:823)
     at 
org.apache.mahout.clustering.dirichlet.DirichletDriver.writeInitialState(DirichletDriver.java:254)
     at 
org.apache.mahout.clustering.dirichlet.DirichletDriver.runJob(DirichletDriver.java:229)
     at 
org.apache.mahout.clustering.dirichlet.DirichletDriver.runJob(DirichletDriver.java:191)
     at 
org.apache.mahout.clustering.dirichlet.TestMapReduce.testDriverMRIterations(TestMapReduce.java:218)
     at sun.reflect.NativeMethodAccessorImpl.invoke0(Native Method)
     at 
sun.reflect.NativeMethodAccessorImpl.invoke(NativeMethodAccessorImpl.java:39)
     at 
sun.reflect.DelegatingMethodAccessorImpl.invoke(DelegatingMethodAccessorImpl.java:25)
     at java.lang.reflect.Method.invoke(Method.java:597)
     at junit.framework.TestCase.runTest(TestCase.java:168)
     at junit.framework.TestCase.runBare(TestCase.java:134)
     at junit.framework.TestResult$1.protect(TestResult.java:110)
     at junit.framework.TestResult.runProtected(TestResult.java:128)
     at junit.framework.TestResult.run(TestResult.java:113)
     at junit.framework.TestCase.run(TestCase.java:124)
     at junit.framework.TestSuite.runTest(TestSuite.java:232)
     at junit.framework.TestSuite.run(TestSuite.java:227)
     at 
org.junit.internal.runners.JUnit38ClassRunner.run(JUnit38ClassRunner.java:83)
     at 
org.apache.maven.surefire.junit4.JUnit4TestSet.execute(JUnit4TestSet.java:59)
     at 
org.apache.maven.surefire.suite.AbstractDirectoryTestSuite.executeTestSet(AbstractDirectoryTestSuite.java:115)
     at 
org.apache.maven.surefire.suite.AbstractDirectoryTestSuite.execute(AbstractDirectoryTestSuite.java:102)
     at org.apache.maven.surefire.Surefire.run(Surefire.java:180)
     at sun.reflect.NativeMethodAccessorImpl.invoke0(Native Method)
     at 
sun.reflect.NativeMethodAccessorImpl.invoke(NativeMethodAccessorImpl.java:39)
     at 
sun.reflect.DelegatingMethodAccessorImpl.invoke(DelegatingMethodAccessorImpl.java:25)
     at java.lang.reflect.Method.invoke(Method.java:597)
     at 
org.apache.maven.surefire.booter.SurefireBooter.runSuitesInProcess(SurefireBooter.java:350)
     at 
org.apache.maven.surefire.booter.SurefireBooter.main(SurefireBooter.java:1021)

testDriverMnRIterations(org.apache.mahout.clustering.dirichlet.TestMapReduce)  
Time elapsed: 0.25 sec <<< ERROR!
java.io.FileNotFoundException: /part-0 (Permission denied)
     at java.io.FileOutputStream.open(Native Method)
     at java.io.FileOutputStream.<init>(FileOutputStream.java:179)
     at 
org.apache.hadoop.fs.RawLocalFileSystem$LocalFSFileOutputStream.<init>(RawLocalFileSystem.java:180)
     at 
org.apache.hadoop.fs.RawLocalFileSystem$LocalFSFileOutputStream.<init>(RawLocalFileSystem.java:176)
     at 
org.apache.hadoop.fs.RawLocalFileSystem.create(RawLocalFileSystem.java:234)
     at 
org.apache.hadoop.fs.ChecksumFileSystem$ChecksumFSOutputSummer.<init>(ChecksumFileSystem.java:335)
     at 
org.apache.hadoop.fs.ChecksumFileSystem.create(ChecksumFileSystem.java:368)
     at org.apache.hadoop.fs.FileSystem.create(FileSystem.java:484)
     at 
org.apache.hadoop.io.SequenceFile$Writer.<init>(SequenceFile.java:843)
     at 
org.apache.hadoop.io.SequenceFile$Writer.<init>(SequenceFile.java:831)
     at 
org.apache.hadoop.io.SequenceFile$Writer.<init>(SequenceFile.java:823)
     at 
org.apache.mahout.clustering.dirichlet.DirichletDriver.writeInitialState(DirichletDriver.java:254)
     at 
org.apache.mahout.clustering.dirichlet.DirichletDriver.runJob(DirichletDriver.java:229)
     at 
org.apache.mahout.clustering.dirichlet.DirichletDriver.runJob(DirichletDriver.java:191)
     at 
org.apache.mahout.clustering.dirichlet.TestMapReduce.testDriverMnRIterations(TestMapReduce.java:256)
     at sun.reflect.NativeMethodAccessorImpl.invoke0(Native Method)
     at 
sun.reflect.NativeMethodAccessorImpl.invoke(NativeMethodAccessorImpl.java:39)
     at 
sun.reflect.DelegatingMethodAccessorImpl.invoke(DelegatingMethodAccessorImpl.java:25)
     at java.lang.reflect.Method.invoke(Method.java:597)
     at junit.framework.TestCase.runTest(TestCase.java:168)
     at junit.framework.TestCase.runBare(TestCase.java:134)
     at junit.framework.TestResult$1.protect(TestResult.java:110)
     at junit.framework.TestResult.runProtected(TestResult.java:128)
     at junit.framework.TestResult.run(TestResult.java:113)
     at junit.framework.TestCase.run(TestCase.java:124)
     at junit.framework.TestSuite.runTest(TestSuite.java:232)
     at junit.framework.TestSuite.run(TestSuite.java:227)
     at 
org.junit.internal.runners.JUnit38ClassRunner.run(JUnit38ClassRunner.java:83)
     at 
org.apache.maven.surefire.junit4.JUnit4TestSet.execute(JUnit4TestSet.java:59)
     at 
org.apache.maven.surefire.suite.AbstractDirectoryTestSuite.executeTestSet(AbstractDirectoryTestSuite.java:115)
     at 
org.apache.maven.surefire.suite.AbstractDirectoryTestSuite.execute(AbstractDirectoryTestSuite.java:102)
     at org.apache.maven.surefire.Surefire.run(Surefire.java:180)
     at sun.reflect.NativeMethodAccessorImpl.invoke0(Native Method)
     at 
sun.reflect.NativeMethodAccessorImpl.invoke(NativeMethodAccessorImpl.java:39)
     at 
sun.reflect.DelegatingMethodAccessorImpl.invoke(DelegatingMethodAccessorImpl.java:25)
     at java.lang.reflect.Method.invoke(Method.java:597)
     at 
org.apache.maven.surefire.booter.SurefireBooter.runSuitesInProcess(SurefireBooter.java:350)
     at 
org.apache.maven.surefire.booter.SurefireBooter.main(SurefireBooter.java:1021)

testDriverMnRnIterations(org.apache.mahout.clustering.dirichlet.TestMapReduce)  
Time elapsed: 0.24 sec <<< ERROR!
java.io.FileNotFoundException: /part-0 (Permission denied)
     at java.io.FileOutputStream.open(Native Method)
     at java.io.FileOutputStream.<init>(FileOutputStream.java:179)
     at 
org.apache.hadoop.fs.RawLocalFileSystem$LocalFSFileOutputStream.<init>(RawLocalFileSystem.java:180)
     at 
org.apache.hadoop.fs.RawLocalFileSystem$LocalFSFileOutputStream.<init>(RawLocalFileSystem.java:176)
     at 
org.apache.hadoop.fs.RawLocalFileSystem.create(RawLocalFileSystem.java:234)
     at 
org.apache.hadoop.fs.ChecksumFileSystem$ChecksumFSOutputSummer.<init>(ChecksumFileSystem.java:335)
     at 
org.apache.hadoop.fs.ChecksumFileSystem.create(ChecksumFileSystem.java:368)
     at org.apache.hadoop.fs.FileSystem.create(FileSystem.java:484)
     at 
org.apache.hadoop.io.SequenceFile$Writer.<init>(SequenceFile.java:843)
     at 
org.apache.hadoop.io.SequenceFile$Writer.<init>(SequenceFile.java:831)
     at 
org.apache.hadoop.io.SequenceFile$Writer.<init>(SequenceFile.java:823)
     at 
org.apache.mahout.clustering.dirichlet.DirichletDriver.writeInitialState(DirichletDriver.java:254)
     at 
org.apache.mahout.clustering.dirichlet.DirichletDriver.runJob(DirichletDriver.java:229)
     at 
org.apache.mahout.clustering.dirichlet.DirichletDriver.runJob(DirichletDriver.java:191)
     at 
org.apache.mahout.clustering.dirichlet.TestMapReduce.testDriverMnRnIterations(TestMapReduce.java:292)
     at sun.reflect.NativeMethodAccessorImpl.invoke0(Native Method)
     at 
sun.reflect.NativeMethodAccessorImpl.invoke(NativeMethodAccessorImpl.java:39)
     at 
sun.reflect.DelegatingMethodAccessorImpl.invoke(DelegatingMethodAccessorImpl.java:25)
     at java.lang.reflect.Method.invoke(Method.java:597)
     at junit.framework.TestCase.runTest(TestCase.java:168)
     at junit.framework.TestCase.runBare(TestCase.java:134)
     at junit.framework.TestResult$1.protect(TestResult.java:110)
     at junit.framework.TestResult.runProtected(TestResult.java:128)
     at junit.framework.TestResult.run(TestResult.java:113)
     at junit.framework.TestCase.run(TestCase.java:124)
     at junit.framework.TestSuite.runTest(TestSuite.java:232)
     at junit.framework.TestSuite.run(TestSuite.java:227)
     at 
org.junit.internal.runners.JUnit38ClassRunner.run(JUnit38ClassRunner.java:83)
     at 
org.apache.maven.surefire.junit4.JUnit4TestSet.execute(JUnit4TestSet.java:59)
     at 
org.apache.maven.surefire.suite.AbstractDirectoryTestSuite.executeTestSet(AbstractDirectoryTestSuite.java:115)
     at 
org.apache.maven.surefire.suite.AbstractDirectoryTestSuite.execute(AbstractDirectoryTestSuite.java:102)
     at org.apache.maven.surefire.Surefire.run(Surefire.java:180)
     at sun.reflect.NativeMethodAccessorImpl.invoke0(Native Method)
     at 
sun.reflect.NativeMethodAccessorImpl.invoke(NativeMethodAccessorImpl.java:39)
     at 
sun.reflect.DelegatingMethodAccessorImpl.invoke(DelegatingMethodAccessorImpl.java:25)
     at java.lang.reflect.Method.invoke(Method.java:597)
     at 
org.apache.maven.surefire.booter.SurefireBooter.runSuitesInProcess(SurefireBooter.java:350)
     at 
org.apache.maven.surefire.booter.SurefireBooter.main(SurefireBooter.java:1021)

testDriverMnRnIterationsAsymmetric(org.apache.mahout.clustering.dirichlet.TestMapReduce) 

Time elapsed: 0.233 sec <<< ERROR!
java.io.FileNotFoundException: /part-0 (Permission denied)
     at java.io.FileOutputStream.open(Native Method)
     at java.io.FileOutputStream.<init>(FileOutputStream.java:179)
     at 
org.apache.hadoop.fs.RawLocalFileSystem$LocalFSFileOutputStream.<init>(RawLocalFileSystem.java:180)
     at 
org.apache.hadoop.fs.RawLocalFileSystem$LocalFSFileOutputStream.<init>(RawLocalFileSystem.java:176)
     at 
org.apache.hadoop.fs.RawLocalFileSystem.create(RawLocalFileSystem.java:234)
     at 
org.apache.hadoop.fs.ChecksumFileSystem$ChecksumFSOutputSummer.<init>(ChecksumFileSystem.java:335)
     at 
org.apache.hadoop.fs.ChecksumFileSystem.create(ChecksumFileSystem.java:368)
     at org.apache.hadoop.fs.FileSystem.create(FileSystem.java:484)
     at 
org.apache.hadoop.io.SequenceFile$Writer.<init>(SequenceFile.java:843)
     at 
org.apache.hadoop.io.SequenceFile$Writer.<init>(SequenceFile.java:831)
     at 
org.apache.hadoop.io.SequenceFile$Writer.<init>(SequenceFile.java:823)
     at 
org.apache.mahout.clustering.dirichlet.DirichletDriver.writeInitialState(DirichletDriver.java:254)
     at 
org.apache.mahout.clustering.dirichlet.DirichletDriver.runJob(DirichletDriver.java:229)
     at 
org.apache.mahout.clustering.dirichlet.DirichletDriver.runJob(DirichletDriver.java:191)
     at 
org.apache.mahout.clustering.dirichlet.TestMapReduce.testDriverMnRnIterationsAsymmetric(TestMapReduce.java:328)
     at sun.reflect.NativeMethodAccessorImpl.invoke0(Native Method)
     at 
sun.reflect.NativeMethodAccessorImpl.invoke(NativeMethodAccessorImpl.java:39)
     at 
sun.reflect.DelegatingMethodAccessorImpl.invoke(DelegatingMethodAccessorImpl.java:25)
     at java.lang.reflect.Method.invoke(Method.java:597)
     at junit.framework.TestCase.runTest(TestCase.java:168)
     at junit.framework.TestCase.runBare(TestCase.java:134)
     at junit.framework.TestResult$1.protect(TestResult.java:110)
     at junit.framework.TestResult.runProtected(TestResult.java:128)
     at junit.framework.TestResult.run(TestResult.java:113)
     at junit.framework.TestCase.run(TestCase.java:124)
     at junit.framework.TestSuite.runTest(TestSuite.java:232)
     at junit.framework.TestSuite.run(TestSuite.java:227)
     at 
org.junit.internal.runners.JUnit38ClassRunner.run(JUnit38ClassRunner.java:83)
     at 
org.apache.maven.surefire.junit4.JUnit4TestSet.execute(JUnit4TestSet.java:59)
     at 
org.apache.maven.surefire.suite.AbstractDirectoryTestSuite.executeTestSet(AbstractDirectoryTestSuite.java:115)
     at 
org.apache.maven.surefire.suite.AbstractDirectoryTestSuite.execute(AbstractDirectoryTestSuite.java:102)
     at org.apache.maven.surefire.Surefire.run(Surefire.java:180)
     at sun.reflect.NativeMethodAccessorImpl.invoke0(Native Method)
     at 
sun.reflect.NativeMethodAccessorImpl.invoke(NativeMethodAccessorImpl.java:39)
     at 
sun.reflect.DelegatingMethodAccessorImpl.invoke(DelegatingMethodAccessorImpl.java:25)
     at java.lang.reflect.Method.invoke(Method.java:597)
     at 
org.apache.maven.surefire.booter.SurefireBooter.runSuitesInProcess(SurefireBooter.java:350)
     at 
org.apache.maven.surefire.booter.SurefireBooter.main(SurefireBooter.java:1021)

Mime
View raw message