mahout-dev mailing list archives

Site index · List index
Message view « Date » · « Thread »
Top « Date » · « Thread »
From Ted Dunning <ted.dunn...@gmail.com>
Subject build failure
Date Sat, 22 Aug 2009 21:17:47 GMT
I just checked out a clean version of mahout trunk.  I am using these tool
versions:

tdunning-maclt:core tdunning$ mvn -version
Maven version: 2.0.9
Java version: 1.6.0_13
OS name: "mac os x" version: "10.5.8" arch: "x86_64" Family: "mac"
tdunning-maclt:core tdunning$ java -version
java version "1.6.0_13"
Java(TM) SE Runtime Environment (build 1.6.0_13-b03-211)
Java HotSpot(TM) 64-Bit Server VM (build 11.3-b02-83, mixed mode)

mvn install at the top level got me this:

[ERROR] BUILD ERROR
[INFO]
------------------------------------------------------------------------
[INFO] 'copy-resources' was specified in an execution, but not found in the
plugin


And mvn compile in core got me this:

[INFO]
------------------------------------------------------------------------
[ERROR] BUILD FAILURE
[INFO]
------------------------------------------------------------------------
[INFO] Compilation failure

/Users/tdunning/Apache/mahout-trunk/core/src/main/java/org/apache/mahout/classifier/Classify.java:[33,29]
cannot find symbol
symbol  : class Version
location: package org.apache.lucene.util

/Users/tdunning/Apache/mahout-trunk/core/src/main/java/org/apache/mahout/classifier/Classify.java:[149,38]
cannot find symbol
symbol  : variable Version
location: class org.apache.mahout.classifier.Classify

I haven't had this before, although it has been several weeks since I built
things from scratch.

Any ideas?

-- 
Ted Dunning, CTO
DeepDyve

Mime
  • Unnamed multipart/alternative (inline, None, 0 bytes)
View raw message