lucene-solr-dev mailing list archives

Site index · List index
Message view « Date » · « Thread »
Top « Date » · « Thread »
From Apache Hudson Server <hud...@hudson.zones.apache.org>
Subject Build failed in Hudson: Solr-trunk #1117
Date Wed, 14 Apr 2010 08:27:09 GMT
See <http://hudson.zones.apache.org/hudson/job/Solr-trunk/1117/changes>

Changes:

[gsingers] LUCENE-2366, LUCENE-2367, LUCENE-2359: Fix a bunch of issues related to spatial

[rmuir] remove more references to the old trunks

[shaie] LUCENE-2386: IndexWriter commits unnecessarily on fresh Directory (take #2)

[gsingers] add a compile target to the top

[rmuir] LUCENE-1709: add ant jars for the convenience of IDE users

[rmuir] LUCENE-1709: specify output dir as temp dir, prevents junit temp files from littering
the src tree

[rmuir] LUCENE-1709: respect this variable for solr, too. for now keep the default at 2

------------------------------------------
[...truncated 6689 lines...]
    [junit] Tests run: 1, Failures: 0, Errors: 0, Time elapsed: 19.265 sec
    [junit] 
    [junit] Testsuite: org.apache.solr.handler.component.DistributedTermsComponentTest
    [junit] Tests run: 1, Failures: 0, Errors: 0, Time elapsed: 19.483 sec
    [junit] 
    [junit] Testsuite: org.apache.solr.handler.component.QueryElevationComponentTest
    [junit] Tests run: 4, Failures: 0, Errors: 0, Time elapsed: 4.306 sec
    [junit] 
    [junit] Testsuite: org.apache.solr.handler.component.SearchHandlerTest
    [junit] Tests run: 1, Failures: 0, Errors: 0, Time elapsed: 4.54 sec
    [junit] 
    [junit] Testsuite: org.apache.solr.handler.component.SpellCheckComponentTest
    [junit] Tests run: 8, Failures: 0, Errors: 0, Time elapsed: 5.532 sec
    [junit] 
    [junit] Testsuite: org.apache.solr.handler.component.StatsComponentTest
    [junit] Tests run: 1, Failures: 0, Errors: 0, Time elapsed: 9.43 sec
    [junit] 
    [junit] Testsuite: org.apache.solr.handler.component.TermVectorComponentTest
    [junit] Tests run: 4, Failures: 0, Errors: 0, Time elapsed: 3.981 sec
    [junit] 
    [junit] Testsuite: org.apache.solr.handler.component.TermsComponentTest
    [junit] Tests run: 13, Failures: 0, Errors: 0, Time elapsed: 3.928 sec
    [junit] 
    [junit] Testsuite: org.apache.solr.highlight.FastVectorHighlighterTest
    [junit] Tests run: 2, Failures: 0, Errors: 0, Time elapsed: 4.559 sec
    [junit] 
    [junit] Testsuite: org.apache.solr.highlight.HighlighterConfigTest
    [junit] Tests run: 1, Failures: 0, Errors: 0, Time elapsed: 4.086 sec
    [junit] 
    [junit] Testsuite: org.apache.solr.highlight.HighlighterTest
    [junit] Tests run: 23, Failures: 0, Errors: 0, Time elapsed: 7.456 sec
    [junit] 
    [junit] Testsuite: org.apache.solr.request.JSONWriterTest
    [junit] Tests run: 3, Failures: 0, Errors: 0, Time elapsed: 3.921 sec
    [junit] 
    [junit] Testsuite: org.apache.solr.request.SimpleFacetsLegacySortTest
    [junit] Tests run: 1, Failures: 0, Errors: 0, Time elapsed: 3.796 sec
    [junit] 
    [junit] Testsuite: org.apache.solr.request.SimpleFacetsTest
    [junit] Tests run: 6, Failures: 0, Errors: 0, Time elapsed: 13.864 sec
    [junit] 
    [junit] Testsuite: org.apache.solr.request.TestBinaryResponseWriter
    [junit] Tests run: 1, Failures: 0, Errors: 0, Time elapsed: 4.264 sec
    [junit] 
    [junit] Testsuite: org.apache.solr.request.TestFaceting
    [junit] Tests run: 3, Failures: 0, Errors: 0, Time elapsed: 22.784 sec
    [junit] 
    [junit] Testsuite: org.apache.solr.request.TestWriterPerf
    [junit] Tests run: 1, Failures: 0, Errors: 0, Time elapsed: 3.833 sec
    [junit] 
    [junit] ------------- Standard Output ---------------
    [junit] writer xml, size=6513, encodeRate=35, decodeRate=46
    [junit] writer json, size=3394, encodeRate=117, decodeRate=N/A
    [junit] writer javabin, size=1991, encodeRate=153, decodeRate=400
    [junit] ------------- ---------------- ---------------
    [junit] Testsuite: org.apache.solr.schema.BadIndexSchemaTest
    [junit] Tests run: 1, Failures: 0, Errors: 0, Time elapsed: 2.937 sec
    [junit] 
    [junit] Testsuite: org.apache.solr.schema.CopyFieldTest
    [junit] Tests run: 6, Failures: 0, Errors: 0, Time elapsed: 4.01 sec
    [junit] 
    [junit] Testsuite: org.apache.solr.schema.DateFieldTest
    [junit] Tests run: 6, Failures: 0, Errors: 0, Time elapsed: 0.702 sec
    [junit] 
    [junit] Testsuite: org.apache.solr.schema.IndexSchemaTest
    [junit] Tests run: 5, Failures: 0, Errors: 0, Time elapsed: 4.27 sec
    [junit] 
    [junit] Testsuite: org.apache.solr.schema.LegacyDateFieldTest
    [junit] Tests run: 4, Failures: 0, Errors: 0, Time elapsed: 0.538 sec
    [junit] 
    [junit] Testsuite: org.apache.solr.schema.NotRequiredUniqueKeyTest
    [junit] Tests run: 1, Failures: 0, Errors: 0, Time elapsed: 2.386 sec
    [junit] 
    [junit] ------------- Standard Error -----------------
    [junit] Apr 14, 2010 8:23:16 AM org.apache.solr.schema.IndexSchema readSchema
    [junit] SEVERE: uniqueKey should not be multivalued
    [junit] ------------- ---------------- ---------------
    [junit]  xml response was: <?xml version="1.0" encoding="UTF-8"?>
    [junit] <response>
    [junit] <lst name="responseHeader"><int name="status">0</int><int
name="QTime">19</int></lst><result name="response" numFound="6" start="0"
maxScore="0.5767566"><doc><float name="score">0.5767566</float><str
name="home_tier">41,-80</str><int name="id">41</int><int name="intDefault">42</int><arr
name="multiDefault"><str>muLti-Default</str></arr><date name="timestamp">2010-04-14T08:23:24.388Z</date></doc><doc><float
name="score">0.5767566</float><str name="home_tier">42,-80</str><int
name="id">42</int><int name="intDefault">42</int><arr name="multiDefault"><str>muLti-Default</str></arr><date
name="timestamp">2010-04-14T08:23:24.421Z</date></doc><doc><float
name="score">0.5767566</float><str name="home_tier">43,-80</str><int
name="id">43</int><int name="intDefault">42</int><arr name="multiDefault"><str>muLti-Default</str></arr><date
name="timestamp">2010-04-14T08:23:24.459Z</date></doc><doc><float
name="score">0.5767566</float><str name="home_tier">44,-80</str><int
name="id">44</int><int name="intDefault">42</int><arr name="multiDefault"><str>muLti-Default</str></arr><date
name="timestamp">2010-04-14T08:23:24.493Z</date></doc><doc><float
name="score">0.5767566</float><str name="home_tier">45,-80</str><int
name="id">45</int><int name="intDefault">42</int><arr name="multiDefault"><str>muLti-Default</str></arr><date
name="timestamp">2010-04-14T08:23:24.531Z</date></doc><doc><float
name="score">0.5767566</float><str name="home_tier">46,-80</str><int
name="id">46</int><int name="intDefault">42</int><arr name="multiDefault"><str>muLti-Default</str></arr><date
name="timestamp">2010-04-14T08:23:24.571Z</date></doc></result>
    [junit] </response>
    [junit] 
    [junit]  request was: q=home_tier:\-12.0016&fl=*,score)
    [junit] Testsuite: org.apache.solr.schema.PolyFieldTest
    [junit] Testcase: testCartesian(org.apache.solr.schema.PolyFieldTest):	FAILED
    [junit] query failed XPath: //*[@numFound='1']
    [junit]  xml response was: <?xml version="1.0" encoding="UTF-8"?>
    [junit] <response>
    [junit] <lst name="responseHeader"><int name="status">0</int><int
name="QTime">19</int></lst><result name="response" numFound="6" start="0"
maxScore="0.5767566"><doc><float name="score">0.5767566</float><str
name="home_tier">41,-80</str><int name="id">41</int><int name="intDefault">42</int><arr
name="multiDefault"><str>muLti-Default</str></arr><date name="timestamp">2010-04-14T08:23:24.388Z</date></doc><doc><float
name="score">0.5767566</float><str name="home_tier">42,-80</str><int
name="id">42</int><int name="intDefault">42</int><arr name="multiDefault"><str>muLti-Default</str></arr><date
name="timestamp">2010-04-14T08:23:24.421Z</date></doc><doc><float
name="score">0.5767566</float><str name="home_tier">43,-80</str><int
name="id">43</int><int name="intDefault">42</int><arr name="multiDefault"><str>muLti-Default</str></arr><date
name="timestamp">2010-04-14T08:23:24.459Z</date></doc><doc><float
name="score">0.5767566</float><str name="home_tier">44,-80</str><int
name="id">44</int><int name="intDefault">42</int><arr name="multiDefault"><str>muLti-Default</str></arr><date
name="timestamp">2010-04-14T08:23:24.493Z</date></doc><doc><float
name="score">0.5767566</float><str name="home_tier">45,-80</str><int
name="id">45</int><int name="intDefault">42</int><arr name="multiDefault"><str>muLti-Default</str></arr><date
name="timestamp">2010-04-14T08:23:24.531Z</date></doc><doc><float
name="score">0.5767566</float><str name="home_tier">46,-80</str><int
name="id">46</int><int name="intDefault">42</int><arr name="multiDefault"><str>muLti-Default</str></arr><date
name="timestamp">2010-04-14T08:23:24.571Z</date></doc></result>
    [junit] </response>
    [junit] 
    [junit]  request was: q=home_tier:\-12.0016&fl=*,score
    [junit] junit.framework.AssertionFailedError: query failed XPath: //*[@numFound='1']
    [junit]  xml response was: <?xml version="1.0" encoding="UTF-8"?>
    [junit] <response>
    [junit] <lst name="responseHeader"><int name="status">0</int><int
name="QTime">19</int></lst><result name="response" numFound="6" start="0"
maxScore="0.5767566"><doc><float name="score">0.5767566</float><str
name="home_tier">41,-80</str><int name="id">41</int><int name="intDefault">42</int><arr
name="multiDefault"><str>muLti-Default</str></arr><date name="timestamp">2010-04-14T08:23:24.388Z</date></doc><doc><float
name="score">0.5767566</float><str name="home_tier">42,-80</str><int
name="id">42</int><int name="intDefault">42</int><arr name="multiDefault"><str>muLti-Default</str></arr><date
name="timestamp">2010-04-14T08:23:24.421Z</date></doc><doc><float
name="score">0.5767566</float><str name="home_tier">43,-80</str><int
name="id">43</int><int name="intDefault">42</int><arr name="multiDefault"><str>muLti-Default</str></arr><date
name="timestamp">2010-04-14T08:23:24.459Z</date></doc><doc><float
name="score">0.5767566</float><str name="home_tier">44,-80</str><int
name="id">44</int><int name="intDefault">42</int><arr name="multiDefault"><str>muLti-Default</str></arr><date
name="timestamp">2010-04-14T08:23:24.493Z</date></doc><doc><float
name="score">0.5767566</float><str name="home_tier">45,-80</str><int
name="id">45</int><int name="intDefault">42</int><arr name="multiDefault"><str>muLti-Default</str></arr><date
name="timestamp">2010-04-14T08:23:24.531Z</date></doc><doc><float
name="score">0.5767566</float><str name="home_tier">46,-80</str><int
name="id">46</int><int name="intDefault">42</int><arr name="multiDefault"><str>muLti-Default</str></arr><date
name="timestamp">2010-04-14T08:23:24.571Z</date></doc></result>
    [junit] </response>
    [junit] 
    [junit]  request was: q=home_tier:\-12.0016&fl=*,score
    [junit]  xml response was: <?xml version="1.0" encoding="UTF-8"?>
    [junit] <response>
    [junit] <lst name="responseHeader"><int name="status">0</int><int
name="QTime">19</int></lst><result name="response" numFound="6" start="0"
maxScore="0.5767566"><doc><float name="score">0.5767566</float><str
name="home_tier">41,-80</str><int name="id">41</int><int name="intDefault">42</int><arr
name="multiDefault"><str>muLti-Default</str></arr><date name="timestamp">2010-04-14T08:23:24.388Z</date></doc><doc><float
name="score">0.5767566</float><str name="home_tier">42,-80</str><int
name="id">42</int><int name="intDefault">42</int><arr name="multiDefault"><str>muLti-Default</str></arr><date
name="timestamp">2010-04-14T08:23:24.421Z</date></doc><doc><float
name="score">0.5767566</float><str name="home_tier">43,-80</str><int
name="id">43</int><int name="intDefault">42</int><arr name="multiDefault"><str>muLti-Default</str></arr><date
name="timestamp">2010-04-14T08:23:24.459Z</date></doc><doc><float
name="score">0.5767566</float><str name="home_tier">44,-80</str><int
name="id">44</int><int name="intDefault">42</int><arr name="multiDefault"><str>muLti-Default</str></arr><date
name="timestamp">2010-04-14T08:23:24.493Z</date></doc><doc><float
name="score">0.5767566</float><str name="home_tier">45,-80</str><int
name="id">45</int><int name="intDefault">42</int><arr name="multiDefault"><str>muLti-Default</str></arr><date
name="timestamp">2010-04-14T08:23:24.531Z</date></doc><doc><float
name="score">0.5767566</float><str name="home_tier">46,-80</str><int
name="id">46</int><int name="intDefault">42</int><arr name="multiDefault"><str>muLti-Default</str></arr><date
name="timestamp">2010-04-14T08:23:24.571Z</date></doc></result>
    [junit] </response>
    [junit] 
    [junit]  request was: q=home_tier:\-12.0016&fl=*,score
    [junit] 	at org.apache.solr.SolrTestCaseJ4.assertQ(SolrTestCaseJ4.java:319)
    [junit] 	at org.apache.solr.SolrTestCaseJ4.assertQ(SolrTestCaseJ4.java:309)
    [junit] 	at org.apache.solr.schema.PolyFieldTest.testCartesian(PolyFieldTest.java:218)
    [junit] 
    [junit] 
    [junit] Tests run: 5, Failures: 1, Errors: 0, Time elapsed: 6.812 sec
    [junit] 
    [junit] Test org.apache.solr.schema.PolyFieldTest FAILED
    [junit] Testsuite: org.apache.solr.schema.RequiredFieldsTest
    [junit] Tests run: 3, Failures: 0, Errors: 0, Time elapsed: 4.388 sec
    [junit] 
    [junit] ------------- Standard Error -----------------
    [junit] Apr 14, 2010 8:23:28 AM org.apache.solr.schema.IndexSchema readSchema
    [junit] SEVERE: uniqueKey should not be multivalued
    [junit] ------------- ---------------- ---------------
    [junit] Testsuite: org.apache.solr.schema.TestBinaryField
    [junit] Tests run: 1, Failures: 0, Errors: 0, Time elapsed: 4.488 sec
    [junit] 
    [junit] Testsuite: org.apache.solr.schema.UUIDFieldTest
    [junit] Tests run: 1, Failures: 0, Errors: 0, Time elapsed: 0.906 sec
    [junit] 
    [junit] Testsuite: org.apache.solr.search.FunctionQParserTest
    [junit] Tests run: 1, Failures: 0, Errors: 0, Time elapsed: 2.421 sec
    [junit] 
    [junit] Testsuite: org.apache.solr.search.QueryParsingTest
    [junit] Tests run: 2, Failures: 0, Errors: 0, Time elapsed: 4.094 sec
    [junit] 
    [junit] Testsuite: org.apache.solr.search.TestDocSet
    [junit] Tests run: 2, Failures: 0, Errors: 0, Time elapsed: 1.634 sec
    [junit] 
    [junit] Testsuite: org.apache.solr.search.TestExtendedDismaxParser
    [junit] Tests run: 1, Failures: 0, Errors: 0, Time elapsed: 4.134 sec
    [junit] 
    [junit] Testsuite: org.apache.solr.search.TestFastLRUCache
    [junit] Tests run: 2, Failures: 0, Errors: 0, Time elapsed: 0.68 sec
    [junit] 
    [junit] Testsuite: org.apache.solr.search.TestIndexSearcher
    [junit] Tests run: 1, Failures: 0, Errors: 0, Time elapsed: 4.162 sec
    [junit] 
    [junit] Testsuite: org.apache.solr.search.TestQueryTypes
    [junit] Tests run: 1, Failures: 0, Errors: 0, Time elapsed: 5.327 sec
    [junit] 
    [junit] Testsuite: org.apache.solr.search.TestQueryUtils
    [junit] Tests run: 1, Failures: 0, Errors: 0, Time elapsed: 4.933 sec
    [junit] 
    [junit] Testsuite: org.apache.solr.search.TestRangeQuery
    [junit] Tests run: 2, Failures: 0, Errors: 0, Time elapsed: 36.182 sec
    [junit] 
    [junit] Testsuite: org.apache.solr.search.TestSearchPerf
    [junit] Tests run: 1, Failures: 0, Errors: 0, Time elapsed: 2.752 sec
    [junit] 
    [junit] Testsuite: org.apache.solr.search.TestSort
    [junit] Tests run: 1, Failures: 0, Errors: 0, Time elapsed: 6.786 sec
    [junit] 
    [junit] Testsuite: org.apache.solr.search.function.SortByFunctionTest
    [junit] Tests run: 1, Failures: 0, Errors: 0, Time elapsed: 4.322 sec
    [junit] 
    [junit] Testsuite: org.apache.solr.search.function.TestFunctionQuery
    [junit] Tests run: 4, Failures: 0, Errors: 0, Time elapsed: 10.328 sec
    [junit] 
    [junit] Testsuite: org.apache.solr.search.function.distance.DistanceFunctionTest
    [junit] Tests run: 2, Failures: 0, Errors: 0, Time elapsed: 4.334 sec
    [junit] 
    [junit] Testsuite: org.apache.solr.servlet.CacheHeaderTest
    [junit] Tests run: 5, Failures: 0, Errors: 0, Time elapsed: 6.111 sec
    [junit] 
    [junit] Testsuite: org.apache.solr.servlet.DirectSolrConnectionTest
    [junit] Tests run: 2, Failures: 0, Errors: 0, Time elapsed: 2.715 sec
    [junit] 
    [junit] ------------- Standard Error -----------------
    [junit] Apr 14, 2010 8:25:30 AM org.apache.solr.schema.IndexSchema readSchema
    [junit] SEVERE: uniqueKey should not be multivalued
    [junit] Apr 14, 2010 8:25:31 AM org.apache.solr.schema.IndexSchema readSchema
    [junit] SEVERE: uniqueKey should not be multivalued
    [junit] ------------- ---------------- ---------------
    [junit] Testsuite: org.apache.solr.servlet.NoCacheHeaderTest
    [junit] Tests run: 3, Failures: 0, Errors: 0, Time elapsed: 4.812 sec
    [junit] 
    [junit] Testsuite: org.apache.solr.servlet.SolrRequestParserTest
    [junit] Tests run: 4, Failures: 0, Errors: 0, Time elapsed: 3.979 sec
    [junit] 
    [junit] Testsuite: org.apache.solr.spelling.FileBasedSpellCheckerTest
    [junit] Tests run: 3, Failures: 0, Errors: 0, Time elapsed: 4.979 sec
    [junit] 
    [junit] Testsuite: org.apache.solr.spelling.IndexBasedSpellCheckerTest
    [junit] Tests run: 4, Failures: 0, Errors: 0, Time elapsed: 4.477 sec
    [junit] 
    [junit] Testsuite: org.apache.solr.spelling.SpellingQueryConverterTest
    [junit] Tests run: 4, Failures: 0, Errors: 0, Time elapsed: 0.548 sec
    [junit] 
    [junit] Testsuite: org.apache.solr.update.AutoCommitTest
    [junit] Tests run: 1, Failures: 0, Errors: 0, Time elapsed: 8.948 sec
    [junit] 
    [junit] Testsuite: org.apache.solr.update.DirectUpdateHandlerOptimizeTest
    [junit] Tests run: 1, Failures: 0, Errors: 0, Time elapsed: 4.683 sec
    [junit] 
    [junit] Testsuite: org.apache.solr.update.DirectUpdateHandlerTest
    [junit] Tests run: 7, Failures: 0, Errors: 0, Time elapsed: 12.744 sec
    [junit] 
    [junit] Testsuite: org.apache.solr.update.DocumentBuilderTest
    [junit] Tests run: 3, Failures: 0, Errors: 0, Time elapsed: 7.871 sec
    [junit] 
    [junit] Testsuite: org.apache.solr.update.TestIndexingPerformance
    [junit] Tests run: 1, Failures: 0, Errors: 0, Time elapsed: 5.791 sec
    [junit] 
    [junit] ------------- Standard Output ---------------
    [junit] includeDoc=true doc=[text, simple, text, test, text, how now brown cow, text,
what's that?, text, radical!, text, what's all this about, anyway?, text, just how fast is
this text indexing?]
    [junit] iter=1000 time=596 throughput=1677
    [junit] ------------- ---------------- ---------------
    [junit] Testsuite: org.apache.solr.update.processor.SignatureUpdateProcessorFactoryTest
    [junit] Tests run: 2, Failures: 0, Errors: 0, Time elapsed: 6.51 sec
    [junit] 
    [junit] Testsuite: org.apache.solr.update.processor.UpdateRequestProcessorFactoryTest
    [junit] Tests run: 1, Failures: 0, Errors: 0, Time elapsed: 3.787 sec
    [junit] 
    [junit] Testsuite: org.apache.solr.util.ArraysUtilsTest
    [junit] Tests run: 1, Failures: 0, Errors: 0, Time elapsed: 0.791 sec
    [junit] 
    [junit] Testsuite: org.apache.solr.util.DateMathParserTest
    [junit] Tests run: 7, Failures: 0, Errors: 0, Time elapsed: 0.619 sec
    [junit] 
    [junit] Testsuite: org.apache.solr.util.SolrPluginUtilsTest
    [junit] Tests run: 7, Failures: 0, Errors: 0, Time elapsed: 4.551 sec
    [junit] 
    [junit] Testsuite: org.apache.solr.util.TestNumberUtils
    [junit] Tests run: 1, Failures: 0, Errors: 0, Time elapsed: 1.686 sec
    [junit] 
    [junit] Testsuite: org.apache.solr.util.TestOpenBitSet
    [junit] Tests run: 3, Failures: 0, Errors: 0, Time elapsed: 2.41 sec
    [junit] 
    [junit] Testsuite: org.apache.solr.util.TestUtils
    [junit] Tests run: 3, Failures: 0, Errors: 0, Time elapsed: 0.502 sec
    [junit] 

BUILD FAILED
<http://hudson.zones.apache.org/hudson/job/Solr-trunk/ws/trunk/solr/build.xml>:389:
The following error occurred while executing this line:
<http://hudson.zones.apache.org/hudson/job/Solr-trunk/ws/trunk/solr/build.xml>:478:
Tests failed!

Total time: 20 minutes 0 seconds
Publishing Javadoc
Archiving artifacts
Recording test results
Publishing Clover coverage report...
No Clover report will be published due to a Build Failure


Mime
View raw message