lucene-solr-dev mailing list archives

Site index · List index
Message view « Date » · « Thread »
Top « Date » · « Thread »
From solr-...@lucene.apache.org
Subject Solr nightly build failure
Date Fri, 02 Apr 2010 08:12:03 GMT

set-fsdir:

init-forrest-entities:
    [mkdir] Created dir: /tmp/apache-solr-nightly/solr/build
    [mkdir] Created dir: /tmp/apache-solr-nightly/solr/build/web

compile-lucene:
     [echo] Building analyzers...
Trying to override old definition of task m2-deploy
Trying to override old definition of task invoke-javadoc

javacc-uptodate-check:

javacc-notice:

jflex-uptodate-check:

jflex-notice:

common.init:

build-lucene:
Trying to override old definition of task contrib-crawl

javacc-uptodate-check:

javacc-notice:

jflex-uptodate-check:

jflex-notice:

init:

clover.setup:

clover.info:
     [echo] 
     [echo]       Clover not found. Code coverage reports disabled.
     [echo]   	

clover:

compile-core:
    [mkdir] Created dir: /tmp/apache-solr-nightly/lucene/build/classes/java
    [javac] Compiling 409 source files to /tmp/apache-solr-nightly/lucene/build/classes/java
    [javac] Note: Some input files use or override a deprecated API.
    [javac] Note: Recompile with -Xlint:deprecation for details.
    [javac] Note: Some input files use unchecked or unsafe operations.
    [javac] Note: Recompile with -Xlint:unchecked for details.

compile-test:
    [mkdir] Created dir: /tmp/apache-solr-nightly/lucene/build/classes/test
    [javac] Compiling 224 source files to /tmp/apache-solr-nightly/lucene/build/classes/test
    [javac] Note: Some input files use or override a deprecated API.
    [javac] Note: Recompile with -Xlint:deprecation for details.
     [copy] Copying 19 files to /tmp/apache-solr-nightly/lucene/build/classes/test

init:

clover.setup:

clover.info:
     [echo] 
     [echo]       Clover not found. Code coverage reports disabled.
     [echo]   	

clover:

compile-core:
    [mkdir] Created dir: /tmp/apache-solr-nightly/lucene/build/contrib/analyzers/common/classes/java
    [javac] Compiling 127 source files to /tmp/apache-solr-nightly/lucene/build/contrib/analyzers/common/classes/java
    [javac] Note: Some input files use or override a deprecated API.
    [javac] Note: Recompile with -Xlint:deprecation for details.
    [javac] Note: Some input files use unchecked or unsafe operations.
    [javac] Note: Recompile with -Xlint:unchecked for details.
     [copy] Copying 19 files to /tmp/apache-solr-nightly/lucene/build/contrib/analyzers/common/classes/java

compile:
     [echo] Building highlighter...
Trying to override old definition of task m2-deploy
Trying to override old definition of task invoke-javadoc

build-memory:
     [echo] Highlighter building dependency contrib/memory
     [echo] Building memory...

javacc-uptodate-check:

javacc-notice:

jflex-uptodate-check:

jflex-notice:

common.init:

build-lucene:
Trying to override old definition of task contrib-crawl

javacc-uptodate-check:

javacc-notice:

jflex-uptodate-check:

jflex-notice:

init:

clover.setup:

clover.info:
     [echo] 
     [echo]       Clover not found. Code coverage reports disabled.
     [echo]   	

clover:

compile-core:

compile-test:
    [javac] Compiling 1 source file to /tmp/apache-solr-nightly/lucene/build/classes/test

init:

clover.setup:

clover.info:
     [echo] 
     [echo]       Clover not found. Code coverage reports disabled.
     [echo]   	

clover:

compile-core:
    [mkdir] Created dir: /tmp/apache-solr-nightly/lucene/build/contrib/memory/classes/java
    [javac] Compiling 1 source file to /tmp/apache-solr-nightly/lucene/build/contrib/memory/classes/java
    [javac] Note: /tmp/apache-solr-nightly/lucene/contrib/memory/src/java/org/apache/lucene/index/memory/MemoryIndex.java
uses unchecked or unsafe operations.
    [javac] Note: Recompile with -Xlint:unchecked for details.

jar-core:
      [jar] Building jar: /tmp/apache-solr-nightly/lucene/build/contrib/memory/lucene-memory-3.1-dev.jar

default:

build-queries:
     [echo] Highlighter building dependency contrib/queries
     [echo] Building queries...

javacc-uptodate-check:

javacc-notice:

jflex-uptodate-check:

jflex-notice:

common.init:

build-lucene:
Trying to override old definition of task contrib-crawl

javacc-uptodate-check:

javacc-notice:

jflex-uptodate-check:

jflex-notice:

init:

clover.setup:

clover.info:
     [echo] 
     [echo]       Clover not found. Code coverage reports disabled.
     [echo]   	

clover:

compile-core:

compile-test:
    [javac] Compiling 1 source file to /tmp/apache-solr-nightly/lucene/build/classes/test

init:

clover.setup:

clover.info:
     [echo] 
     [echo]       Clover not found. Code coverage reports disabled.
     [echo]   	

clover:

compile-core:
    [mkdir] Created dir: /tmp/apache-solr-nightly/lucene/build/contrib/queries/classes/java
    [javac] Compiling 17 source files to /tmp/apache-solr-nightly/lucene/build/contrib/queries/classes/java
    [javac] Note: /tmp/apache-solr-nightly/lucene/contrib/queries/src/java/org/apache/lucene/search/similar/MoreLikeThis.java
uses or overrides a deprecated API.
    [javac] Note: Recompile with -Xlint:deprecation for details.

jar-core:
      [jar] Building jar: /tmp/apache-solr-nightly/lucene/build/contrib/queries/lucene-queries-3.1-dev.jar

default:

javacc-uptodate-check:

javacc-notice:

jflex-uptodate-check:

jflex-notice:

common.init:

build-lucene:
Trying to override old definition of task contrib-crawl

javacc-uptodate-check:

javacc-notice:

jflex-uptodate-check:

jflex-notice:

init:

clover.setup:

clover.info:
     [echo] 
     [echo]       Clover not found. Code coverage reports disabled.
     [echo]   	

clover:

compile-core:

compile-test:
    [javac] Compiling 1 source file to /tmp/apache-solr-nightly/lucene/build/classes/test

init:

clover.setup:

clover.info:
     [echo] 
     [echo]       Clover not found. Code coverage reports disabled.
     [echo]   	

clover:

common.compile-core:
    [mkdir] Created dir: /tmp/apache-solr-nightly/lucene/build/contrib/highlighter/classes/java
    [javac] Compiling 35 source files to /tmp/apache-solr-nightly/lucene/build/contrib/highlighter/classes/java
    [javac] Note: /tmp/apache-solr-nightly/lucene/contrib/highlighter/src/java/org/apache/lucene/search/vectorhighlight/FieldTermStack.java
uses or overrides a deprecated API.
    [javac] Note: Recompile with -Xlint:deprecation for details.
    [javac] Note: /tmp/apache-solr-nightly/lucene/contrib/highlighter/src/java/org/apache/lucene/search/highlight/WeightedSpanTermExtractor.java
uses unchecked or unsafe operations.
    [javac] Note: Recompile with -Xlint:unchecked for details.

compile-core:

compile:
     [echo] Building memory...
Trying to override old definition of task m2-deploy
Trying to override old definition of task invoke-javadoc

javacc-uptodate-check:

javacc-notice:

jflex-uptodate-check:

jflex-notice:

common.init:

build-lucene:
Trying to override old definition of task contrib-crawl

javacc-uptodate-check:

javacc-notice:

jflex-uptodate-check:

jflex-notice:

init:

clover.setup:

clover.info:
     [echo] 
     [echo]       Clover not found. Code coverage reports disabled.
     [echo]   	

clover:

compile-core:

compile-test:
    [javac] Compiling 1 source file to /tmp/apache-solr-nightly/lucene/build/classes/test

init:

clover.setup:

clover.info:
     [echo] 
     [echo]       Clover not found. Code coverage reports disabled.
     [echo]   	

clover:

compile-core:

compile:
     [echo] Building misc...
Trying to override old definition of task m2-deploy
Trying to override old definition of task invoke-javadoc

javacc-uptodate-check:

javacc-notice:

jflex-uptodate-check:

jflex-notice:

common.init:

build-lucene:
Trying to override old definition of task contrib-crawl

javacc-uptodate-check:

javacc-notice:

jflex-uptodate-check:

jflex-notice:

init:

clover.setup:

clover.info:
     [echo] 
     [echo]       Clover not found. Code coverage reports disabled.
     [echo]   	

clover:

compile-core:

compile-test:
    [javac] Compiling 1 source file to /tmp/apache-solr-nightly/lucene/build/classes/test

init:

clover.setup:

clover.info:
     [echo] 
     [echo]       Clover not found. Code coverage reports disabled.
     [echo]   	

clover:

compile-core:
    [mkdir] Created dir: /tmp/apache-solr-nightly/lucene/build/contrib/misc/classes/java
    [javac] Compiling 9 source files to /tmp/apache-solr-nightly/lucene/build/contrib/misc/classes/java
    [javac] Note: Some input files use or override a deprecated API.
    [javac] Note: Recompile with -Xlint:deprecation for details.

compile:
     [echo] Building queries...
Trying to override old definition of task m2-deploy
Trying to override old definition of task invoke-javadoc

javacc-uptodate-check:

javacc-notice:

jflex-uptodate-check:

jflex-notice:

common.init:

build-lucene:
Trying to override old definition of task contrib-crawl

javacc-uptodate-check:

javacc-notice:

jflex-uptodate-check:

jflex-notice:

init:

clover.setup:

clover.info:
     [echo] 
     [echo]       Clover not found. Code coverage reports disabled.
     [echo]   	

clover:

compile-core:

compile-test:
    [javac] Compiling 1 source file to /tmp/apache-solr-nightly/lucene/build/classes/test

init:

clover.setup:

clover.info:
     [echo] 
     [echo]       Clover not found. Code coverage reports disabled.
     [echo]   	

clover:

compile-core:

compile:
     [echo] Building spatial...
Trying to override old definition of task m2-deploy
Trying to override old definition of task invoke-javadoc

build-misc:
     [echo] Misc building dependency /tmp/apache-solr-nightly/lucene/build/contrib/misc/lucene-misc-3.1-dev.jar
     [echo] Building misc...

javacc-uptodate-check:

javacc-notice:

jflex-uptodate-check:

jflex-notice:

common.init:

build-lucene:
Trying to override old definition of task contrib-crawl

javacc-uptodate-check:

javacc-notice:

jflex-uptodate-check:

jflex-notice:

init:

clover.setup:

clover.info:
     [echo] 
     [echo]       Clover not found. Code coverage reports disabled.
     [echo]   	

clover:

compile-core:

compile-test:
    [javac] Compiling 1 source file to /tmp/apache-solr-nightly/lucene/build/classes/test

init:

clover.setup:

clover.info:
     [echo] 
     [echo]       Clover not found. Code coverage reports disabled.
     [echo]   	

clover:

compile-core:

jar-core:
      [jar] Building jar: /tmp/apache-solr-nightly/lucene/build/contrib/misc/lucene-misc-3.1-dev.jar

default:

javacc-uptodate-check:

javacc-notice:

jflex-uptodate-check:

jflex-notice:

common.init:

build-lucene:
Trying to override old definition of task contrib-crawl

javacc-uptodate-check:

javacc-notice:

jflex-uptodate-check:

jflex-notice:

init:

clover.setup:

clover.info:
     [echo] 
     [echo]       Clover not found. Code coverage reports disabled.
     [echo]   	

clover:

compile-core:

compile-test:
    [javac] Compiling 1 source file to /tmp/apache-solr-nightly/lucene/build/classes/test

init:

clover.setup:

clover.info:
     [echo] 
     [echo]       Clover not found. Code coverage reports disabled.
     [echo]   	

clover:

common.compile-core:
    [mkdir] Created dir: /tmp/apache-solr-nightly/lucene/build/contrib/spatial/classes/java
    [javac] Compiling 29 source files to /tmp/apache-solr-nightly/lucene/build/contrib/spatial/classes/java

compile-core:

compile:
     [echo] Building spellchecker...
Trying to override old definition of task m2-deploy
Trying to override old definition of task invoke-javadoc

javacc-uptodate-check:

javacc-notice:

jflex-uptodate-check:

jflex-notice:

common.init:

build-lucene:
Trying to override old definition of task contrib-crawl

javacc-uptodate-check:

javacc-notice:

jflex-uptodate-check:

jflex-notice:

init:

clover.setup:

clover.info:
     [echo] 
     [echo]       Clover not found. Code coverage reports disabled.
     [echo]   	

clover:

compile-core:

compile-test:
    [javac] Compiling 1 source file to /tmp/apache-solr-nightly/lucene/build/classes/test

init:

clover.setup:

clover.info:
     [echo] 
     [echo]       Clover not found. Code coverage reports disabled.
     [echo]   	

clover:

compile-core:
    [mkdir] Created dir: /tmp/apache-solr-nightly/lucene/build/contrib/spellchecker/classes/java
    [javac] Compiling 10 source files to /tmp/apache-solr-nightly/lucene/build/contrib/spellchecker/classes/java
    [javac] Note: /tmp/apache-solr-nightly/lucene/contrib/spellchecker/src/java/org/apache/lucene/search/spell/SpellChecker.java
uses or overrides a deprecated API.
    [javac] Note: Recompile with -Xlint:deprecation for details.

compile:

compile-solrj:
    [mkdir] Created dir: /tmp/apache-solr-nightly/solr/build/solrj
    [javac] Compiling 88 source files to /tmp/apache-solr-nightly/solr/build/solrj
    [javac] Note: Some input files use or override a deprecated API.
    [javac] Note: Recompile with -Xlint:deprecation for details.
    [javac] Note: Some input files use unchecked or unsafe operations.
    [javac] Note: Recompile with -Xlint:unchecked for details.

compile:
    [mkdir] Created dir: /tmp/apache-solr-nightly/solr/build/solr
    [javac] Compiling 440 source files to /tmp/apache-solr-nightly/solr/build/solr
    [javac] Note: Some input files use or override a deprecated API.
    [javac] Note: Recompile with -Xlint:deprecation for details.
    [javac] Note: Some input files use unchecked or unsafe operations.
    [javac] Note: Recompile with -Xlint:unchecked for details.

compileTests:
    [mkdir] Created dir: /tmp/apache-solr-nightly/solr/build/tests
    [javac] Compiling 218 source files to /tmp/apache-solr-nightly/solr/build/tests
    [javac] Note: Some input files use or override a deprecated API.
    [javac] Note: Recompile with -Xlint:deprecation for details.
    [javac] Note: Some input files use unchecked or unsafe operations.
    [javac] Note: Recompile with -Xlint:unchecked for details.

dist-contrib:

init:
    [mkdir] Created dir: /tmp/apache-solr-nightly/solr/contrib/clustering/build/classes
    [mkdir] Created dir: /tmp/apache-solr-nightly/solr/contrib/clustering/lib/downloads
    [mkdir] Created dir: /tmp/apache-solr-nightly/solr/build/docs/api

compile-lucene:

init-forrest-entities:

compile-solrj:

compile:
    [javac] Compiling 1 source file to /tmp/apache-solr-nightly/solr/build/solr

compileTests:

make-manifest:
    [mkdir] Created dir: /tmp/apache-solr-nightly/solr/build/META-INF

proxy.setup:

check-files:

get-colt:
      [get] Getting: http://repo1.maven.org/maven2/colt/colt/1.2.0/colt-1.2.0.jar
      [get] To: /tmp/apache-solr-nightly/solr/contrib/clustering/lib/downloads/colt-1.2.0.jar

get-pcj:
      [get] Getting: http://repo1.maven.org/maven2/pcj/pcj/1.2/pcj-1.2.jar
      [get] To: /tmp/apache-solr-nightly/solr/contrib/clustering/lib/downloads/pcj-1.2.jar

get-nni:
      [get] Getting: http://download.carrot2.org/maven2/org/carrot2/nni/1.0.0/nni-1.0.0.jar
      [get] To: /tmp/apache-solr-nightly/solr/contrib/clustering/lib/downloads/nni-1.0.0.jar

get-simple-xml:
      [get] Getting: http://mirrors.ibiblio.org/pub/mirrors/maven2/org/simpleframework/simple-xml/1.7.3/simple-xml-1.7.3.jar
      [get] To: /tmp/apache-solr-nightly/solr/contrib/clustering/lib/downloads/simple-xml-1.7.3.jar

get-libraries:

compile:
    [javac] Compiling 7 source files to /tmp/apache-solr-nightly/solr/contrib/clustering/build/classes
    [javac] Note: /tmp/apache-solr-nightly/solr/contrib/clustering/src/main/java/org/apache/solr/handler/clustering/carrot2/CarrotClusteringEngine.java
uses or overrides a deprecated API.
    [javac] Note: Recompile with -Xlint:deprecation for details.

build:
      [jar] Building jar: /tmp/apache-solr-nightly/solr/contrib/clustering/build/apache-solr-clustering-3.1-dev.jar

dist:
     [copy] Copying 1 file to /tmp/apache-solr-nightly/solr/dist

init:
    [mkdir] Created dir: /tmp/apache-solr-nightly/solr/contrib/dataimporthandler/target/classes

compile-lucene:

init-forrest-entities:

compile-solrj:

compile:
    [javac] Compiling 1 source file to /tmp/apache-solr-nightly/solr/build/solr

make-manifest:

compile:
    [javac] Compiling 49 source files to /tmp/apache-solr-nightly/solr/contrib/dataimporthandler/target/classes
    [javac] Note: /tmp/apache-solr-nightly/solr/contrib/dataimporthandler/src/main/java/org/apache/solr/handler/dataimport/DocBuilder.java
uses or overrides a deprecated API.
    [javac] Note: Recompile with -Xlint:deprecation for details.
    [javac] Note: Some input files use unchecked or unsafe operations.
    [javac] Note: Recompile with -Xlint:unchecked for details.

compileExtras:
    [mkdir] Created dir: /tmp/apache-solr-nightly/solr/contrib/dataimporthandler/target/extras/classes
    [javac] Compiling 2 source files to /tmp/apache-solr-nightly/solr/contrib/dataimporthandler/target/extras/classes
    [javac] Note: Some input files use unchecked or unsafe operations.
    [javac] Note: Recompile with -Xlint:unchecked for details.

build:
      [jar] Building jar: /tmp/apache-solr-nightly/solr/contrib/dataimporthandler/target/apache-solr-dataimporthandler-3.1-dev.jar
      [jar] Building jar: /tmp/apache-solr-nightly/solr/contrib/dataimporthandler/target/apache-solr-dataimporthandler-extras-3.1-dev.jar

dist:
     [copy] Copying 2 files to /tmp/apache-solr-nightly/solr/build/web
    [mkdir] Created dir: /tmp/apache-solr-nightly/solr/build/web/WEB-INF/lib
     [copy] Copying 1 file to /tmp/apache-solr-nightly/solr/build/web/WEB-INF/lib
     [copy] Copying 1 file to /tmp/apache-solr-nightly/solr/dist
     [copy] Copying 1 file to /tmp/apache-solr-nightly/solr/dist

init:
    [mkdir] Created dir: /tmp/apache-solr-nightly/solr/contrib/extraction/build/classes

compile-lucene:

init-forrest-entities:

compile-solrj:

compile:
    [javac] Compiling 1 source file to /tmp/apache-solr-nightly/solr/build/solr

make-manifest:

compile:
    [javac] Compiling 6 source files to /tmp/apache-solr-nightly/solr/contrib/extraction/build/classes
    [javac] Note: /tmp/apache-solr-nightly/solr/contrib/extraction/src/main/java/org/apache/solr/handler/extraction/ExtractingDocumentLoader.java
uses or overrides a deprecated API.
    [javac] Note: Recompile with -Xlint:deprecation for details.
    [javac] Note: Some input files use unchecked or unsafe operations.
    [javac] Note: Recompile with -Xlint:unchecked for details.

build:
      [jar] Building jar: /tmp/apache-solr-nightly/solr/contrib/extraction/build/apache-solr-cell-3.1-dev.jar

dist:
     [copy] Copying 1 file to /tmp/apache-solr-nightly/solr/dist

init:
    [mkdir] Created dir: /tmp/apache-solr-nightly/solr/contrib/velocity/target/classes

compile-lucene:

init-forrest-entities:

compile-solrj:

compile:
    [javac] Compiling 1 source file to /tmp/apache-solr-nightly/solr/build/solr

make-manifest:

compile:
    [javac] Compiling 4 source files to /tmp/apache-solr-nightly/solr/contrib/velocity/target/classes
    [javac] Note: /tmp/apache-solr-nightly/solr/contrib/velocity/src/main/java/org/apache/solr/response/VelocityResponseWriter.java
uses or overrides a deprecated API.
    [javac] Note: Recompile with -Xlint:deprecation for details.

build:
      [jar] Building jar: /tmp/apache-solr-nightly/solr/contrib/velocity/src/main/solr/lib/apache-solr-velocity-3.1-dev.jar

dist:

junit-mkdir:
    [mkdir] Created dir: /tmp/apache-solr-nightly/solr/build/test-results

junit-sequential:
    [junit] Exception in thread "main" java.lang.RuntimeException: Failed to acquire random
test lock; please verify filesystem for lock directory '/var/tmp/lucene_junit_lock' supports
locking
    [junit] 	at org.apache.lucene.store.NativeFSLockFactory.acquireTestLock(NativeFSLockFactory.java:88)
    [junit] 	at org.apache.lucene.store.NativeFSLockFactory.makeLock(NativeFSLockFactory.java:127)
    [junit] 	at org.apache.lucene.util.LuceneJUnitResultFormatter.<init>(LuceneJUnitResultFormatter.java:74)
    [junit] 	at sun.reflect.NativeConstructorAccessorImpl.newInstance0(Native Method)
    [junit] 	at sun.reflect.NativeConstructorAccessorImpl.newInstance(NativeConstructorAccessorImpl.java:39)
    [junit] 	at sun.reflect.DelegatingConstructorAccessorImpl.newInstance(DelegatingConstructorAccessorImpl.java:27)
    [junit] 	at java.lang.reflect.Constructor.newInstance(Constructor.java:494)
    [junit] 	at java.lang.Class.newInstance0(Class.java:350)
    [junit] 	at java.lang.Class.newInstance(Class.java:303)
    [junit] 	at org.apache.tools.ant.taskdefs.optional.junit.FormatterElement.createFormatter(FormatterElement.java:248)
    [junit] 	at org.apache.tools.ant.taskdefs.optional.junit.FormatterElement.createFormatter(FormatterElement.java:214)
    [junit] 	at org.apache.tools.ant.taskdefs.optional.junit.JUnitTestRunner.transferFormatters(JUnitTestRunner.java:818)
    [junit] 	at org.apache.tools.ant.taskdefs.optional.junit.JUnitTestRunner.launch(JUnitTestRunner.java:910)
    [junit] 	at org.apache.tools.ant.taskdefs.optional.junit.JUnitTestRunner.main(JUnitTestRunner.java:766)
    [junit] Caused by: org.apache.lucene.store.LockReleaseFailedException: Cannot forcefully
unlock a NativeFSLock which is held by another indexer component: /var/tmp/lucene_junit_lock/lucene--hnc9v9-test.lock
    [junit] 	at org.apache.lucene.store.NativeFSLock.release(NativeFSLockFactory.java:321)
    [junit] 	at org.apache.lucene.store.NativeFSLockFactory.acquireTestLock(NativeFSLockFactory.java:86)
    [junit] 	... 13 more

BUILD FAILED
/tmp/apache-solr-nightly/solr/build.xml:389: The following error occurred while executing
this line:
/tmp/apache-solr-nightly/solr/build.xml:450: java.lang.RuntimeException: Failed to acquire
random test lock; please verify filesystem for lock directory '/var/tmp/lucene_junit_lock'
supports locking

Total time: 2 minutes 1 second



Mime
View raw message