lucene-solr-dev mailing list archives

Site index · List index
Message view « Date » · « Thread »
Top « Date » · « Thread »
From Yonik Seeley <yo...@lucidimagination.com>
Subject Re: Solr nightly build failure
Date Sat, 24 Oct 2009 13:40:20 GMT
The exception:

Testcase: testCacheControl took 6.011 sec
        Caused an ERROR
The host did not accept the connection within timeout of 100 ms
org.apache.commons.httpclient.ConnectTimeoutException: The host did
not accept the connection within timeout of 100 ms
        at org.apache.commons.httpclient.protocol.ReflectionSocketFactory.createSocket(ReflectionSocketFactory.java:155)
        at org.apache.commons.httpclient.protocol.DefaultProtocolSocketFactory.createSocket(DefaultProtocolSocketFactory.java:125)
        at org.apache.commons.httpclient.HttpConnection.open(HttpConnection.java:707)
        at org.apache.commons.httpclient.MultiThreadedHttpConnectionManager$HttpConnectionAdapter.open(MultiThreadedHttpConnectionManager.java:1361)
        at org.apache.commons.httpclient.HttpMethodDirector.executeWithRetry(HttpMethodDirector.java:387)
        at org.apache.commons.httpclient.HttpMethodDirector.executeMethod(HttpMethodDirector.java:171)
        at org.apache.commons.httpclient.HttpClient.executeMethod(HttpClient.java:397)
        at org.apache.commons.httpclient.HttpClient.executeMethod(HttpClient.java:323)
        at org.apache.solr.servlet.CacheHeaderTest.doCacheControl(CacheHeaderTest.java:218)
        at org.apache.solr.servlet.CacheHeaderTestBase.testCacheControl(CacheHeaderTestBase.java:154)
Caused by: java.net.SocketTimeoutException: connect timed out
        at java.net.PlainSocketImpl.socketConnect(Native Method)
        at java.net.PlainSocketImpl.doConnect(PlainSocketImpl.java:333)
        at java.net.PlainSocketImpl.connectToAddress(PlainSocketImpl.java:195)
        at java.net.PlainSocketImpl.connect(PlainSocketImpl.java:182)
        at java.net.SocksSocketImpl.connect(SocksSocketImpl.java:366)
        at java.net.Socket.connect(Socket.java:507)
        at org.apache.commons.httpclient.protocol.ReflectionSocketFactory.createSocket(ReflectionSocketFactory.java:140)



-Yonik
http://www.lucidimagination.com



On Sat, Oct 24, 2009 at 4:42 AM,  <solr-dev@lucene.apache.org> wrote:
>
> init-forrest-entities:
>    [mkdir] Created dir: /tmp/apache-solr-nightly/build
>    [mkdir] Created dir: /tmp/apache-solr-nightly/build/web
>
> compile-solrj:
>    [mkdir] Created dir: /tmp/apache-solr-nightly/build/solrj
>    [javac] Compiling 87 source files to /tmp/apache-solr-nightly/build/solrj
>    [javac] Note: Some input files use or override a deprecated API.
>    [javac] Note: Recompile with -Xlint:deprecation for details.
>    [javac] Note: Some input files use unchecked or unsafe operations.
>    [javac] Note: Recompile with -Xlint:unchecked for details.
>
> compile:
>    [mkdir] Created dir: /tmp/apache-solr-nightly/build/solr
>    [javac] Compiling 389 source files to /tmp/apache-solr-nightly/build/solr
>    [javac] Note: Some input files use or override a deprecated API.
>    [javac] Note: Recompile with -Xlint:deprecation for details.
>    [javac] Note: Some input files use unchecked or unsafe operations.
>    [javac] Note: Recompile with -Xlint:unchecked for details.
>
> compileTests:
>    [mkdir] Created dir: /tmp/apache-solr-nightly/build/tests
>    [javac] Compiling 177 source files to /tmp/apache-solr-nightly/build/tests
>    [javac] Note: Some input files use or override a deprecated API.
>    [javac] Note: Recompile with -Xlint:deprecation for details.
>    [javac] Note: Some input files use unchecked or unsafe operations.
>    [javac] Note: Recompile with -Xlint:unchecked for details.
>
> dist-contrib:
>
> init:
>    [mkdir] Created dir: /tmp/apache-solr-nightly/contrib/clustering/build/classes
>    [mkdir] Created dir: /tmp/apache-solr-nightly/contrib/clustering/lib/downloads
>    [mkdir] Created dir: /tmp/apache-solr-nightly/build/docs/api
>
> init-forrest-entities:
>
> compile-solrj:
>
> compile:
>    [javac] Compiling 1 source file to /tmp/apache-solr-nightly/build/solr
>    [javac] Note: /tmp/apache-solr-nightly/src/java/org/apache/solr/search/DocSetHitCollector.java
uses or overrides a deprecated API.
>    [javac] Note: Recompile with -Xlint:deprecation for details.
>
> make-manifest:
>    [mkdir] Created dir: /tmp/apache-solr-nightly/build/META-INF
>
> proxy.setup:
>
> check-files:
>
> get-colt:
>      [get] Getting: http://repo1.maven.org/maven2/colt/colt/1.2.0/colt-1.2.0.jar
>      [get] To: /tmp/apache-solr-nightly/contrib/clustering/lib/downloads/colt-1.2.0.jar
>
> get-pcj:
>      [get] Getting: http://repo1.maven.org/maven2/pcj/pcj/1.2/pcj-1.2.jar
>      [get] To: /tmp/apache-solr-nightly/contrib/clustering/lib/downloads/pcj-1.2.jar
>
> get-nni:
>      [get] Getting: http://download.carrot2.org/maven2/org/carrot2/nni/1.0.0/nni-1.0.0.jar
>      [get] To: /tmp/apache-solr-nightly/contrib/clustering/lib/downloads/nni-1.0.0.jar
>
> get-simple-xml:
>      [get] Getting: http://mirrors.ibiblio.org/pub/mirrors/maven2/org/simpleframework/simple-xml/1.7.3/simple-xml-1.7.3.jar
>      [get] To: /tmp/apache-solr-nightly/contrib/clustering/lib/downloads/simple-xml-1.7.3.jar
>
> get-libraries:
>
> compile:
>    [javac] Compiling 7 source files to /tmp/apache-solr-nightly/contrib/clustering/build/classes
>    [javac] Note: /tmp/apache-solr-nightly/contrib/clustering/src/main/java/org/apache/solr/handler/clustering/carrot2/CarrotClusteringEngine.java
uses or overrides a deprecated API.
>    [javac] Note: Recompile with -Xlint:deprecation for details.
>
> build:
>      [jar] Building jar: /tmp/apache-solr-nightly/contrib/clustering/build/apache-solr-clustering-1.4-dev.jar
>
> dist:
>     [copy] Copying 1 file to /tmp/apache-solr-nightly/dist
>
> init:
>    [mkdir] Created dir: /tmp/apache-solr-nightly/contrib/dataimporthandler/target/classes
>
> init-forrest-entities:
>
> compile-solrj:
>
> compile:
>    [javac] Compiling 1 source file to /tmp/apache-solr-nightly/build/solr
>    [javac] Note: /tmp/apache-solr-nightly/src/java/org/apache/solr/search/DocSetHitCollector.java
uses or overrides a deprecated API.
>    [javac] Note: Recompile with -Xlint:deprecation for details.
>
> make-manifest:
>
> compile:
>    [javac] Compiling 43 source files to /tmp/apache-solr-nightly/contrib/dataimporthandler/target/classes
>    [javac] Note: Some input files use or override a deprecated API.
>    [javac] Note: Recompile with -Xlint:deprecation for details.
>    [javac] Note: Some input files use unchecked or unsafe operations.
>    [javac] Note: Recompile with -Xlint:unchecked for details.
>
> compileExtras:
>    [mkdir] Created dir: /tmp/apache-solr-nightly/contrib/dataimporthandler/target/extras/classes
>    [javac] Compiling 1 source file to /tmp/apache-solr-nightly/contrib/dataimporthandler/target/extras/classes
>    [javac] Note: /tmp/apache-solr-nightly/contrib/dataimporthandler/src/extras/main/java/org/apache/solr/handler/dataimport/MailEntityProcessor.java
uses unchecked or unsafe operations.
>    [javac] Note: Recompile with -Xlint:unchecked for details.
>
> build:
>      [jar] Building jar: /tmp/apache-solr-nightly/contrib/dataimporthandler/target/apache-solr-dataimporthandler-1.4-dev.jar
>      [jar] Building jar: /tmp/apache-solr-nightly/contrib/dataimporthandler/target/apache-solr-dataimporthandler-extras-1.4-dev.jar
>
> dist:
>     [copy] Copying 2 files to /tmp/apache-solr-nightly/build/web
>    [mkdir] Created dir: /tmp/apache-solr-nightly/build/web/WEB-INF/lib
>     [copy] Copying 1 file to /tmp/apache-solr-nightly/build/web/WEB-INF/lib
>     [copy] Copying 1 file to /tmp/apache-solr-nightly/dist
>     [copy] Copying 1 file to /tmp/apache-solr-nightly/dist
>
> init:
>    [mkdir] Created dir: /tmp/apache-solr-nightly/contrib/extraction/build/classes
>
> init-forrest-entities:
>
> compile-solrj:
>
> compile:
>    [javac] Compiling 1 source file to /tmp/apache-solr-nightly/build/solr
>    [javac] Note: /tmp/apache-solr-nightly/src/java/org/apache/solr/search/DocSetHitCollector.java
uses or overrides a deprecated API.
>    [javac] Note: Recompile with -Xlint:deprecation for details.
>
> make-manifest:
>
> compile:
>    [javac] Compiling 6 source files to /tmp/apache-solr-nightly/contrib/extraction/build/classes
>    [javac] Note: /tmp/apache-solr-nightly/contrib/extraction/src/main/java/org/apache/solr/handler/extraction/ExtractingDocumentLoader.java
uses unchecked or unsafe operations.
>    [javac] Note: Recompile with -Xlint:unchecked for details.
>
> build:
>      [jar] Building jar: /tmp/apache-solr-nightly/contrib/extraction/build/apache-solr-cell-1.4-dev.jar
>
> dist:
>     [copy] Copying 1 file to /tmp/apache-solr-nightly/dist
>
> init:
>    [mkdir] Created dir: /tmp/apache-solr-nightly/contrib/velocity/target/classes
>
> init-forrest-entities:
>
> compile-solrj:
>
> compile:
>    [javac] Compiling 1 source file to /tmp/apache-solr-nightly/build/solr
>    [javac] Note: /tmp/apache-solr-nightly/src/java/org/apache/solr/search/DocSetHitCollector.java
uses or overrides a deprecated API.
>    [javac] Note: Recompile with -Xlint:deprecation for details.
>
> make-manifest:
>
> compile:
>    [javac] Compiling 4 source files to /tmp/apache-solr-nightly/contrib/velocity/target/classes
>    [javac] Note: /tmp/apache-solr-nightly/contrib/velocity/src/main/java/org/apache/solr/request/VelocityResponseWriter.java
uses or overrides a deprecated API.
>    [javac] Note: Recompile with -Xlint:deprecation for details.
>
> build:
>      [jar] Building jar: /tmp/apache-solr-nightly/contrib/velocity/src/main/solr/lib/apache-solr-velocity-1.4-dev.jar
>
> dist:
>
> junit:
>    [mkdir] Created dir: /tmp/apache-solr-nightly/build/test-results
>    [junit] Running org.apache.solr.BasicFunctionalityTest
>    [junit] Tests run: 20, Failures: 0, Errors: 0, Time elapsed: 72.689 sec
>    [junit] Running org.apache.solr.ConvertedLegacyTest
>    [junit] Tests run: 1, Failures: 0, Errors: 0, Time elapsed: 33.404 sec
>    [junit] Running org.apache.solr.DisMaxRequestHandlerTest
>    [junit] Tests run: 3, Failures: 0, Errors: 0, Time elapsed: 20.124 sec
>    [junit] Running org.apache.solr.EchoParamsTest
>    [junit] Tests run: 4, Failures: 0, Errors: 0, Time elapsed: 6.149 sec
>    [junit] Running org.apache.solr.MinimalSchemaTest
>    [junit] Tests run: 3, Failures: 0, Errors: 0, Time elapsed: 11.687 sec
>    [junit] Running org.apache.solr.OutputWriterTest
>    [junit] Tests run: 3, Failures: 0, Errors: 0, Time elapsed: 5.453 sec
>    [junit] Running org.apache.solr.SampleTest
>    [junit] Tests run: 2, Failures: 0, Errors: 0, Time elapsed: 6.645 sec
>    [junit] Running org.apache.solr.SolrInfoMBeanTest
>    [junit] Tests run: 1, Failures: 0, Errors: 0, Time elapsed: 0.745 sec
>    [junit] Running org.apache.solr.TestDistributedSearch
>    [junit] Tests run: 1, Failures: 0, Errors: 0, Time elapsed: 136.612 sec
>    [junit] Running org.apache.solr.TestPluginEnable
>    [junit] Tests run: 1, Failures: 0, Errors: 0, Time elapsed: 4.867 sec
>    [junit] Running org.apache.solr.TestSolrCoreProperties
>    [junit] Tests run: 1, Failures: 0, Errors: 0, Time elapsed: 10.292 sec
>    [junit] Running org.apache.solr.TestTrie
>    [junit] Tests run: 8, Failures: 0, Errors: 0, Time elapsed: 45.529 sec
>    [junit] Running org.apache.solr.analysis.CommonGramsFilterFactoryTest
>    [junit] Tests run: 1, Failures: 0, Errors: 0, Time elapsed: 8.656 sec
>    [junit] Running org.apache.solr.analysis.CommonGramsFilterTest
>    [junit] Tests run: 4, Failures: 0, Errors: 0, Time elapsed: 0.087 sec
>    [junit] Running org.apache.solr.analysis.CommonGramsQueryFilterFactoryTest
>    [junit] Tests run: 1, Failures: 0, Errors: 0, Time elapsed: 8.374 sec
>    [junit] Running org.apache.solr.analysis.DoubleMetaphoneFilterFactoryTest
>    [junit] Tests run: 2, Failures: 0, Errors: 0, Time elapsed: 0.093 sec
>    [junit] Running org.apache.solr.analysis.DoubleMetaphoneFilterTest
>    [junit] Tests run: 6, Failures: 0, Errors: 0, Time elapsed: 0.057 sec
>    [junit] Running org.apache.solr.analysis.EnglishPorterFilterFactoryTest
>    [junit] Tests run: 2, Failures: 0, Errors: 0, Time elapsed: 8.353 sec
>    [junit] Running org.apache.solr.analysis.HTMLStripCharFilterTest
>    [junit] Tests run: 10, Failures: 0, Errors: 0, Time elapsed: 0.189 sec
>    [junit] Running org.apache.solr.analysis.LengthFilterTest
>    [junit] Tests run: 1, Failures: 0, Errors: 0, Time elapsed: 3.74 sec
>    [junit] Running org.apache.solr.analysis.SnowballPorterFilterFactoryTest
>    [junit] Tests run: 2, Failures: 0, Errors: 0, Time elapsed: 3.468 sec
>    [junit] Running org.apache.solr.analysis.TestBufferedTokenStream
>    [junit] Tests run: 3, Failures: 0, Errors: 0, Time elapsed: 7.195 sec
>    [junit] Running org.apache.solr.analysis.TestCapitalizationFilter
>    [junit] Tests run: 2, Failures: 0, Errors: 0, Time elapsed: 2.214 sec
>    [junit] Running org.apache.solr.analysis.TestDelimitedPayloadTokenFilterFactory
>    [junit] Tests run: 2, Failures: 0, Errors: 0, Time elapsed: 14.639 sec
>    [junit] Running org.apache.solr.analysis.TestHyphenatedWordsFilter
>    [junit] Tests run: 1, Failures: 0, Errors: 0, Time elapsed: 6.154 sec
>    [junit] Running org.apache.solr.analysis.TestKeepFilterFactory
>    [junit] Tests run: 1, Failures: 0, Errors: 0, Time elapsed: 4.591 sec
>    [junit] Running org.apache.solr.analysis.TestKeepWordFilter
>    [junit] Tests run: 1, Failures: 0, Errors: 0, Time elapsed: 1.588 sec
>    [junit] Running org.apache.solr.analysis.TestMappingCharFilterFactory
>    [junit] Tests run: 1, Failures: 0, Errors: 0, Time elapsed: 0.05 sec
>    [junit] Running org.apache.solr.analysis.TestMultiWordSynonyms
>    [junit] Tests run: 1, Failures: 0, Errors: 0, Time elapsed: 0.066 sec
>    [junit] Running org.apache.solr.analysis.TestPatternReplaceFilter
>    [junit] Tests run: 5, Failures: 0, Errors: 0, Time elapsed: 7.445 sec
>    [junit] Running org.apache.solr.analysis.TestPatternTokenizerFactory
>    [junit] Tests run: 2, Failures: 0, Errors: 0, Time elapsed: 2.224 sec
>    [junit] Running org.apache.solr.analysis.TestPhoneticFilter
>    [junit] Tests run: 2, Failures: 0, Errors: 0, Time elapsed: 3.728 sec
>    [junit] Running org.apache.solr.analysis.TestRemoveDuplicatesTokenFilter
>    [junit] Tests run: 3, Failures: 0, Errors: 0, Time elapsed: 7.052 sec
>    [junit] Running org.apache.solr.analysis.TestReversedWildcardFilterFactory
>    [junit] Tests run: 3, Failures: 0, Errors: 0, Time elapsed: 4.436 sec
>    [junit] Running org.apache.solr.analysis.TestStopFilterFactory
>    [junit] Tests run: 1, Failures: 0, Errors: 0, Time elapsed: 5.191 sec
>    [junit] Running org.apache.solr.analysis.TestSynonymFilter
>    [junit] Tests run: 7, Failures: 0, Errors: 0, Time elapsed: 12.212 sec
>    [junit] Running org.apache.solr.analysis.TestSynonymMap
>    [junit] Tests run: 5, Failures: 0, Errors: 0, Time elapsed: 5.863 sec
>    [junit] Running org.apache.solr.analysis.TestTrimFilter
>    [junit] Tests run: 1, Failures: 0, Errors: 0, Time elapsed: 1.864 sec
>    [junit] Running org.apache.solr.analysis.TestWordDelimiterFilter
>    [junit] Tests run: 14, Failures: 0, Errors: 0, Time elapsed: 46.616 sec
>    [junit] Running org.apache.solr.client.solrj.SolrExceptionTest
>    [junit] Tests run: 1, Failures: 0, Errors: 0, Time elapsed: 0.252 sec
>    [junit] Running org.apache.solr.client.solrj.SolrQueryTest
>    [junit] Tests run: 5, Failures: 0, Errors: 0, Time elapsed: 0.038 sec
>    [junit] Running org.apache.solr.client.solrj.TestBatchUpdate
>    [junit] Tests run: 3, Failures: 0, Errors: 0, Time elapsed: 23.488 sec
>    [junit] Running org.apache.solr.client.solrj.TestLBHttpSolrServer
>    [junit] Tests run: 2, Failures: 0, Errors: 0, Time elapsed: 24.738 sec
>    [junit] Running org.apache.solr.client.solrj.beans.TestDocumentObjectBinder
>    [junit] Tests run: 4, Failures: 0, Errors: 0, Time elapsed: 0.886 sec
>    [junit] Running org.apache.solr.client.solrj.embedded.JettyWebappTest
>    [junit] Tests run: 1, Failures: 0, Errors: 0, Time elapsed: 15.821 sec
>    [junit] Running org.apache.solr.client.solrj.embedded.LargeVolumeBinaryJettyTest
>    [junit] Tests run: 1, Failures: 0, Errors: 0, Time elapsed: 16.365 sec
>    [junit] Running org.apache.solr.client.solrj.embedded.LargeVolumeEmbeddedTest
>    [junit] Tests run: 1, Failures: 0, Errors: 0, Time elapsed: 6.187 sec
>    [junit] Running org.apache.solr.client.solrj.embedded.LargeVolumeJettyTest
>    [junit] Tests run: 1, Failures: 0, Errors: 0, Time elapsed: 14.959 sec
>    [junit] Running org.apache.solr.client.solrj.embedded.MergeIndexesEmbeddedTest
>    [junit] Tests run: 1, Failures: 0, Errors: 0, Time elapsed: 7.041 sec
>    [junit] Running org.apache.solr.client.solrj.embedded.MultiCoreEmbeddedTest
>    [junit] Tests run: 1, Failures: 0, Errors: 0, Time elapsed: 11.174 sec
>    [junit] Running org.apache.solr.client.solrj.embedded.MultiCoreExampleJettyTest
>    [junit] Tests run: 1, Failures: 0, Errors: 0, Time elapsed: 8.037 sec
>    [junit] Running org.apache.solr.client.solrj.embedded.SolrExampleEmbeddedTest
>    [junit] Tests run: 9, Failures: 0, Errors: 0, Time elapsed: 24.582 sec
>    [junit] Running org.apache.solr.client.solrj.embedded.SolrExampleJettyTest
>    [junit] Tests run: 10, Failures: 0, Errors: 0, Time elapsed: 44.217 sec
>    [junit] Running org.apache.solr.client.solrj.embedded.SolrExampleStreamingTest
>    [junit] Tests run: 9, Failures: 0, Errors: 0, Time elapsed: 78.876 sec
>    [junit] Running org.apache.solr.client.solrj.embedded.TestSolrProperties
>    [junit] Tests run: 1, Failures: 0, Errors: 0, Time elapsed: 13.183 sec
>    [junit] Running org.apache.solr.client.solrj.request.TestUpdateRequestCodec
>    [junit] Tests run: 1, Failures: 0, Errors: 0, Time elapsed: 0.056 sec
>    [junit] Running org.apache.solr.client.solrj.response.AnlysisResponseBaseTest
>    [junit] Tests run: 2, Failures: 0, Errors: 0, Time elapsed: 0.031 sec
>    [junit] Running org.apache.solr.client.solrj.response.DocumentAnalysisResponseTest
>    [junit] Tests run: 1, Failures: 0, Errors: 0, Time elapsed: 0.044 sec
>    [junit] Running org.apache.solr.client.solrj.response.FieldAnalysisResponseTest
>    [junit] Tests run: 1, Failures: 0, Errors: 0, Time elapsed: 0.037 sec
>    [junit] Running org.apache.solr.client.solrj.response.QueryResponseTest
>    [junit] Tests run: 1, Failures: 0, Errors: 0, Time elapsed: 0.223 sec
>    [junit] Running org.apache.solr.client.solrj.response.TestSpellCheckResponse
>    [junit] Tests run: 2, Failures: 0, Errors: 0, Time elapsed: 16.344 sec
>    [junit] Running org.apache.solr.client.solrj.util.ClientUtilsTest
>    [junit] Tests run: 1, Failures: 0, Errors: 0, Time elapsed: 0.049 sec
>    [junit] Running org.apache.solr.common.SolrDocumentTest
>    [junit] Tests run: 5, Failures: 0, Errors: 0, Time elapsed: 0.046 sec
>    [junit] Running org.apache.solr.common.params.ModifiableSolrParamsTest
>    [junit] Tests run: 5, Failures: 0, Errors: 0, Time elapsed: 0.03 sec
>    [junit] Running org.apache.solr.common.params.SolrParamTest
>    [junit] Tests run: 1, Failures: 0, Errors: 0, Time elapsed: 0.039 sec
>    [junit] Running org.apache.solr.common.util.ContentStreamTest
>    [junit] Tests run: 3, Failures: 0, Errors: 0, Time elapsed: 0.176 sec
>    [junit] Running org.apache.solr.common.util.DOMUtilTest
>    [junit] Tests run: 1, Failures: 0, Errors: 0, Time elapsed: 0.523 sec
>    [junit] Running org.apache.solr.common.util.FileUtilsTest
>    [junit] Tests run: 1, Failures: 0, Errors: 0, Time elapsed: 0.018 sec
>    [junit] Running org.apache.solr.common.util.IteratorChainTest
>    [junit] Tests run: 7, Failures: 0, Errors: 0, Time elapsed: 0.023 sec
>    [junit] Running org.apache.solr.common.util.NamedListTest
>    [junit] Tests run: 1, Failures: 0, Errors: 0, Time elapsed: 0.019 sec
>    [junit] Running org.apache.solr.common.util.TestFastInputStream
>    [junit] Tests run: 1, Failures: 0, Errors: 0, Time elapsed: 0.034 sec
>    [junit] Running org.apache.solr.common.util.TestHash
>    [junit] Tests run: 2, Failures: 0, Errors: 0, Time elapsed: 0.238 sec
>    [junit] Running org.apache.solr.common.util.TestNamedListCodec
>    [junit] Tests run: 4, Failures: 0, Errors: 0, Time elapsed: 1.564 sec
>    [junit] Running org.apache.solr.common.util.TestXMLEscaping
>    [junit] Tests run: 7, Failures: 0, Errors: 0, Time elapsed: 0.024 sec
>    [junit] Running org.apache.solr.core.AlternateDirectoryTest
>    [junit] Tests run: 1, Failures: 0, Errors: 0, Time elapsed: 5.35 sec
>    [junit] Running org.apache.solr.core.AlternateIndexReaderTest
>    [junit] Tests run: 1, Failures: 0, Errors: 0, Time elapsed: 12.763 sec
>    [junit] Running org.apache.solr.core.IndexReaderFactoryTest
>    [junit] Tests run: 1, Failures: 0, Errors: 0, Time elapsed: 11.239 sec
>    [junit] Running org.apache.solr.core.RequestHandlersTest
>    [junit] Tests run: 2, Failures: 0, Errors: 0, Time elapsed: 11.081 sec
>    [junit] Running org.apache.solr.core.ResourceLoaderTest
>    [junit] Tests run: 2, Failures: 0, Errors: 0, Time elapsed: 0.136 sec
>    [junit] Running org.apache.solr.core.SOLR749Test
>    [junit] Tests run: 1, Failures: 0, Errors: 0, Time elapsed: 5.015 sec
>    [junit] Running org.apache.solr.core.SolrCoreTest
>    [junit] Tests run: 5, Failures: 0, Errors: 0, Time elapsed: 25.376 sec
>    [junit] Running org.apache.solr.core.TestArbitraryIndexDir
>    [junit] Tests run: 1, Failures: 0, Errors: 0, Time elapsed: 14.627 sec
>    [junit] Running org.apache.solr.core.TestBadConfig
>    [junit] Tests run: 1, Failures: 0, Errors: 0, Time elapsed: 0.558 sec
>    [junit] Running org.apache.solr.core.TestConfig
>    [junit] Tests run: 6, Failures: 0, Errors: 0, Time elapsed: 23.955 sec
>    [junit] Running org.apache.solr.core.TestJmxIntegration
>    [junit] Tests run: 2, Failures: 0, Errors: 0, Time elapsed: 17.786 sec
>    [junit] Running org.apache.solr.core.TestJmxMonitoredMap
>    [junit] Tests run: 1, Failures: 0, Errors: 0, Time elapsed: 0.915 sec
>    [junit] Running org.apache.solr.core.TestLegacyMergeSchedulerPolicyConfig
>    [junit] Tests run: 1, Failures: 0, Errors: 0, Time elapsed: 7.541 sec
>    [junit] Running org.apache.solr.core.TestPropInject
>    [junit] Tests run: 4, Failures: 0, Errors: 0, Time elapsed: 11.292 sec
>    [junit] Running org.apache.solr.core.TestQuerySenderListener
>    [junit] Tests run: 2, Failures: 0, Errors: 0, Time elapsed: 5.582 sec
>    [junit] Running org.apache.solr.core.TestSolrDeletionPolicy1
>    [junit] Tests run: 3, Failures: 0, Errors: 0, Time elapsed: 18.838 sec
>    [junit] Running org.apache.solr.core.TestSolrDeletionPolicy2
>    [junit] Tests run: 1, Failures: 0, Errors: 0, Time elapsed: 7.028 sec
>    [junit] Running org.apache.solr.core.TestXIncludeConfig
>    [junit] Tests run: 1, Failures: 0, Errors: 0, Time elapsed: 9.621 sec
>    [junit] Running org.apache.solr.handler.AnalysisRequestHandlerTest
>    [junit] Tests run: 1, Failures: 0, Errors: 0, Time elapsed: 8.371 sec
>    [junit] Running org.apache.solr.handler.DocumentAnalysisRequestHandlerTest
>    [junit] Tests run: 2, Failures: 0, Errors: 0, Time elapsed: 10.352 sec
>    [junit] Running org.apache.solr.handler.FieldAnalysisRequestHandlerTest
>    [junit] Tests run: 3, Failures: 0, Errors: 0, Time elapsed: 11.414 sec
>    [junit] Running org.apache.solr.handler.MoreLikeThisHandlerTest
>    [junit] Tests run: 1, Failures: 0, Errors: 0, Time elapsed: 6.799 sec
>    [junit] Running org.apache.solr.handler.SpellCheckerRequestHandlerTest
>    [junit] Tests run: 5, Failures: 0, Errors: 0, Time elapsed: 13.653 sec
>    [junit] Running org.apache.solr.handler.StandardRequestHandlerTest
>    [junit] Tests run: 1, Failures: 0, Errors: 0, Time elapsed: 12.308 sec
>    [junit] Running org.apache.solr.handler.TestCSVLoader
>    [junit] Tests run: 4, Failures: 0, Errors: 0, Time elapsed: 13.331 sec
>    [junit] Running org.apache.solr.handler.TestReplicationHandler
>    [junit] Tests run: 7, Failures: 0, Errors: 0, Time elapsed: 107.36 sec
>    [junit] Running org.apache.solr.handler.XmlUpdateRequestHandlerTest
>    [junit] Tests run: 1, Failures: 0, Errors: 0, Time elapsed: 3.726 sec
>    [junit] Running org.apache.solr.handler.admin.LukeRequestHandlerTest
>    [junit] Tests run: 1, Failures: 0, Errors: 0, Time elapsed: 0.019 sec
>    [junit] Running org.apache.solr.handler.admin.SystemInfoHandlerTest
>    [junit] Tests run: 1, Failures: 0, Errors: 0, Time elapsed: 0.046 sec
>    [junit] Running org.apache.solr.handler.component.QueryElevationComponentTest
>    [junit] Tests run: 4, Failures: 0, Errors: 0, Time elapsed: 10.369 sec
>    [junit] Running org.apache.solr.handler.component.SearchHandlerTest
>    [junit] Tests run: 1, Failures: 0, Errors: 0, Time elapsed: 3.662 sec
>    [junit] Running org.apache.solr.handler.component.SpellCheckComponentTest
>    [junit] Tests run: 8, Failures: 0, Errors: 0, Time elapsed: 22.507 sec
>    [junit] Running org.apache.solr.handler.component.StatsComponentTest
>    [junit] Tests run: 1, Failures: 0, Errors: 0, Time elapsed: 10.907 sec
>    [junit] Running org.apache.solr.handler.component.TermVectorComponentTest
>    [junit] Tests run: 4, Failures: 0, Errors: 0, Time elapsed: 8.397 sec
>    [junit] Running org.apache.solr.handler.component.TermsComponentTest
>    [junit] Tests run: 11, Failures: 0, Errors: 0, Time elapsed: 42.485 sec
>    [junit] Running org.apache.solr.highlight.HighlighterConfigTest
>    [junit] Tests run: 1, Failures: 0, Errors: 0, Time elapsed: 4.909 sec
>    [junit] Running org.apache.solr.highlight.HighlighterTest
>    [junit] Tests run: 22, Failures: 0, Errors: 0, Time elapsed: 54.032 sec
>    [junit] Running org.apache.solr.request.JSONWriterTest
>    [junit] Tests run: 3, Failures: 0, Errors: 0, Time elapsed: 14.636 sec
>    [junit] Running org.apache.solr.request.SimpleFacetsLegacySortTest
>    [junit] Tests run: 1, Failures: 0, Errors: 0, Time elapsed: 7.349 sec
>    [junit] Running org.apache.solr.request.SimpleFacetsTest
>    [junit] Tests run: 6, Failures: 0, Errors: 0, Time elapsed: 31.485 sec
>    [junit] Running org.apache.solr.request.TestBinaryResponseWriter
>    [junit] Tests run: 1, Failures: 0, Errors: 0, Time elapsed: 5.543 sec
>    [junit] Running org.apache.solr.request.TestFaceting
>    [junit] Tests run: 3, Failures: 0, Errors: 0, Time elapsed: 41.257 sec
>    [junit] Running org.apache.solr.request.TestWriterPerf
>    [junit] Tests run: 1, Failures: 0, Errors: 0, Time elapsed: 8.925 sec
>    [junit] Running org.apache.solr.schema.BadIndexSchemaTest
>    [junit] Tests run: 1, Failures: 0, Errors: 0, Time elapsed: 2.397 sec
>    [junit] Running org.apache.solr.schema.CopyFieldTest
>    [junit] Tests run: 6, Failures: 0, Errors: 0, Time elapsed: 16.913 sec
>    [junit] Running org.apache.solr.schema.DateFieldTest
>    [junit] Tests run: 6, Failures: 0, Errors: 0, Time elapsed: 0.116 sec
>    [junit] Running org.apache.solr.schema.IndexSchemaTest
>    [junit] Tests run: 4, Failures: 0, Errors: 0, Time elapsed: 26.626 sec
>    [junit] Running org.apache.solr.schema.LegacyDateFieldTest
>    [junit] Tests run: 4, Failures: 0, Errors: 0, Time elapsed: 0.104 sec
>    [junit] Running org.apache.solr.schema.NotRequiredUniqueKeyTest
>    [junit] Tests run: 1, Failures: 0, Errors: 0, Time elapsed: 2.245 sec
>    [junit] Running org.apache.solr.schema.RequiredFieldsTest
>    [junit] Tests run: 3, Failures: 0, Errors: 0, Time elapsed: 13.821 sec
>    [junit] Running org.apache.solr.schema.TestBinaryField
>    [junit] Tests run: 1, Failures: 0, Errors: 0, Time elapsed: 8.695 sec
>    [junit] Running org.apache.solr.schema.UUIDFieldTest
>    [junit] Tests run: 1, Failures: 0, Errors: 0, Time elapsed: 0.319 sec
>    [junit] Running org.apache.solr.search.TestDocSet
>    [junit] Tests run: 2, Failures: 0, Errors: 0, Time elapsed: 1.143 sec
>    [junit] Running org.apache.solr.search.TestFastLRUCache
>    [junit] Tests run: 2, Failures: 0, Errors: 0, Time elapsed: 0.057 sec
>    [junit] Running org.apache.solr.search.TestIndexSearcher
>    [junit] Tests run: 1, Failures: 0, Errors: 0, Time elapsed: 8.11 sec
>    [junit] Running org.apache.solr.search.TestQueryTypes
>    [junit] Tests run: 1, Failures: 0, Errors: 0, Time elapsed: 5.452 sec
>    [junit] Running org.apache.solr.search.TestQueryUtils
>    [junit] Tests run: 1, Failures: 0, Errors: 0, Time elapsed: 6.116 sec
>    [junit] Running org.apache.solr.search.TestRangeQuery
>    [junit] Tests run: 2, Failures: 0, Errors: 0, Time elapsed: 36.555 sec
>    [junit] Running org.apache.solr.search.TestSearchPerf
>    [junit] Tests run: 1, Failures: 0, Errors: 0, Time elapsed: 6.404 sec
>    [junit] Running org.apache.solr.search.function.TestFunctionQuery
>    [junit] Tests run: 3, Failures: 0, Errors: 0, Time elapsed: 20.835 sec
>    [junit] Running org.apache.solr.servlet.CacheHeaderTest
>    [junit] Tests run: 5, Failures: 0, Errors: 1, Time elapsed: 40.347 sec
>    [junit] Test org.apache.solr.servlet.CacheHeaderTest FAILED
>    [junit] Running org.apache.solr.servlet.DirectSolrConnectionTest
>    [junit] Tests run: 2, Failures: 0, Errors: 0, Time elapsed: 2.609 sec
>    [junit] Running org.apache.solr.servlet.NoCacheHeaderTest
>    [junit] Tests run: 3, Failures: 0, Errors: 0, Time elapsed: 21.75 sec
>    [junit] Running org.apache.solr.servlet.SolrRequestParserTest
>    [junit] Tests run: 4, Failures: 0, Errors: 0, Time elapsed: 16.249 sec
>    [junit] Running org.apache.solr.spelling.FileBasedSpellCheckerTest
>    [junit] Tests run: 3, Failures: 0, Errors: 0, Time elapsed: 10.257 sec
>    [junit] Running org.apache.solr.spelling.IndexBasedSpellCheckerTest
>    [junit] Tests run: 4, Failures: 0, Errors: 0, Time elapsed: 14.683 sec
>    [junit] Running org.apache.solr.spelling.SpellingQueryConverterTest
>    [junit] Tests run: 4, Failures: 0, Errors: 0, Time elapsed: 0.075 sec
>    [junit] Running org.apache.solr.update.AutoCommitTest
>    [junit] Tests run: 1, Failures: 0, Errors: 0, Time elapsed: 8.862 sec
>    [junit] Running org.apache.solr.update.DirectUpdateHandlerOptimizeTest
>    [junit] Tests run: 1, Failures: 0, Errors: 0, Time elapsed: 5.241 sec
>    [junit] Running org.apache.solr.update.DirectUpdateHandlerTest
>    [junit] Tests run: 7, Failures: 0, Errors: 0, Time elapsed: 17.415 sec
>    [junit] Running org.apache.solr.update.DocumentBuilderTest
>    [junit] Tests run: 2, Failures: 0, Errors: 0, Time elapsed: 12.356 sec
>    [junit] Running org.apache.solr.update.TestIndexingPerformance
>    [junit] Tests run: 1, Failures: 0, Errors: 0, Time elapsed: 10.493 sec
>    [junit] Running org.apache.solr.update.processor.SignatureUpdateProcessorFactoryTest
>    [junit] Tests run: 2, Failures: 0, Errors: 0, Time elapsed: 17.412 sec
>    [junit] Running org.apache.solr.update.processor.UpdateRequestProcessorFactoryTest
>    [junit] Tests run: 1, Failures: 0, Errors: 0, Time elapsed: 6.108 sec
>    [junit] Running org.apache.solr.util.ArraysUtilsTest
>    [junit] Tests run: 1, Failures: 0, Errors: 0, Time elapsed: 0.017 sec
>    [junit] Running org.apache.solr.util.DateMathParserTest
>    [junit] Tests run: 7, Failures: 0, Errors: 0, Time elapsed: 0.152 sec
>    [junit] Running org.apache.solr.util.SolrPluginUtilsTest
>    [junit] Tests run: 7, Failures: 0, Errors: 0, Time elapsed: 21.114 sec
>    [junit] Running org.apache.solr.util.TestCharArrayMap
>    [junit] Tests run: 2, Failures: 0, Errors: 0, Time elapsed: 0.588 sec
>    [junit] Running org.apache.solr.util.TestNumberUtils
>    [junit] Tests run: 1, Failures: 0, Errors: 0, Time elapsed: 1.509 sec
>    [junit] Running org.apache.solr.util.TestOpenBitSet
>    [junit] Tests run: 3, Failures: 0, Errors: 0, Time elapsed: 1.031 sec
>    [junit] Running org.apache.solr.util.TestUtils
>    [junit] Tests run: 3, Failures: 0, Errors: 0, Time elapsed: 0.031 sec
>
> BUILD FAILED
> /tmp/apache-solr-nightly/build.xml:414: Tests failed!
>
> Total time: 35 minutes 16 seconds
>
>
>

Mime
View raw message