lucene-solr-dev mailing list archives

Site index · List index
Message view « Date » · « Thread »
Top « Date » · « Thread »
From Grant Ingersoll <gsing...@apache.org>
Subject Re: Solr nightly build failure
Date Fri, 11 Sep 2009 12:37:14 GMT
Hmm, ant clean test passes for me.


On Sep 11, 2009, at 8:25 AM, Grant Ingersoll wrote:

> Hmm, this looks like my commit.  I'll check into it.  Anyone else  
> seeing failures?
>
> On Sep 11, 2009, at 4:38 AM, solr-dev@lucene.apache.org wrote:
>
>>
>> init-forrest-entities:
>>   [mkdir] Created dir: /tmp/apache-solr-nightly/build
>>   [mkdir] Created dir: /tmp/apache-solr-nightly/build/web
>>
>> compile-solrj:
>>   [mkdir] Created dir: /tmp/apache-solr-nightly/build/solrj
>>   [javac] Compiling 86 source files to /tmp/apache-solr-nightly/ 
>> build/solrj
>>   [javac] Note: Some input files use or override a deprecated API.
>>   [javac] Note: Recompile with -Xlint:deprecation for details.
>>   [javac] Note: Some input files use unchecked or unsafe operations.
>>   [javac] Note: Recompile with -Xlint:unchecked for details.
>>
>> compile:
>>   [mkdir] Created dir: /tmp/apache-solr-nightly/build/solr
>>   [javac] Compiling 374 source files to /tmp/apache-solr-nightly/ 
>> build/solr
>>   [javac] Note: Some input files use or override a deprecated API.
>>   [javac] Note: Recompile with -Xlint:deprecation for details.
>>   [javac] Note: Some input files use unchecked or unsafe operations.
>>   [javac] Note: Recompile with -Xlint:unchecked for details.
>>
>> compileTests:
>>   [mkdir] Created dir: /tmp/apache-solr-nightly/build/tests
>>   [javac] Compiling 168 source files to /tmp/apache-solr-nightly/ 
>> build/tests
>>   [javac] Note: Some input files use or override a deprecated API.
>>   [javac] Note: Recompile with -Xlint:deprecation for details.
>>   [javac] Note: Some input files use unchecked or unsafe operations.
>>   [javac] Note: Recompile with -Xlint:unchecked for details.
>>
>> junit:
>>   [mkdir] Created dir: /tmp/apache-solr-nightly/build/test-results
>>   [junit] Running org.apache.solr.BasicFunctionalityTest
>>   [junit] Tests run: 20, Failures: 0, Errors: 0, Time elapsed:  
>> 43.509 sec
>>   [junit] Running org.apache.solr.ConvertedLegacyTest
>>   [junit] Tests run: 1, Failures: 0, Errors: 0, Time elapsed:  
>> 24.636 sec
>>   [junit] Running org.apache.solr.DisMaxRequestHandlerTest
>>   [junit] Tests run: 3, Failures: 0, Errors: 0, Time elapsed:  
>> 21.207 sec
>>   [junit] Running org.apache.solr.EchoParamsTest
>>   [junit] Tests run: 4, Failures: 0, Errors: 0, Time elapsed: 6.797  
>> sec
>>   [junit] Running org.apache.solr.MinimalSchemaTest
>>   [junit] Tests run: 3, Failures: 0, Errors: 0, Time elapsed:  
>> 10.042 sec
>>   [junit] Running org.apache.solr.OutputWriterTest
>>   [junit] Tests run: 3, Failures: 0, Errors: 0, Time elapsed: 7.022  
>> sec
>>   [junit] Running org.apache.solr.SampleTest
>>   [junit] Tests run: 2, Failures: 0, Errors: 0, Time elapsed: 4.666  
>> sec
>>   [junit] Running org.apache.solr.SolrInfoMBeanTest
>>   [junit] Tests run: 1, Failures: 0, Errors: 0, Time elapsed: 2.302  
>> sec
>>   [junit] Running org.apache.solr.TestDistributedSearch
>>   [junit] Tests run: 1, Failures: 0, Errors: 0, Time elapsed: 97.45  
>> sec
>>   [junit] Running org.apache.solr.TestPluginEnable
>>   [junit] Tests run: 1, Failures: 0, Errors: 0, Time elapsed: 2.54  
>> sec
>>   [junit] Running org.apache.solr.TestSolrCoreProperties
>>   [junit] Tests run: 1, Failures: 0, Errors: 0, Time elapsed: 9.094  
>> sec
>>   [junit] Running org.apache.solr.TestTrie
>>   [junit] Tests run: 7, Failures: 0, Errors: 0, Time elapsed:  
>> 14.825 sec
>>   [junit] Running  
>> org.apache.solr.analysis.DoubleMetaphoneFilterFactoryTest
>>   [junit] Tests run: 2, Failures: 0, Errors: 0, Time elapsed: 0.829  
>> sec
>>   [junit] Running org.apache.solr.analysis.DoubleMetaphoneFilterTest
>>   [junit] Tests run: 6, Failures: 0, Errors: 0, Time elapsed: 1.181  
>> sec
>>   [junit] Running  
>> org.apache.solr.analysis.EnglishPorterFilterFactoryTest
>>   [junit] Tests run: 2, Failures: 0, Errors: 0, Time elapsed: 2.589  
>> sec
>>   [junit] Running org.apache.solr.analysis.HTMLStripCharFilterTest
>>   [junit] Tests run: 9, Failures: 0, Errors: 0, Time elapsed: 1.68  
>> sec
>>   [junit] Running org.apache.solr.analysis.LengthFilterTest
>>   [junit] Tests run: 1, Failures: 0, Errors: 0, Time elapsed: 4.704  
>> sec
>>   [junit] Running  
>> org.apache.solr.analysis.SnowballPorterFilterFactoryTest
>>   [junit] Tests run: 2, Failures: 0, Errors: 0, Time elapsed: 5.717  
>> sec
>>   [junit] Running org.apache.solr.analysis.TestBufferedTokenStream
>>   [junit] Tests run: 2, Failures: 0, Errors: 0, Time elapsed: 6.264  
>> sec
>>   [junit] Running org.apache.solr.analysis.TestCapitalizationFilter
>>   [junit] Tests run: 2, Failures: 0, Errors: 0, Time elapsed: 3.031  
>> sec
>>   [junit] Running  
>> org.apache.solr.analysis.TestDelimitedPayloadTokenFilterFactory
>>   [junit] Tests run: 2, Failures: 0, Errors: 0, Time elapsed:  
>> 11.213 sec
>>   [junit] Running org.apache.solr.analysis.TestHyphenatedWordsFilter
>>   [junit] Tests run: 1, Failures: 0, Errors: 0, Time elapsed: 3.398  
>> sec
>>   [junit] Running org.apache.solr.analysis.TestKeepFilterFactory
>>   [junit] Tests run: 1, Failures: 0, Errors: 0, Time elapsed: 6.732  
>> sec
>>   [junit] Running org.apache.solr.analysis.TestKeepWordFilter
>>   [junit] Tests run: 1, Failures: 0, Errors: 0, Time elapsed: 8.458  
>> sec
>>   [junit] Running  
>> org.apache.solr.analysis.TestMappingCharFilterFactory
>>   [junit] Tests run: 1, Failures: 0, Errors: 0, Time elapsed: 0.764  
>> sec
>>   [junit] Running org.apache.solr.analysis.TestPatternReplaceFilter
>>   [junit] Tests run: 5, Failures: 0, Errors: 0, Time elapsed: 5.587  
>> sec
>>   [junit] Running  
>> org.apache.solr.analysis.TestPatternTokenizerFactory
>>   [junit] Tests run: 2, Failures: 0, Errors: 0, Time elapsed: 2.806  
>> sec
>>   [junit] Running org.apache.solr.analysis.TestPhoneticFilter
>>   [junit] Tests run: 2, Failures: 0, Errors: 0, Time elapsed: 3.121  
>> sec
>>   [junit] Running  
>> org.apache.solr.analysis.TestRemoveDuplicatesTokenFilter
>>   [junit] Tests run: 3, Failures: 0, Errors: 0, Time elapsed: 3.67  
>> sec
>>   [junit] Running org.apache.solr.analysis.TestStopFilterFactory
>>   [junit] Tests run: 1, Failures: 0, Errors: 0, Time elapsed: 4.57  
>> sec
>>   [junit] Running org.apache.solr.analysis.TestSynonymFilter
>>   [junit] Tests run: 7, Failures: 0, Errors: 0, Time elapsed: 5.115  
>> sec
>>   [junit] Running org.apache.solr.analysis.TestSynonymMap
>>   [junit] Tests run: 5, Failures: 0, Errors: 0, Time elapsed: 2.877  
>> sec
>>   [junit] Running org.apache.solr.analysis.TestTrimFilter
>>   [junit] Tests run: 1, Failures: 0, Errors: 0, Time elapsed: 2.084  
>> sec
>>   [junit] Running org.apache.solr.analysis.TestWordDelimiterFilter
>>   [junit] Tests run: 14, Failures: 0, Errors: 0, Time elapsed:  
>> 58.98 sec
>>   [junit] Running org.apache.solr.client.solrj.SolrExceptionTest
>>   [junit] Tests run: 1, Failures: 0, Errors: 0, Time elapsed: 1.555  
>> sec
>>   [junit] Running org.apache.solr.client.solrj.SolrQueryTest
>>   [junit] Tests run: 5, Failures: 0, Errors: 0, Time elapsed: 1.032  
>> sec
>>   [junit] Running org.apache.solr.client.solrj.TestBatchUpdate
>>   [junit] Tests run: 3, Failures: 0, Errors: 0, Time elapsed:  
>> 31.512 sec
>>   [junit] Running org.apache.solr.client.solrj.TestLBHttpSolrServer
>>   [junit] Tests run: 2, Failures: 0, Errors: 0, Time elapsed:  
>> 18.286 sec
>>   [junit] Running  
>> org.apache.solr.client.solrj.beans.TestDocumentObjectBinder
>>   [junit] Tests run: 4, Failures: 0, Errors: 0, Time elapsed: 2.829  
>> sec
>>   [junit] Running  
>> org.apache.solr.client.solrj.embedded.JettyWebappTest
>>   [junit] Tests run: 1, Failures: 0, Errors: 0, Time elapsed:  
>> 13.399 sec
>>   [junit] Running  
>> org.apache.solr.client.solrj.embedded.LargeVolumeBinaryJettyTest
>>   [junit] Tests run: 1, Failures: 0, Errors: 0, Time elapsed:  
>> 10.615 sec
>>   [junit] Running  
>> org.apache.solr.client.solrj.embedded.LargeVolumeEmbeddedTest
>>   [junit] Tests run: 1, Failures: 0, Errors: 0, Time elapsed: 5.254  
>> sec
>>   [junit] Running  
>> org.apache.solr.client.solrj.embedded.LargeVolumeJettyTest
>>   [junit] Tests run: 1, Failures: 0, Errors: 0, Time elapsed:  
>> 13.408 sec
>>   [junit] Running  
>> org.apache.solr.client.solrj.embedded.MergeIndexesEmbeddedTest
>>   [junit] Tests run: 1, Failures: 0, Errors: 0, Time elapsed: 6.614  
>> sec
>>   [junit] Running  
>> org.apache.solr.client.solrj.embedded.MultiCoreEmbeddedTest
>>   [junit] Tests run: 1, Failures: 0, Errors: 0, Time elapsed: 9.132  
>> sec
>>   [junit] Running  
>> org.apache.solr.client.solrj.embedded.MultiCoreExampleJettyTest
>>   [junit] Tests run: 1, Failures: 0, Errors: 0, Time elapsed: 7.468  
>> sec
>>   [junit] Running  
>> org.apache.solr.client.solrj.embedded.SolrExampleEmbeddedTest
>>   [junit] Tests run: 9, Failures: 0, Errors: 1, Time elapsed:  
>> 23.712 sec
>>   [junit] Test  
>> org.apache.solr.client.solrj.embedded.SolrExampleEmbeddedTest FAILED
>>   [junit] Running  
>> org.apache.solr.client.solrj.embedded.SolrExampleJettyTest
>>   [junit]
>>   [junit]  
>> lazy_loading_error__orgapachesolrcommonSolrException_lazy_loading_error__at_orgapachesolrcoreRequestHandlers

>> $ 
>> LazyRequestHandlerWrappergetWrappedHandlerRequestHandlersjava243__at_orgapachesolrcoreRequestHandlers

>> $ 
>> LazyRequestHandlerWrapperhandleRequestRequestHandlersjava225__at_orgapachesolrcoreSolrCoreexecuteSolrCorejava1301__at_orgapachesolrservletSolrDispatchFilterexecuteSolrDispatchFilterjava338__at_orgapachesolrservletSolrDispatchFilterdoFilterSolrDispatchFilterjava241__at_orgmortbayjettyservletServletHandler

>> $ 
>> CachedChaindoFilterServletHandlerjava1089__at_orgmortbayjettyservletServletHandlerhandleServletHandlerjava365__at_orgmortbayjettyservletSessionHandlerhandleSessionHandlerjava181__at_orgmortbayjettyhandlerContextHandlerhandleContextHandlerjava712__at_orgmortbayjettyhandlerHandlerWrapperhandleHandlerWrapperjava139__at_orgmortbayjettyServerhandleServerjava285__at_orgmortbayjettyHttpConnectionhandleRequestHttpConnectionjava502__at_orgmortbayjettyHttpConnection

>> !
>> $ 
>> RequestHandlercontentHttpConnectionjava835__at_orgmortbayjettyHttpParserparseNextHttpParserjava641__at_orgmortbayjettyHttpParserparseAvailableHttpParserjava208__at_orgmortbayjettyHttpConnectionhandleHttpConnectionjava378__at_orgmortbayjettybioSocketConnector

>> $ 
>> ConnectionrunSocketConnectorjava226__at_orgmortbaythreadBoundedThreadPool 
>> $ 
>> PoolThreadrunBoundedThreadPooljava442_Caused_by_orgapachesolrcommonSolrException_Error_loading_class_orgapachesolrhandlerextractionExtractingRequestHandler__at_orgapachesolrcoreSolrResourceLoaderfindClassSolrResourceLoaderjava310__at_orgapachesolrcoreSolrCorecreateInstanceSolrCorejava411__at_orgapachesolrcoreSolrCorecreateRequestHandlerSolrCorejava436__at_orgapachesolrcoreRequestHandlers

>> $ 
>> LazyRequestHandlerWrappergetWrappedHandlerRequestHandlersjava234___17_more_Caused_by_javalangClassNotFoundException_orgapachesol
>>   [junit]
>>   [junit] request: http://localhost:37676/example/update/extract?literal.id=mailing_lists.pdf&commit=true&waitFlush=true&waitSearcher=true&wt=javabin&version=1

>> )
>>   [junit] Tests run: 10, Failures: 0, Errors: 1, Time elapsed:  
>> 40.311 sec
>>   [junit] Test  
>> org.apache.solr.client.solrj.embedded.SolrExampleJettyTest FAILED
>>   [junit] Running  
>> org.apache.solr.client.solrj.embedded.SolrExampleStreamingTest
>>   [junit]
>>   [junit]  
>> lazy_loading_error__orgapachesolrcommonSolrException_lazy_loading_error__at_orgapachesolrcoreRequestHandlers

>> $ 
>> LazyRequestHandlerWrappergetWrappedHandlerRequestHandlersjava243__at_orgapachesolrcoreRequestHandlers

>> $ 
>> LazyRequestHandlerWrapperhandleRequestRequestHandlersjava225__at_orgapachesolrcoreSolrCoreexecuteSolrCorejava1301__at_orgapachesolrservletSolrDispatchFilterexecuteSolrDispatchFilterjava338__at_orgapachesolrservletSolrDispatchFilterdoFilterSolrDispatchFilterjava241__at_orgmortbayjettyservletServletHandler

>> $ 
>> CachedChaindoFilterServletHandlerjava1089__at_orgmortbayjettyservletServletHandlerhandleServletHandlerjava365__at_orgmortbayjettyservletSessionHandlerhandleSessionHandlerjava181__at_orgmortbayjettyhandlerContextHandlerhandleContextHandlerjava712__at_orgmortbayjettyhandlerHandlerWrapperhandleHandlerWrapperjava139__at_orgmortbayjettyServerhandleServerjava285__at_orgmortbayjettyHttpConnectionhandleRequestHttpConnectionjava502__at_orgmortbayjettyHttpConnection

>> !
>> $ 
>> RequestHandlercontentHttpConnectionjava835__at_orgmortbayjettyHttpParserparseNextHttpParserjava641__at_orgmortbayjettyHttpParserparseAvailableHttpParserjava202__at_orgmortbayjettyHttpConnectionhandleHttpConnectionjava378__at_orgmortbayjettybioSocketConnector

>> $ 
>> ConnectionrunSocketConnectorjava226__at_orgmortbaythreadBoundedThreadPool 
>> $ 
>> PoolThreadrunBoundedThreadPooljava442_Caused_by_orgapachesolrcommonSolrException_Error_loading_class_orgapachesolrhandlerextractionExtractingRequestHandler__at_orgapachesolrcoreSolrResourceLoaderfindClassSolrResourceLoaderjava310__at_orgapachesolrcoreSolrCorecreateInstanceSolrCorejava411__at_orgapachesolrcoreSolrCorecreateRequestHandlerSolrCorejava436__at_orgapachesolrcoreRequestHandlers

>> $ 
>> LazyRequestHandlerWrappergetWrappedHandlerRequestHandlersjava234___17_more_Caused_by_javalangClassNotFoundException_orgapachesol
>>   [junit]
>>   [junit] request: http://localhost:37740/example/update/extract?literal.id=mailing_lists.pdf&commit=true&waitFlush=true&waitSearcher=true&wt=javabin&version=1

>> )
>>   [junit] Tests run: 9, Failures: 0, Errors: 1, Time elapsed:  
>> 36.619 sec
>>   [junit] Test  
>> org.apache.solr.client.solrj.embedded.SolrExampleStreamingTest FAILED
>>   [junit] Running  
>> org.apache.solr.client.solrj.embedded.TestSolrProperties
>>   [junit] Tests run: 1, Failures: 0, Errors: 0, Time elapsed:  
>> 11.205 sec
>>   [junit] Running  
>> org.apache.solr.client.solrj.request.TestUpdateRequestCodec
>>   [junit] Tests run: 1, Failures: 0, Errors: 0, Time elapsed: 0.76  
>> sec
>>   [junit] Running  
>> org.apache.solr.client.solrj.response.AnlysisResponseBaseTest
>>   [junit] Tests run: 2, Failures: 0, Errors: 0, Time elapsed: 0.561  
>> sec
>>   [junit] Running  
>> org.apache.solr.client.solrj.response.DocumentAnalysisResponseTest
>>   [junit] Tests run: 1, Failures: 0, Errors: 0, Time elapsed: 0.822  
>> sec
>>   [junit] Running  
>> org.apache.solr.client.solrj.response.FieldAnalysisResponseTest
>>   [junit] Tests run: 1, Failures: 0, Errors: 0, Time elapsed: 0.49  
>> sec
>>   [junit] Running  
>> org.apache.solr.client.solrj.response.QueryResponseTest
>>   [junit] Tests run: 1, Failures: 0, Errors: 0, Time elapsed: 1.075  
>> sec
>>   [junit] Running  
>> org.apache.solr.client.solrj.response.TestSpellCheckResponse
>>   [junit] Tests run: 2, Failures: 0, Errors: 0, Time elapsed:  
>> 20.654 sec
>>   [junit] Running org.apache.solr.client.solrj.util.ClientUtilsTest
>>   [junit] Tests run: 1, Failures: 0, Errors: 0, Time elapsed: 0.641  
>> sec
>>   [junit] Running org.apache.solr.common.SolrDocumentTest
>>   [junit] Tests run: 5, Failures: 0, Errors: 0, Time elapsed: 0.548  
>> sec
>>   [junit] Running  
>> org.apache.solr.common.params.ModifiableSolrParamsTest
>>   [junit] Tests run: 5, Failures: 0, Errors: 0, Time elapsed: 0.409  
>> sec
>>   [junit] Running org.apache.solr.common.params.SolrParamTest
>>   [junit] Tests run: 1, Failures: 0, Errors: 0, Time elapsed: 0.536  
>> sec
>>   [junit] Running org.apache.solr.common.util.ContentStreamTest
>>   [junit] Tests run: 3, Failures: 0, Errors: 0, Time elapsed: 0.787  
>> sec
>>   [junit] Running org.apache.solr.common.util.DOMUtilTest
>>   [junit] Tests run: 1, Failures: 0, Errors: 0, Time elapsed: 1.125  
>> sec
>>   [junit] Running org.apache.solr.common.util.FileUtilsTest
>>   [junit] Tests run: 1, Failures: 0, Errors: 0, Time elapsed: 0.719  
>> sec
>>   [junit] Running org.apache.solr.common.util.IteratorChainTest
>>   [junit] Tests run: 7, Failures: 0, Errors: 0, Time elapsed: 1.158  
>> sec
>>   [junit] Running org.apache.solr.common.util.NamedListTest
>>   [junit] Tests run: 1, Failures: 0, Errors: 0, Time elapsed: 0.678  
>> sec
>>   [junit] Running org.apache.solr.common.util.TestFastInputStream
>>   [junit] Tests run: 1, Failures: 0, Errors: 0, Time elapsed: 0.523  
>> sec
>>   [junit] Running org.apache.solr.common.util.TestHash
>>   [junit] Tests run: 2, Failures: 0, Errors: 0, Time elapsed: 2.843  
>> sec
>>   [junit] Running org.apache.solr.common.util.TestNamedListCodec
>>   [junit] Tests run: 4, Failures: 0, Errors: 0, Time elapsed: 4.957  
>> sec
>>   [junit] Running org.apache.solr.common.util.TestXMLEscaping
>>   [junit] Tests run: 7, Failures: 0, Errors: 0, Time elapsed: 0.854  
>> sec
>>   [junit] Running org.apache.solr.core.AlternateDirectoryTest
>>   [junit] Tests run: 1, Failures: 0, Errors: 0, Time elapsed: 5.728  
>> sec
>>   [junit] Running org.apache.solr.core.AlternateIndexReaderTest
>>   [junit] Tests run: 1, Failures: 0, Errors: 0, Time elapsed:  
>> 10.047 sec
>>   [junit] Running org.apache.solr.core.RequestHandlersTest
>>   [junit] Tests run: 2, Failures: 0, Errors: 0, Time elapsed:  
>> 11.679 sec
>>   [junit] Running org.apache.solr.core.ResourceLoaderTest
>>   [junit] Tests run: 2, Failures: 0, Errors: 0, Time elapsed: 1.058  
>> sec
>>   [junit] Running org.apache.solr.core.SOLR749Test
>>   [junit] Tests run: 1, Failures: 0, Errors: 0, Time elapsed: 5.654  
>> sec
>>   [junit] Running org.apache.solr.core.SolrCoreTest
>>   [junit] Tests run: 4, Failures: 0, Errors: 0, Time elapsed:  
>> 17.843 sec
>>   [junit] Running org.apache.solr.core.TestArbitraryIndexDir
>>   [junit] Tests run: 1, Failures: 0, Errors: 0, Time elapsed:  
>> 11.487 sec
>>   [junit] Running org.apache.solr.core.TestBadConfig
>>   [junit] Tests run: 1, Failures: 0, Errors: 0, Time elapsed: 0.535  
>> sec
>>   [junit] Running org.apache.solr.core.TestConfig
>>   [junit] Tests run: 3, Failures: 0, Errors: 0, Time elapsed: 9.049  
>> sec
>>   [junit] Running org.apache.solr.core.TestJmxIntegration
>>   [junit] Tests run: 2, Failures: 0, Errors: 0, Time elapsed: 9.542  
>> sec
>>   [junit] Running org.apache.solr.core.TestJmxMonitoredMap
>>   [junit] Tests run: 1, Failures: 0, Errors: 0, Time elapsed: 6.392  
>> sec
>>   [junit] Running org.apache.solr.core.TestQuerySenderListener
>>   [junit] Tests run: 2, Failures: 0, Errors: 0, Time elapsed: 9.174  
>> sec
>>   [junit] Running org.apache.solr.core.TestSolrDeletionPolicy1
>>   [junit] Tests run: 3, Failures: 0, Errors: 0, Time elapsed:  
>> 20.416 sec
>>   [junit] Running org.apache.solr.core.TestSolrDeletionPolicy2
>>   [junit] Tests run: 1, Failures: 0, Errors: 0, Time elapsed: 7.528  
>> sec
>>   [junit] Running org.apache.solr.handler.AnalysisRequestHandlerTest
>>   [junit] Tests run: 1, Failures: 0, Errors: 0, Time elapsed: 5.448  
>> sec
>>   [junit] Running  
>> org.apache.solr.handler.DocumentAnalysisRequestHandlerTest
>>   [junit] Tests run: 2, Failures: 0, Errors: 0, Time elapsed: 8.673  
>> sec
>>   [junit] Running  
>> org.apache.solr.handler.FieldAnalysisRequestHandlerTest
>>   [junit] Tests run: 3, Failures: 0, Errors: 0, Time elapsed: 9.741  
>> sec
>>   [junit] Running org.apache.solr.handler.MoreLikeThisHandlerTest
>>   [junit] Tests run: 1, Failures: 0, Errors: 0, Time elapsed:  
>> 12.084 sec
>>   [junit] Running  
>> org.apache.solr.handler.SpellCheckerRequestHandlerTest
>>   [junit] Tests run: 5, Failures: 0, Errors: 0, Time elapsed:  
>> 13.119 sec
>>   [junit] Running org.apache.solr.handler.StandardRequestHandlerTest
>>   [junit] Tests run: 1, Failures: 0, Errors: 0, Time elapsed:  
>> 16.407 sec
>>   [junit] Running org.apache.solr.handler.TestCSVLoader
>>   [junit] Tests run: 4, Failures: 0, Errors: 0, Time elapsed:  
>> 33.367 sec
>>   [junit] Running org.apache.solr.handler.TestReplicationHandler
>>   [junit] Tests run: 6, Failures: 0, Errors: 0, Time elapsed:  
>> 87.895 sec
>>   [junit] Running org.apache.solr.handler.XmlUpdateRequestHandlerTest
>>   [junit] Tests run: 1, Failures: 0, Errors: 0, Time elapsed: 4.472  
>> sec
>>   [junit] Running  
>> org.apache.solr.handler.admin.LukeRequestHandlerTest
>>   [junit] Tests run: 1, Failures: 0, Errors: 0, Time elapsed: 0.837  
>> sec
>>   [junit] Running org.apache.solr.handler.admin.SystemInfoHandlerTest
>>   [junit] Tests run: 1, Failures: 0, Errors: 0, Time elapsed: 1.322  
>> sec
>>   [junit] Running  
>> org.apache.solr.handler.component.QueryElevationComponentTest
>>   [junit] Tests run: 4, Failures: 0, Errors: 0, Time elapsed: 13.29  
>> sec
>>   [junit] Running org.apache.solr.handler.component.SearchHandlerTest
>>   [junit] Tests run: 1, Failures: 0, Errors: 0, Time elapsed: 8.809  
>> sec
>>   [junit] Running  
>> org.apache.solr.handler.component.SpellCheckComponentTest
>>   [junit] Tests run: 8, Failures: 0, Errors: 0, Time elapsed:  
>> 26.535 sec
>>   [junit] Running  
>> org.apache.solr.handler.component.StatsComponentTest
>>   [junit] Tests run: 3, Failures: 0, Errors: 0, Time elapsed: 14.78  
>> sec
>>   [junit] Running  
>> org.apache.solr.handler.component.TermVectorComponentTest
>>   [junit] Tests run: 4, Failures: 0, Errors: 0, Time elapsed: 24.16  
>> sec
>>   [junit] Running  
>> org.apache.solr.handler.component.TermsComponentTest
>>   [junit] Tests run: 11, Failures: 0, Errors: 0, Time elapsed:  
>> 49.658 sec
>>   [junit] Running org.apache.solr.highlight.HighlighterConfigTest
>>   [junit] Tests run: 1, Failures: 0, Errors: 0, Time elapsed:  
>> 11.585 sec
>>   [junit] Running org.apache.solr.highlight.HighlighterTest
>>   [junit] Tests run: 22, Failures: 0, Errors: 0, Time elapsed:  
>> 54.555 sec
>>   [junit] Running org.apache.solr.request.JSONWriterTest
>>   [junit] Tests run: 3, Failures: 0, Errors: 0, Time elapsed:  
>> 11.715 sec
>>   [junit] Running org.apache.solr.request.SimpleFacetsLegacySortTest
>>   [junit] Tests run: 1, Failures: 0, Errors: 0, Time elapsed:  
>> 11.292 sec
>>   [junit] Running org.apache.solr.request.SimpleFacetsTest
>>   [junit] Tests run: 6, Failures: 0, Errors: 0, Time elapsed:  
>> 47.485 sec
>>   [junit] Running org.apache.solr.request.TestBinaryResponseWriter
>>   [junit] Tests run: 1, Failures: 0, Errors: 0, Time elapsed: 8.877  
>> sec
>>   [junit] Running org.apache.solr.request.TestFaceting
>>   [junit] Tests run: 3, Failures: 0, Errors: 0, Time elapsed:  
>> 44.278 sec
>>   [junit] Running org.apache.solr.request.TestWriterPerf
>>   [junit] Tests run: 1, Failures: 0, Errors: 0, Time elapsed: 6.897  
>> sec
>>   [junit] Running org.apache.solr.schema.BadIndexSchemaTest
>>   [junit] Tests run: 1, Failures: 0, Errors: 0, Time elapsed: 2.244  
>> sec
>>   [junit] Running org.apache.solr.schema.CopyFieldTest
>>   [junit] Tests run: 6, Failures: 0, Errors: 0, Time elapsed:  
>> 13.638 sec
>>   [junit] Running org.apache.solr.schema.DateFieldTest
>>   [junit] Tests run: 6, Failures: 0, Errors: 0, Time elapsed: 0.666  
>> sec
>>   [junit] Running org.apache.solr.schema.IndexSchemaTest
>>   [junit] Tests run: 4, Failures: 0, Errors: 0, Time elapsed:  
>> 17.639 sec
>>   [junit] Running org.apache.solr.schema.LegacyDateFieldTest
>>   [junit] Tests run: 4, Failures: 0, Errors: 0, Time elapsed: 0.528  
>> sec
>>   [junit] Running org.apache.solr.schema.NotRequiredUniqueKeyTest
>>   [junit] Tests run: 1, Failures: 0, Errors: 0, Time elapsed: 2.54  
>> sec
>>   [junit] Running org.apache.solr.schema.RequiredFieldsTest
>>   [junit] Tests run: 3, Failures: 0, Errors: 0, Time elapsed: 7.494  
>> sec
>>   [junit] Running org.apache.solr.schema.TestBinaryField
>>   [junit] Tests run: 1, Failures: 0, Errors: 0, Time elapsed: 6.37  
>> sec
>>   [junit] Running org.apache.solr.schema.UUIDFieldTest
>>   [junit] Tests run: 1, Failures: 0, Errors: 0, Time elapsed: 0.861  
>> sec
>>   [junit] Running org.apache.solr.search.TestDocSet
>>   [junit] Tests run: 2, Failures: 0, Errors: 0, Time elapsed: 2.091  
>> sec
>>   [junit] Running org.apache.solr.search.TestFastLRUCache
>>   [junit] Tests run: 2, Failures: 0, Errors: 0, Time elapsed: 0.734  
>> sec
>>   [junit] Running org.apache.solr.search.TestIndexSearcher
>>   [junit] Tests run: 1, Failures: 0, Errors: 0, Time elapsed: 4.753  
>> sec
>>   [junit] Running org.apache.solr.search.TestQueryTypes
>>   [junit] Tests run: 1, Failures: 0, Errors: 0, Time elapsed: 8.847  
>> sec
>>   [junit] Running org.apache.solr.search.TestQueryUtils
>>   [junit] Tests run: 1, Failures: 0, Errors: 0, Time elapsed: 7.817  
>> sec
>>   [junit] Running org.apache.solr.search.TestRangeQuery
>>   [junit] Tests run: 2, Failures: 0, Errors: 0, Time elapsed:  
>> 38.427 sec
>>   [junit] Running org.apache.solr.search.TestSearchPerf
>>   [junit] Tests run: 1, Failures: 0, Errors: 0, Time elapsed: 6.537  
>> sec
>>   [junit] Running org.apache.solr.search.function.TestFunctionQuery
>>   [junit] Tests run: 3, Failures: 0, Errors: 0, Time elapsed:  
>> 14.511 sec
>>   [junit] Running org.apache.solr.servlet.CacheHeaderTest
>>   [junit] Tests run: 5, Failures: 0, Errors: 0, Time elapsed: 28.63  
>> sec
>>   [junit] Running org.apache.solr.servlet.DirectSolrConnectionTest
>>   [junit] Tests run: 2, Failures: 0, Errors: 0, Time elapsed: 4.62  
>> sec
>>   [junit] Running org.apache.solr.servlet.NoCacheHeaderTest
>>   [junit] Tests run: 3, Failures: 0, Errors: 0, Time elapsed:  
>> 16.783 sec
>>   [junit] Running org.apache.solr.servlet.SolrRequestParserTest
>>   [junit] Tests run: 4, Failures: 0, Errors: 0, Time elapsed:  
>> 21.615 sec
>>   [junit] Running org.apache.solr.spelling.FileBasedSpellCheckerTest
>>   [junit] Tests run: 3, Failures: 0, Errors: 0, Time elapsed:  
>> 14.499 sec
>>   [junit] Running org.apache.solr.spelling.IndexBasedSpellCheckerTest
>>   [junit] Tests run: 4, Failures: 0, Errors: 0, Time elapsed:  
>> 14.423 sec
>>   [junit] Running org.apache.solr.spelling.SpellingQueryConverterTest
>>   [junit] Tests run: 1, Failures: 0, Errors: 0, Time elapsed: 1.034  
>> sec
>>   [junit] Running org.apache.solr.update.AutoCommitTest
>>   [junit] Tests run: 1, Failures: 0, Errors: 0, Time elapsed:  
>> 10.992 sec
>>   [junit] Running  
>> org.apache.solr.update.DirectUpdateHandlerOptimizeTest
>>   [junit] Tests run: 1, Failures: 0, Errors: 0, Time elapsed: 9.584  
>> sec
>>   [junit] Running org.apache.solr.update.DirectUpdateHandlerTest
>>   [junit] Tests run: 7, Failures: 0, Errors: 0, Time elapsed:  
>> 43.893 sec
>>   [junit] Running org.apache.solr.update.DocumentBuilderTest
>>   [junit] Tests run: 2, Failures: 0, Errors: 0, Time elapsed:  
>> 12.403 sec
>>   [junit] Running org.apache.solr.update.TestIndexingPerformance
>>   [junit] Tests run: 1, Failures: 0, Errors: 0, Time elapsed:  
>> 12.665 sec
>>   [junit] Running  
>> org.apache.solr.update.processor.SignatureUpdateProcessorFactoryTest
>>   [junit] Tests run: 2, Failures: 0, Errors: 0, Time elapsed:  
>> 13.083 sec
>>   [junit] Running  
>> org.apache.solr.update.processor.UpdateRequestProcessorFactoryTest
>>   [junit] Tests run: 1, Failures: 0, Errors: 0, Time elapsed: 8.056  
>> sec
>>   [junit] Running org.apache.solr.util.ArraysUtilsTest
>>   [junit] Tests run: 1, Failures: 0, Errors: 0, Time elapsed: 0.838  
>> sec
>>   [junit] Running org.apache.solr.util.DateMathParserTest
>>   [junit] Tests run: 7, Failures: 0, Errors: 0, Time elapsed: 1.539  
>> sec
>>   [junit] Running org.apache.solr.util.SolrPluginUtilsTest
>>   [junit] Tests run: 7, Failures: 0, Errors: 0, Time elapsed:  
>> 21.444 sec
>>   [junit] Running org.apache.solr.util.TestCharArrayMap
>>   [junit] Tests run: 2, Failures: 0, Errors: 0, Time elapsed: 0.792  
>> sec
>>   [junit] Running org.apache.solr.util.TestNumberUtils
>>   [junit] Tests run: 1, Failures: 0, Errors: 0, Time elapsed: 2.075  
>> sec
>>   [junit] Running org.apache.solr.util.TestOpenBitSet
>>   [junit] Tests run: 3, Failures: 0, Errors: 0, Time elapsed: 1.884  
>> sec
>>   [junit] Running org.apache.solr.util.TestUtils
>>   [junit] Tests run: 3, Failures: 0, Errors: 0, Time elapsed: 1.521  
>> sec
>>
>> BUILD FAILED
>> /tmp/apache-solr-nightly/build.xml:384: Tests failed!
>>
>> Total time: 32 minutes 21 seconds
>>
>>
>

--------------------------
Grant Ingersoll
http://www.lucidimagination.com/

Search the Lucene ecosystem (Lucene/Solr/Nutch/Mahout/Tika/Droids)  
using Solr/Lucene:
http://www.lucidimagination.com/search


Mime
View raw message