lucene-solr-dev mailing list archives

Site index · List index
Message view « Date » · « Thread »
Top « Date » · « Thread »
From Noble Paul നോബിള്‍ नोब्ळ् <noble.p...@corp.aol.com>
Subject Re: Solr nightly build failure
Date Wed, 23 Sep 2009 14:25:26 GMT
I guess yes. But in this case it should have retried. And probably the
next attempt would have succeeded.



On Wed, Sep 23, 2009 at 7:48 PM, Yonik Seeley
<yonik@lucidimagination.com> wrote:
> Exception that caused the failure shown below...
> is this an exception that should be handled internally by LBHttpSolrServer?
>
> -Yonik
> http://www.lucidimagination.com
>
>  <testcase classname="org.apache.solr.client.solrj.TestLBHttpSolrServer"
> name="testSimple" time="22.99"></testcase>
>  <testcase classname="org.apache.solr.client.solrj.TestLBHttpSolrServer"
> name="testTwoServers" time="7.81">
>    <error message="java.lang.IllegalStateException: Connection is not
> open" type="org.apache.solr.client.solrj.SolrServerException">org.apache.solr.client.solrj.SolrServerException:
> java.lang.Ille
> galStateException: Connection is not open
>        at org.apache.solr.client.solrj.impl.LBHttpSolrServer.request(LBHttpSolrServer.java:217)
>        at org.apache.solr.client.solrj.request.QueryRequest.process(QueryRequest.java:89)
>        at org.apache.solr.client.solrj.SolrServer.query(SolrServer.java:118)
>        at org.apache.solr.client.solrj.TestLBHttpSolrServer.testTwoServers(TestLBHttpSolrServer.java:130)
> Caused by: java.lang.IllegalStateException: Connection is not open
>        at org.apache.commons.httpclient.HttpConnection.assertOpen(HttpConnection.java:1277)
>        at org.apache.commons.httpclient.HttpConnection.getResponseInputStream(HttpConnection.java:858)
>        at org.apache.commons.httpclient.HttpMethodBase.readResponseHeaders(HttpMethodBase.java:1935)
>        at org.apache.commons.httpclient.HttpMethodBase.readResponse(HttpMethodBase.java:1737)
>        at org.apache.commons.httpclient.HttpMethodBase.execute(HttpMethodBase.java:1098)
>        at org.apache.commons.httpclient.HttpMethodDirector.executeWithRetry(HttpMethodDirector.java:398)
>        at org.apache.commons.httpclient.HttpMethodDirector.executeMethod(HttpMethodDirector.java:171)
>        at org.apache.commons.httpclient.HttpClient.executeMethod(HttpClient.java:397)
>        at org.apache.commons.httpclient.HttpClient.executeMethod(HttpClient.java:323)
>        at org.apache.solr.client.solrj.impl.CommonsHttpSolrServer.request(CommonsHttpSolrServer.java:415)
>        at org.apache.solr.client.solrj.impl.CommonsHttpSolrServer.request(CommonsHttpSolrServer.java:242)
>        at org.apache.solr.client.solrj.impl.LBHttpSolrServer.request(LBHttpSolrServer.java:205)
> </error>
>  </testcase>
>
>
>
>
> On Wed, Sep 23, 2009 at 4:41 AM,  <solr-dev@lucene.apache.org> wrote:
>>
>> init-forrest-entities:
>>    [mkdir] Created dir: /tmp/apache-solr-nightly/build
>>    [mkdir] Created dir: /tmp/apache-solr-nightly/build/web
>>
>> compile-solrj:
>>    [mkdir] Created dir: /tmp/apache-solr-nightly/build/solrj
>>    [javac] Compiling 86 source files to /tmp/apache-solr-nightly/build/solrj
>>    [javac] Note: Some input files use or override a deprecated API.
>>    [javac] Note: Recompile with -Xlint:deprecation for details.
>>    [javac] Note: Some input files use unchecked or unsafe operations.
>>    [javac] Note: Recompile with -Xlint:unchecked for details.
>>
>> compile:
>>    [mkdir] Created dir: /tmp/apache-solr-nightly/build/solr
>>    [javac] Compiling 387 source files to /tmp/apache-solr-nightly/build/solr
>>    [javac] Note: Some input files use or override a deprecated API.
>>    [javac] Note: Recompile with -Xlint:deprecation for details.
>>    [javac] Note: Some input files use unchecked or unsafe operations.
>>    [javac] Note: Recompile with -Xlint:unchecked for details.
>>
>> compileTests:
>>    [mkdir] Created dir: /tmp/apache-solr-nightly/build/tests
>>    [javac] Compiling 176 source files to /tmp/apache-solr-nightly/build/tests
>>    [javac] Note: Some input files use or override a deprecated API.
>>    [javac] Note: Recompile with -Xlint:deprecation for details.
>>    [javac] Note: Some input files use unchecked or unsafe operations.
>>    [javac] Note: Recompile with -Xlint:unchecked for details.
>>
>> solr-cell-example:
>>
>> init:
>>    [mkdir] Created dir: /tmp/apache-solr-nightly/contrib/extraction/build/classes
>>    [mkdir] Created dir: /tmp/apache-solr-nightly/build/docs/api
>>
>> init-forrest-entities:
>>
>> compile-solrj:
>>
>> compile:
>>    [javac] Compiling 1 source file to /tmp/apache-solr-nightly/build/solr
>>    [javac] Note: /tmp/apache-solr-nightly/src/java/org/apache/solr/search/DocSetHitCollector.java
uses or overrides a deprecated API.
>>    [javac] Note: Recompile with -Xlint:deprecation for details.
>>
>> make-manifest:
>>    [mkdir] Created dir: /tmp/apache-solr-nightly/build/META-INF
>>
>> compile:
>>    [javac] Compiling 6 source files to /tmp/apache-solr-nightly/contrib/extraction/build/classes
>>    [javac] Note: /tmp/apache-solr-nightly/contrib/extraction/src/main/java/org/apache/solr/handler/extraction/ExtractingDocumentLoader.java
uses unchecked or unsafe operations.
>>    [javac] Note: Recompile with -Xlint:unchecked for details.
>>
>> build:
>>      [jar] Building jar: /tmp/apache-solr-nightly/contrib/extraction/build/apache-solr-cell-nightly.jar
>>
>> example:
>>     [copy] Copying 1 file to /tmp/apache-solr-nightly/example/solr/lib
>>     [copy] Copying 26 files to /tmp/apache-solr-nightly/example/solr/lib
>>
>> junit:
>>    [mkdir] Created dir: /tmp/apache-solr-nightly/build/test-results
>>    [junit] Running org.apache.solr.BasicFunctionalityTest
>>    [junit] Tests run: 20, Failures: 0, Errors: 0, Time elapsed: 47.527 sec
>>    [junit] Running org.apache.solr.ConvertedLegacyTest
>>    [junit] Tests run: 1, Failures: 0, Errors: 0, Time elapsed: 30.287 sec
>>    [junit] Running org.apache.solr.DisMaxRequestHandlerTest
>>    [junit] Tests run: 3, Failures: 0, Errors: 0, Time elapsed: 16.619 sec
>>    [junit] Running org.apache.solr.EchoParamsTest
>>    [junit] Tests run: 4, Failures: 0, Errors: 0, Time elapsed: 4.605 sec
>>    [junit] Running org.apache.solr.MinimalSchemaTest
>>    [junit] Tests run: 3, Failures: 0, Errors: 0, Time elapsed: 7.492 sec
>>    [junit] Running org.apache.solr.OutputWriterTest
>>    [junit] Tests run: 3, Failures: 0, Errors: 0, Time elapsed: 5.861 sec
>>    [junit] Running org.apache.solr.SampleTest
>>    [junit] Tests run: 2, Failures: 0, Errors: 0, Time elapsed: 5.863 sec
>>    [junit] Running org.apache.solr.SolrInfoMBeanTest
>>    [junit] Tests run: 1, Failures: 0, Errors: 0, Time elapsed: 3.284 sec
>>    [junit] Running org.apache.solr.TestDistributedSearch
>>    [junit] Tests run: 1, Failures: 0, Errors: 0, Time elapsed: 100.19 sec
>>    [junit] Running org.apache.solr.TestPluginEnable
>>    [junit] Tests run: 1, Failures: 0, Errors: 0, Time elapsed: 5.439 sec
>>    [junit] Running org.apache.solr.TestSolrCoreProperties
>>    [junit] Tests run: 1, Failures: 0, Errors: 0, Time elapsed: 6.128 sec
>>    [junit] Running org.apache.solr.TestTrie
>>    [junit] Tests run: 7, Failures: 0, Errors: 0, Time elapsed: 14.724 sec
>>    [junit] Running org.apache.solr.analysis.CommonGramsFilterFactoryTest
>>    [junit] Tests run: 1, Failures: 0, Errors: 0, Time elapsed: 5.355 sec
>>    [junit] Running org.apache.solr.analysis.CommonGramsFilterTest
>>    [junit] Tests run: 4, Failures: 0, Errors: 0, Time elapsed: 0.606 sec
>>    [junit] Running org.apache.solr.analysis.CommonGramsQueryFilterFactoryTest
>>    [junit] Tests run: 1, Failures: 0, Errors: 0, Time elapsed: 11.631 sec
>>    [junit] Running org.apache.solr.analysis.DoubleMetaphoneFilterFactoryTest
>>    [junit] Tests run: 2, Failures: 0, Errors: 0, Time elapsed: 0.506 sec
>>    [junit] Running org.apache.solr.analysis.DoubleMetaphoneFilterTest
>>    [junit] Tests run: 6, Failures: 0, Errors: 0, Time elapsed: 0.657 sec
>>    [junit] Running org.apache.solr.analysis.EnglishPorterFilterFactoryTest
>>    [junit] Tests run: 2, Failures: 0, Errors: 0, Time elapsed: 3.366 sec
>>    [junit] Running org.apache.solr.analysis.HTMLStripCharFilterTest
>>    [junit] Tests run: 9, Failures: 0, Errors: 0, Time elapsed: 1.394 sec
>>    [junit] Running org.apache.solr.analysis.LengthFilterTest
>>    [junit] Tests run: 1, Failures: 0, Errors: 0, Time elapsed: 4.425 sec
>>    [junit] Running org.apache.solr.analysis.SnowballPorterFilterFactoryTest
>>    [junit] Tests run: 2, Failures: 0, Errors: 0, Time elapsed: 3.153 sec
>>    [junit] Running org.apache.solr.analysis.TestBufferedTokenStream
>>    [junit] Tests run: 3, Failures: 0, Errors: 0, Time elapsed: 7.077 sec
>>    [junit] Running org.apache.solr.analysis.TestCapitalizationFilter
>>    [junit] Tests run: 2, Failures: 0, Errors: 0, Time elapsed: 8.872 sec
>>    [junit] Running org.apache.solr.analysis.TestDelimitedPayloadTokenFilterFactory
>>    [junit] Tests run: 2, Failures: 0, Errors: 0, Time elapsed: 11.871 sec
>>    [junit] Running org.apache.solr.analysis.TestHyphenatedWordsFilter
>>    [junit] Tests run: 1, Failures: 0, Errors: 0, Time elapsed: 2.704 sec
>>    [junit] Running org.apache.solr.analysis.TestKeepFilterFactory
>>    [junit] Tests run: 1, Failures: 0, Errors: 0, Time elapsed: 4.955 sec
>>    [junit] Running org.apache.solr.analysis.TestKeepWordFilter
>>    [junit] Tests run: 1, Failures: 0, Errors: 0, Time elapsed: 3.216 sec
>>    [junit] Running org.apache.solr.analysis.TestMappingCharFilterFactory
>>    [junit] Tests run: 1, Failures: 0, Errors: 0, Time elapsed: 1.808 sec
>>    [junit] Running org.apache.solr.analysis.TestMultiWordSynonyms
>>    [junit] Tests run: 1, Failures: 0, Errors: 0, Time elapsed: 1.579 sec
>>    [junit] Running org.apache.solr.analysis.TestPatternReplaceFilter
>>    [junit] Tests run: 5, Failures: 0, Errors: 0, Time elapsed: 5.841 sec
>>    [junit] Running org.apache.solr.analysis.TestPatternTokenizerFactory
>>    [junit] Tests run: 2, Failures: 0, Errors: 0, Time elapsed: 2.554 sec
>>    [junit] Running org.apache.solr.analysis.TestPhoneticFilter
>>    [junit] Tests run: 2, Failures: 0, Errors: 0, Time elapsed: 3.51 sec
>>    [junit] Running org.apache.solr.analysis.TestRemoveDuplicatesTokenFilter
>>    [junit] Tests run: 3, Failures: 0, Errors: 0, Time elapsed: 3.787 sec
>>    [junit] Running org.apache.solr.analysis.TestReversedWildcardFilterFactory
>>    [junit] Tests run: 3, Failures: 0, Errors: 0, Time elapsed: 9.6 sec
>>    [junit] Running org.apache.solr.analysis.TestStopFilterFactory
>>    [junit] Tests run: 1, Failures: 0, Errors: 0, Time elapsed: 3.664 sec
>>    [junit] Running org.apache.solr.analysis.TestSynonymFilter
>>    [junit] Tests run: 7, Failures: 0, Errors: 0, Time elapsed: 7.177 sec
>>    [junit] Running org.apache.solr.analysis.TestSynonymMap
>>    [junit] Tests run: 5, Failures: 0, Errors: 0, Time elapsed: 8.644 sec
>>    [junit] Running org.apache.solr.analysis.TestTrimFilter
>>    [junit] Tests run: 1, Failures: 0, Errors: 0, Time elapsed: 3.447 sec
>>    [junit] Running org.apache.solr.analysis.TestWordDelimiterFilter
>>    [junit] Tests run: 14, Failures: 0, Errors: 0, Time elapsed: 75.248 sec
>>    [junit] Running org.apache.solr.client.solrj.SolrExceptionTest
>>    [junit] Tests run: 1, Failures: 0, Errors: 0, Time elapsed: 2.469 sec
>>    [junit] Running org.apache.solr.client.solrj.SolrQueryTest
>>    [junit] Tests run: 5, Failures: 0, Errors: 0, Time elapsed: 1.32 sec
>>    [junit] Running org.apache.solr.client.solrj.TestBatchUpdate
>>    [junit] Tests run: 3, Failures: 0, Errors: 0, Time elapsed: 23.235 sec
>>    [junit] Running org.apache.solr.client.solrj.TestLBHttpSolrServer
>>    [junit] Tests run: 2, Failures: 0, Errors: 1, Time elapsed: 31.763 sec
>>    [junit] Test org.apache.solr.client.solrj.TestLBHttpSolrServer FAILED
>>    [junit] Running org.apache.solr.client.solrj.beans.TestDocumentObjectBinder
>>    [junit] Tests run: 4, Failures: 0, Errors: 0, Time elapsed: 3.021 sec
>>    [junit] Running org.apache.solr.client.solrj.embedded.JettyWebappTest
>>    [junit] Tests run: 1, Failures: 0, Errors: 0, Time elapsed: 14.11 sec
>>    [junit] Running org.apache.solr.client.solrj.embedded.LargeVolumeBinaryJettyTest
>>    [junit] Tests run: 1, Failures: 0, Errors: 0, Time elapsed: 9.714 sec
>>    [junit] Running org.apache.solr.client.solrj.embedded.LargeVolumeEmbeddedTest
>>    [junit] Tests run: 1, Failures: 0, Errors: 0, Time elapsed: 5.611 sec
>>    [junit] Running org.apache.solr.client.solrj.embedded.LargeVolumeJettyTest
>>    [junit] Tests run: 1, Failures: 0, Errors: 0, Time elapsed: 10.018 sec
>>    [junit] Running org.apache.solr.client.solrj.embedded.MergeIndexesEmbeddedTest
>>    [junit] Tests run: 1, Failures: 0, Errors: 0, Time elapsed: 4.339 sec
>>    [junit] Running org.apache.solr.client.solrj.embedded.MultiCoreEmbeddedTest
>>    [junit] Tests run: 1, Failures: 0, Errors: 0, Time elapsed: 9.925 sec
>>    [junit] Running org.apache.solr.client.solrj.embedded.MultiCoreExampleJettyTest
>>    [junit] Tests run: 1, Failures: 0, Errors: 0, Time elapsed: 9.753 sec
>>    [junit] Running org.apache.solr.client.solrj.embedded.SolrExampleEmbeddedTest
>>    [junit] Tests run: 9, Failures: 0, Errors: 0, Time elapsed: 37.707 sec
>>    [junit] Running org.apache.solr.client.solrj.embedded.SolrExampleJettyTest
>>    [junit] Tests run: 10, Failures: 0, Errors: 0, Time elapsed: 62.009 sec
>>    [junit] Running org.apache.solr.client.solrj.embedded.SolrExampleStreamingTest
>>    [junit] Tests run: 9, Failures: 0, Errors: 0, Time elapsed: 45.924 sec
>>    [junit] Running org.apache.solr.client.solrj.embedded.TestSolrProperties
>>    [junit] Tests run: 1, Failures: 0, Errors: 0, Time elapsed: 8.89 sec
>>    [junit] Running org.apache.solr.client.solrj.request.TestUpdateRequestCodec
>>    [junit] Tests run: 1, Failures: 0, Errors: 0, Time elapsed: 0.699 sec
>>    [junit] Running org.apache.solr.client.solrj.response.AnlysisResponseBaseTest
>>    [junit] Tests run: 2, Failures: 0, Errors: 0, Time elapsed: 0.748 sec
>>    [junit] Running org.apache.solr.client.solrj.response.DocumentAnalysisResponseTest
>>    [junit] Tests run: 1, Failures: 0, Errors: 0, Time elapsed: 1.181 sec
>>    [junit] Running org.apache.solr.client.solrj.response.FieldAnalysisResponseTest
>>    [junit] Tests run: 1, Failures: 0, Errors: 0, Time elapsed: 0.742 sec
>>    [junit] Running org.apache.solr.client.solrj.response.QueryResponseTest
>>    [junit] Tests run: 1, Failures: 0, Errors: 0, Time elapsed: 0.961 sec
>>    [junit] Running org.apache.solr.client.solrj.response.TestSpellCheckResponse
>>    [junit] Tests run: 2, Failures: 0, Errors: 0, Time elapsed: 14.161 sec
>>    [junit] Running org.apache.solr.client.solrj.util.ClientUtilsTest
>>    [junit] Tests run: 1, Failures: 0, Errors: 0, Time elapsed: 0.484 sec
>>    [junit] Running org.apache.solr.common.SolrDocumentTest
>>    [junit] Tests run: 5, Failures: 0, Errors: 0, Time elapsed: 0.638 sec
>>    [junit] Running org.apache.solr.common.params.ModifiableSolrParamsTest
>>    [junit] Tests run: 5, Failures: 0, Errors: 0, Time elapsed: 0.566 sec
>>    [junit] Running org.apache.solr.common.params.SolrParamTest
>>    [junit] Tests run: 1, Failures: 0, Errors: 0, Time elapsed: 0.402 sec
>>    [junit] Running org.apache.solr.common.util.ContentStreamTest
>>    [junit] Tests run: 3, Failures: 0, Errors: 0, Time elapsed: 0.553 sec
>>    [junit] Running org.apache.solr.common.util.DOMUtilTest
>>    [junit] Tests run: 1, Failures: 0, Errors: 0, Time elapsed: 0.482 sec
>>    [junit] Running org.apache.solr.common.util.FileUtilsTest
>>    [junit] Tests run: 1, Failures: 0, Errors: 0, Time elapsed: 0.581 sec
>>    [junit] Running org.apache.solr.common.util.IteratorChainTest
>>    [junit] Tests run: 7, Failures: 0, Errors: 0, Time elapsed: 0.388 sec
>>    [junit] Running org.apache.solr.common.util.NamedListTest
>>    [junit] Tests run: 1, Failures: 0, Errors: 0, Time elapsed: 0.382 sec
>>    [junit] Running org.apache.solr.common.util.TestFastInputStream
>>    [junit] Tests run: 1, Failures: 0, Errors: 0, Time elapsed: 0.862 sec
>>    [junit] Running org.apache.solr.common.util.TestHash
>>    [junit] Tests run: 2, Failures: 0, Errors: 0, Time elapsed: 1.06 sec
>>    [junit] Running org.apache.solr.common.util.TestNamedListCodec
>>    [junit] Tests run: 4, Failures: 0, Errors: 0, Time elapsed: 3.089 sec
>>    [junit] Running org.apache.solr.common.util.TestXMLEscaping
>>    [junit] Tests run: 7, Failures: 0, Errors: 0, Time elapsed: 0.825 sec
>>    [junit] Running org.apache.solr.core.AlternateDirectoryTest
>>    [junit] Tests run: 1, Failures: 0, Errors: 0, Time elapsed: 8.63 sec
>>    [junit] Running org.apache.solr.core.AlternateIndexReaderTest
>>    [junit] Tests run: 1, Failures: 0, Errors: 0, Time elapsed: 6.95 sec
>>    [junit] Running org.apache.solr.core.IndexReaderFactoryTest
>>    [junit] Tests run: 1, Failures: 0, Errors: 0, Time elapsed: 10.467 sec
>>    [junit] Running org.apache.solr.core.RequestHandlersTest
>>    [junit] Tests run: 2, Failures: 0, Errors: 0, Time elapsed: 16.804 sec
>>    [junit] Running org.apache.solr.core.ResourceLoaderTest
>>    [junit] Tests run: 2, Failures: 0, Errors: 0, Time elapsed: 1.883 sec
>>    [junit] Running org.apache.solr.core.SOLR749Test
>>    [junit] Tests run: 1, Failures: 0, Errors: 0, Time elapsed: 10.532 sec
>>    [junit] Running org.apache.solr.core.SolrCoreTest
>>    [junit] Tests run: 5, Failures: 0, Errors: 0, Time elapsed: 33.429 sec
>>    [junit] Running org.apache.solr.core.TestArbitraryIndexDir
>>    [junit] Tests run: 1, Failures: 0, Errors: 0, Time elapsed: 8.447 sec
>>    [junit] Running org.apache.solr.core.TestBadConfig
>>    [junit] Tests run: 1, Failures: 0, Errors: 0, Time elapsed: 0.695 sec
>>    [junit] Running org.apache.solr.core.TestConfig
>>    [junit] Tests run: 5, Failures: 0, Errors: 0, Time elapsed: 24.506 sec
>>    [junit] Running org.apache.solr.core.TestJmxIntegration
>>    [junit] Tests run: 2, Failures: 0, Errors: 0, Time elapsed: 16.243 sec
>>    [junit] Running org.apache.solr.core.TestJmxMonitoredMap
>>    [junit] Tests run: 1, Failures: 0, Errors: 0, Time elapsed: 2.036 sec
>>    [junit] Running org.apache.solr.core.TestLegacyMergeScedulerPolicyConfig
>>    [junit] Tests run: 1, Failures: 0, Errors: 0, Time elapsed: 10.209 sec
>>    [junit] Running org.apache.solr.core.TestPropInject
>>    [junit] Tests run: 2, Failures: 0, Errors: 0, Time elapsed: 9.719 sec
>>    [junit] Running org.apache.solr.core.TestQuerySenderListener
>>    [junit] Tests run: 2, Failures: 0, Errors: 0, Time elapsed: 7.845 sec
>>    [junit] Running org.apache.solr.core.TestSolrDeletionPolicy1
>>    [junit] Tests run: 3, Failures: 0, Errors: 0, Time elapsed: 17.867 sec
>>    [junit] Running org.apache.solr.core.TestSolrDeletionPolicy2
>>    [junit] Tests run: 1, Failures: 0, Errors: 0, Time elapsed: 6.75 sec
>>    [junit] Running org.apache.solr.handler.AnalysisRequestHandlerTest
>>    [junit] Tests run: 1, Failures: 0, Errors: 0, Time elapsed: 7.632 sec
>>    [junit] Running org.apache.solr.handler.DocumentAnalysisRequestHandlerTest
>>    [junit] Tests run: 2, Failures: 0, Errors: 0, Time elapsed: 12.384 sec
>>    [junit] Running org.apache.solr.handler.FieldAnalysisRequestHandlerTest
>>    [junit] Tests run: 3, Failures: 0, Errors: 0, Time elapsed: 19.352 sec
>>    [junit] Running org.apache.solr.handler.MoreLikeThisHandlerTest
>>    [junit] Tests run: 1, Failures: 0, Errors: 0, Time elapsed: 4.935 sec
>>    [junit] Running org.apache.solr.handler.SpellCheckerRequestHandlerTest
>>    [junit] Tests run: 5, Failures: 0, Errors: 0, Time elapsed: 9.384 sec
>>    [junit] Running org.apache.solr.handler.StandardRequestHandlerTest
>>    [junit] Tests run: 1, Failures: 0, Errors: 0, Time elapsed: 13.005 sec
>>    [junit] Running org.apache.solr.handler.TestCSVLoader
>>    [junit] Tests run: 4, Failures: 0, Errors: 0, Time elapsed: 29.497 sec
>>    [junit] Running org.apache.solr.handler.TestReplicationHandler
>>    [junit] Tests run: 6, Failures: 0, Errors: 0, Time elapsed: 89.418 sec
>>    [junit] Running org.apache.solr.handler.XmlUpdateRequestHandlerTest
>>    [junit] Tests run: 1, Failures: 0, Errors: 0, Time elapsed: 6.603 sec
>>    [junit] Running org.apache.solr.handler.admin.LukeRequestHandlerTest
>>    [junit] Tests run: 1, Failures: 0, Errors: 0, Time elapsed: 0.788 sec
>>    [junit] Running org.apache.solr.handler.admin.SystemInfoHandlerTest
>>    [junit] Tests run: 1, Failures: 0, Errors: 0, Time elapsed: 0.553 sec
>>    [junit] Running org.apache.solr.handler.component.QueryElevationComponentTest
>>    [junit] Tests run: 4, Failures: 0, Errors: 0, Time elapsed: 18.555 sec
>>    [junit] Running org.apache.solr.handler.component.SearchHandlerTest
>>    [junit] Tests run: 1, Failures: 0, Errors: 0, Time elapsed: 8.645 sec
>>    [junit] Running org.apache.solr.handler.component.SpellCheckComponentTest
>>    [junit] Tests run: 8, Failures: 0, Errors: 0, Time elapsed: 27.225 sec
>>    [junit] Running org.apache.solr.handler.component.StatsComponentTest
>>    [junit] Tests run: 4, Failures: 0, Errors: 0, Time elapsed: 15.242 sec
>>    [junit] Running org.apache.solr.handler.component.TermVectorComponentTest
>>    [junit] Tests run: 4, Failures: 0, Errors: 0, Time elapsed: 14.815 sec
>>    [junit] Running org.apache.solr.handler.component.TermsComponentTest
>>    [junit] Tests run: 11, Failures: 0, Errors: 0, Time elapsed: 43.522 sec
>>    [junit] Running org.apache.solr.highlight.HighlighterConfigTest
>>    [junit] Tests run: 1, Failures: 0, Errors: 0, Time elapsed: 7.263 sec
>>    [junit] Running org.apache.solr.highlight.HighlighterTest
>>    [junit] Tests run: 22, Failures: 0, Errors: 0, Time elapsed: 57 sec
>>    [junit] Running org.apache.solr.request.JSONWriterTest
>>    [junit] Tests run: 3, Failures: 0, Errors: 0, Time elapsed: 11.25 sec
>>    [junit] Running org.apache.solr.request.SimpleFacetsLegacySortTest
>>    [junit] Tests run: 1, Failures: 0, Errors: 0, Time elapsed: 9.618 sec
>>    [junit] Running org.apache.solr.request.SimpleFacetsTest
>>    [junit] Tests run: 6, Failures: 0, Errors: 0, Time elapsed: 26.262 sec
>>    [junit] Running org.apache.solr.request.TestBinaryResponseWriter
>>    [junit] Tests run: 1, Failures: 0, Errors: 0, Time elapsed: 4.454 sec
>>    [junit] Running org.apache.solr.request.TestFaceting
>>    [junit] Tests run: 3, Failures: 0, Errors: 0, Time elapsed: 41.246 sec
>>    [junit] Running org.apache.solr.request.TestWriterPerf
>>    [junit] Tests run: 1, Failures: 0, Errors: 0, Time elapsed: 5.134 sec
>>    [junit] Running org.apache.solr.schema.BadIndexSchemaTest
>>    [junit] Tests run: 1, Failures: 0, Errors: 0, Time elapsed: 4.232 sec
>>    [junit] Running org.apache.solr.schema.CopyFieldTest
>>    [junit] Tests run: 6, Failures: 0, Errors: 0, Time elapsed: 17.693 sec
>>    [junit] Running org.apache.solr.schema.DateFieldTest
>>    [junit] Tests run: 6, Failures: 0, Errors: 0, Time elapsed: 1.221 sec
>>    [junit] Running org.apache.solr.schema.IndexSchemaTest
>>    [junit] Tests run: 4, Failures: 0, Errors: 0, Time elapsed: 19.55 sec
>>    [junit] Running org.apache.solr.schema.LegacyDateFieldTest
>>    [junit] Tests run: 4, Failures: 0, Errors: 0, Time elapsed: 0.85 sec
>>    [junit] Running org.apache.solr.schema.NotRequiredUniqueKeyTest
>>    [junit] Tests run: 1, Failures: 0, Errors: 0, Time elapsed: 5.785 sec
>>    [junit] Running org.apache.solr.schema.RequiredFieldsTest
>>    [junit] Tests run: 3, Failures: 0, Errors: 0, Time elapsed: 17.686 sec
>>    [junit] Running org.apache.solr.schema.TestBinaryField
>>    [junit] Tests run: 1, Failures: 0, Errors: 0, Time elapsed: 10.282 sec
>>    [junit] Running org.apache.solr.schema.UUIDFieldTest
>>    [junit] Tests run: 1, Failures: 0, Errors: 0, Time elapsed: 0.728 sec
>>    [junit] Running org.apache.solr.search.TestDocSet
>>    [junit] Tests run: 2, Failures: 0, Errors: 0, Time elapsed: 1.756 sec
>>    [junit] Running org.apache.solr.search.TestFastLRUCache
>>    [junit] Tests run: 2, Failures: 0, Errors: 0, Time elapsed: 0.869 sec
>>    [junit] Running org.apache.solr.search.TestIndexSearcher
>>    [junit] Tests run: 1, Failures: 0, Errors: 0, Time elapsed: 5.701 sec
>>    [junit] Running org.apache.solr.search.TestQueryTypes
>>    [junit] Tests run: 1, Failures: 0, Errors: 0, Time elapsed: 9.484 sec
>>    [junit] Running org.apache.solr.search.TestQueryUtils
>>    [junit] Tests run: 1, Failures: 0, Errors: 0, Time elapsed: 8.547 sec
>>    [junit] Running org.apache.solr.search.TestRangeQuery
>>    [junit] Tests run: 2, Failures: 0, Errors: 0, Time elapsed: 30.847 sec
>>    [junit] Running org.apache.solr.search.TestSearchPerf
>>    [junit] Tests run: 1, Failures: 0, Errors: 0, Time elapsed: 3.576 sec
>>    [junit] Running org.apache.solr.search.function.TestFunctionQuery
>>    [junit] Tests run: 3, Failures: 0, Errors: 0, Time elapsed: 15.151 sec
>>    [junit] Running org.apache.solr.servlet.CacheHeaderTest
>>    [junit] Tests run: 5, Failures: 0, Errors: 0, Time elapsed: 38.891 sec
>>    [junit] Running org.apache.solr.servlet.DirectSolrConnectionTest
>>    [junit] Tests run: 2, Failures: 0, Errors: 0, Time elapsed: 7.521 sec
>>    [junit] Running org.apache.solr.servlet.NoCacheHeaderTest
>>    [junit] Tests run: 3, Failures: 0, Errors: 0, Time elapsed: 21.201 sec
>>    [junit] Running org.apache.solr.servlet.SolrRequestParserTest
>>    [junit] Tests run: 4, Failures: 0, Errors: 0, Time elapsed: 17.484 sec
>>    [junit] Running org.apache.solr.spelling.FileBasedSpellCheckerTest
>>    [junit] Tests run: 3, Failures: 0, Errors: 0, Time elapsed: 11.842 sec
>>    [junit] Running org.apache.solr.spelling.IndexBasedSpellCheckerTest
>>    [junit] Tests run: 4, Failures: 0, Errors: 0, Time elapsed: 17.581 sec
>>    [junit] Running org.apache.solr.spelling.SpellingQueryConverterTest
>>    [junit] Tests run: 4, Failures: 0, Errors: 0, Time elapsed: 1.084 sec
>>    [junit] Running org.apache.solr.update.AutoCommitTest
>>    [junit] Tests run: 1, Failures: 0, Errors: 0, Time elapsed: 16.509 sec
>>    [junit] Running org.apache.solr.update.DirectUpdateHandlerOptimizeTest
>>    [junit] Tests run: 1, Failures: 0, Errors: 0, Time elapsed: 10.147 sec
>>    [junit] Running org.apache.solr.update.DirectUpdateHandlerTest
>>    [junit] Tests run: 7, Failures: 0, Errors: 0, Time elapsed: 34.271 sec
>>    [junit] Running org.apache.solr.update.DocumentBuilderTest
>>    [junit] Tests run: 2, Failures: 0, Errors: 0, Time elapsed: 18.739 sec
>>    [junit] Running org.apache.solr.update.TestIndexingPerformance
>>    [junit] Tests run: 1, Failures: 0, Errors: 0, Time elapsed: 15.579 sec
>>    [junit] Running org.apache.solr.update.processor.SignatureUpdateProcessorFactoryTest
>>    [junit] Tests run: 2, Failures: 0, Errors: 0, Time elapsed: 15.225 sec
>>    [junit] Running org.apache.solr.update.processor.UpdateRequestProcessorFactoryTest
>>    [junit] Tests run: 1, Failures: 0, Errors: 0, Time elapsed: 5.257 sec
>>    [junit] Running org.apache.solr.util.ArraysUtilsTest
>>    [junit] Tests run: 1, Failures: 0, Errors: 0, Time elapsed: 0.738 sec
>>    [junit] Running org.apache.solr.util.DateMathParserTest
>>    [junit] Tests run: 7, Failures: 0, Errors: 0, Time elapsed: 0.971 sec
>>    [junit] Running org.apache.solr.util.SolrPluginUtilsTest
>>    [junit] Tests run: 7, Failures: 0, Errors: 0, Time elapsed: 21.135 sec
>>    [junit] Running org.apache.solr.util.TestCharArrayMap
>>    [junit] Tests run: 2, Failures: 0, Errors: 0, Time elapsed: 1.143 sec
>>    [junit] Running org.apache.solr.util.TestNumberUtils
>>    [junit] Tests run: 1, Failures: 0, Errors: 0, Time elapsed: 1.424 sec
>>    [junit] Running org.apache.solr.util.TestOpenBitSet
>>    [junit] Tests run: 3, Failures: 0, Errors: 0, Time elapsed: 3.02 sec
>>    [junit] Running org.apache.solr.util.TestUtils
>>    [junit] Tests run: 3, Failures: 0, Errors: 0, Time elapsed: 1.002 sec
>>
>> BUILD FAILED
>> /tmp/apache-solr-nightly/build.xml:418: Tests failed!
>>
>> Total time: 35 minutes 18 seconds
>>
>>
>>
>



-- 
-----------------------------------------------------
Noble Paul | Principal Engineer| AOL | http://aol.com

Mime
View raw message