lucene-solr-dev mailing list archives

Site index · List index
Message view « Date » · « Thread »
Top « Date » · « Thread »
From Yonik Seeley <yo...@lucidimagination.com>
Subject Re: Solr nightly build failure
Date Mon, 06 Jul 2009 15:34:42 GMT
Hmmm... no idea why this would happen.

  <testcase classname="org.apache.solr.client.solrj.embedded.JettyWebappTest"
name="testJSP" time="14.789">
    <error message="Server returned HTTP response code: 500 for URL:
http://localhost:56914/test/admin/threaddump.jsp"
type="java.io.IOException">java.io.IOException: Server returned
HTTP response code: 500 for URL:
http://localhost:56914/test/admin/threaddump.jsp
        at sun.net.www.protocol.http.HttpURLConnection.getInputStream(HttpURLConnection.java:1149)
        at java.net.URL.openStream(URL.java:1007)
        at org.apache.solr.client.solrj.embedded.JettyWebappTest.testJSP(JettyWebappTest.java:91)
</error>

-Yonik
http://www.lucidimagination.com



On Mon, Jul 6, 2009 at 4:27 AM, <solr-dev@lucene.apache.org> wrote:
>
> init-forrest-entities:
>    [mkdir] Created dir: /tmp/apache-solr-nightly/build
>    [mkdir] Created dir: /tmp/apache-solr-nightly/build/web
>
> compile-solrj:
>    [mkdir] Created dir: /tmp/apache-solr-nightly/build/solrj
>    [javac] Compiling 83 source files to /tmp/apache-solr-nightly/build/solrj
>    [javac] Note: Some input files use or override a deprecated API.
>    [javac] Note: Recompile with -Xlint:deprecation for details.
>    [javac] Note: Some input files use unchecked or unsafe operations.
>    [javac] Note: Recompile with -Xlint:unchecked for details.
>
> compile:
>    [mkdir] Created dir: /tmp/apache-solr-nightly/build/solr
>    [javac] Compiling 375 source files to /tmp/apache-solr-nightly/build/solr
>    [javac] Note: Some input files use or override a deprecated API.
>    [javac] Note: Recompile with -Xlint:deprecation for details.
>    [javac] Note: Some input files use unchecked or unsafe operations.
>    [javac] Note: Recompile with -Xlint:unchecked for details.
>
> compileTests:
>    [mkdir] Created dir: /tmp/apache-solr-nightly/build/tests
>    [javac] Compiling 163 source files to /tmp/apache-solr-nightly/build/tests
>    [javac] Note: Some input files use or override a deprecated API.
>    [javac] Note: Recompile with -Xlint:deprecation for details.
>    [javac] Note: Some input files use unchecked or unsafe operations.
>    [javac] Note: Recompile with -Xlint:unchecked for details.
>
> junit:
>    [mkdir] Created dir: /tmp/apache-solr-nightly/build/test-results
>    [junit] Running org.apache.solr.BasicFunctionalityTest
>    [junit] Tests run: 19, Failures: 0, Errors: 0, Time elapsed: 18.117 sec
>    [junit] Running org.apache.solr.ConvertedLegacyTest
>    [junit] Tests run: 1, Failures: 0, Errors: 0, Time elapsed: 8.976 sec
>    [junit] Running org.apache.solr.DisMaxRequestHandlerTest
>    [junit] Tests run: 3, Failures: 0, Errors: 0, Time elapsed: 6.219 sec
>    [junit] Running org.apache.solr.EchoParamsTest
>    [junit] Tests run: 4, Failures: 0, Errors: 0, Time elapsed: 2.558 sec
>    [junit] Running org.apache.solr.OutputWriterTest
>    [junit] Tests run: 3, Failures: 0, Errors: 0, Time elapsed: 3.309 sec
>    [junit] Running org.apache.solr.SampleTest
>    [junit] Tests run: 2, Failures: 0, Errors: 0, Time elapsed: 2.378 sec
>    [junit] Running org.apache.solr.SolrInfoMBeanTest
>    [junit] Tests run: 1, Failures: 0, Errors: 0, Time elapsed: 0.94 sec
>    [junit] Running org.apache.solr.TestDistributedSearch
>    [junit] Tests run: 1, Failures: 0, Errors: 0, Time elapsed: 47.478 sec
>    [junit] Running org.apache.solr.TestTrie
>    [junit] Tests run: 7, Failures: 0, Errors: 0, Time elapsed: 10.396 sec
>    [junit] Running org.apache.solr.analysis.DoubleMetaphoneFilterFactoryTest
>    [junit] Tests run: 2, Failures: 0, Errors: 0, Time elapsed: 0.409 sec
>    [junit] Running org.apache.solr.analysis.DoubleMetaphoneFilterTest
>    [junit] Tests run: 6, Failures: 0, Errors: 0, Time elapsed: 0.518 sec
>    [junit] Running org.apache.solr.analysis.EnglishPorterFilterFactoryTest
>    [junit] Tests run: 2, Failures: 0, Errors: 0, Time elapsed: 1.533 sec
>    [junit] Running org.apache.solr.analysis.HTMLStripReaderTest
>    [junit] Tests run: 9, Failures: 0, Errors: 0, Time elapsed: 1.015 sec
>    [junit] Running org.apache.solr.analysis.LengthFilterTest
>    [junit] Tests run: 1, Failures: 0, Errors: 0, Time elapsed: 1.61 sec
>    [junit] Running org.apache.solr.analysis.SnowballPorterFilterFactoryTest
>    [junit] Tests run: 2, Failures: 0, Errors: 0, Time elapsed: 3.338 sec
>    [junit] Running org.apache.solr.analysis.TestBufferedTokenStream
>    [junit] Tests run: 2, Failures: 0, Errors: 0, Time elapsed: 1.267 sec
>    [junit] Running org.apache.solr.analysis.TestCapitalizationFilter
>    [junit] Tests run: 2, Failures: 0, Errors: 0, Time elapsed: 1.481 sec
>    [junit] Running org.apache.solr.analysis.TestCharFilter
>    [junit] Tests run: 4, Failures: 0, Errors: 0, Time elapsed: 0.385 sec
>    [junit] Running org.apache.solr.analysis.TestHyphenatedWordsFilter
>    [junit] Tests run: 1, Failures: 0, Errors: 0, Time elapsed: 1.07 sec
>    [junit] Running org.apache.solr.analysis.TestKeepFilterFactory
>    [junit] Tests run: 1, Failures: 0, Errors: 0, Time elapsed: 3.081 sec
>    [junit] Running org.apache.solr.analysis.TestKeepWordFilter
>    [junit] Tests run: 1, Failures: 0, Errors: 0, Time elapsed: 1.465 sec
>    [junit] Running org.apache.solr.analysis.TestMappingCharFilter
>    [junit] Tests run: 11, Failures: 0, Errors: 0, Time elapsed: 0.398 sec
>    [junit] Running org.apache.solr.analysis.TestMappingCharFilterFactory
>    [junit] Tests run: 1, Failures: 0, Errors: 0, Time elapsed: 0.572 sec
>    [junit] Running org.apache.solr.analysis.TestPatternReplaceFilter
>    [junit] Tests run: 5, Failures: 0, Errors: 0, Time elapsed: 2.669 sec
>    [junit] Running org.apache.solr.analysis.TestPatternTokenizerFactory
>    [junit] Tests run: 1, Failures: 0, Errors: 0, Time elapsed: 1.251 sec
>    [junit] Running org.apache.solr.analysis.TestPhoneticFilter
>    [junit] Tests run: 2, Failures: 0, Errors: 0, Time elapsed: 1.232 sec
>    [junit] Running org.apache.solr.analysis.TestRemoveDuplicatesTokenFilter
>    [junit] Tests run: 3, Failures: 0, Errors: 0, Time elapsed: 2.049 sec
>    [junit] Running org.apache.solr.analysis.TestStopFilterFactory
>    [junit] Tests run: 1, Failures: 0, Errors: 0, Time elapsed: 2.616 sec
>    [junit] Running org.apache.solr.analysis.TestSynonymFilter
>    [junit] Tests run: 7, Failures: 0, Errors: 0, Time elapsed: 2.987 sec
>    [junit] Running org.apache.solr.analysis.TestSynonymMap
>    [junit] Tests run: 5, Failures: 0, Errors: 0, Time elapsed: 2.041 sec
>    [junit] Running org.apache.solr.analysis.TestTrimFilter
>    [junit] Tests run: 1, Failures: 0, Errors: 0, Time elapsed: 2.144 sec
>    [junit] Running org.apache.solr.analysis.TestWordDelimiterFilter
>    [junit] Tests run: 12, Failures: 0, Errors: 0, Time elapsed: 20.241 sec
>    [junit] Running org.apache.solr.client.solrj.SolrExceptionTest
>    [junit] Tests run: 1, Failures: 0, Errors: 0, Time elapsed: 1.004 sec
>    [junit] Running org.apache.solr.client.solrj.SolrQueryTest
>    [junit] Tests run: 5, Failures: 0, Errors: 0, Time elapsed: 0.424 sec
>    [junit] Running org.apache.solr.client.solrj.TestBatchUpdate
>    [junit] Tests run: 3, Failures: 0, Errors: 0, Time elapsed: 12.903 sec
>    [junit] Running org.apache.solr.client.solrj.TestLBHttpSolrServer
>    [junit] Tests run: 2, Failures: 0, Errors: 0, Time elapsed: 14.718 sec
>    [junit] Running org.apache.solr.client.solrj.beans.TestDocumentObjectBinder
>    [junit] Tests run: 3, Failures: 0, Errors: 0, Time elapsed: 0.771 sec
>    [junit] Running org.apache.solr.client.solrj.embedded.JettyWebappTest
>    [junit] Tests run: 1, Failures: 0, Errors: 1, Time elapsed: 15.217 sec
>    [junit] Test org.apache.solr.client.solrj.embedded.JettyWebappTest FAILED
>    [junit] Running org.apache.solr.client.solrj.embedded.LargeVolumeBinaryJettyTest
>    [junit] Tests run: 1, Failures: 0, Errors: 0, Time elapsed: 12.334 sec
>    [junit] Running org.apache.solr.client.solrj.embedded.LargeVolumeEmbeddedTest
>    [junit] Tests run: 1, Failures: 0, Errors: 0, Time elapsed: 7.045 sec
>    [junit] Running org.apache.solr.client.solrj.embedded.LargeVolumeJettyTest
>    [junit] Tests run: 1, Failures: 0, Errors: 0, Time elapsed: 11.325 sec
>    [junit] Running org.apache.solr.client.solrj.embedded.MergeIndexesEmbeddedTest
>    [junit] Tests run: 1, Failures: 0, Errors: 0, Time elapsed: 4.986 sec
>    [junit] Running org.apache.solr.client.solrj.embedded.MultiCoreEmbeddedTest
>    [junit] Tests run: 1, Failures: 0, Errors: 0, Time elapsed: 9.305 sec
>    [junit] Running org.apache.solr.client.solrj.embedded.MultiCoreExampleJettyTest
>    [junit] Tests run: 1, Failures: 0, Errors: 0, Time elapsed: 10.075 sec
>    [junit] Running org.apache.solr.client.solrj.embedded.SolrExampleEmbeddedTest
>    [junit] Tests run: 8, Failures: 0, Errors: 0, Time elapsed: 15.486 sec
>    [junit] Running org.apache.solr.client.solrj.embedded.SolrExampleJettyTest
>    [junit] Tests run: 9, Failures: 0, Errors: 0, Time elapsed: 41.354 sec
>    [junit] Running org.apache.solr.client.solrj.embedded.SolrExampleStreamingTest
>    [junit] Tests run: 8, Failures: 0, Errors: 0, Time elapsed: 55.114 sec
>    [junit] Running org.apache.solr.client.solrj.embedded.TestSolrProperties
>    [junit] Tests run: 1, Failures: 0, Errors: 0, Time elapsed: 4.833 sec
>    [junit] Running org.apache.solr.client.solrj.request.TestUpdateRequestCodec
>    [junit] Tests run: 1, Failures: 0, Errors: 0, Time elapsed: 0.405 sec
>    [junit] Running org.apache.solr.client.solrj.response.AnlysisResponseBaseTest
>    [junit] Tests run: 2, Failures: 0, Errors: 0, Time elapsed: 0.87 sec
>    [junit] Running org.apache.solr.client.solrj.response.DocumentAnalysisResponseTest
>    [junit] Tests run: 1, Failures: 0, Errors: 0, Time elapsed: 0.395 sec
>    [junit] Running org.apache.solr.client.solrj.response.FieldAnalysisResponseTest
>    [junit] Tests run: 1, Failures: 0, Errors: 0, Time elapsed: 0.527 sec
>    [junit] Running org.apache.solr.client.solrj.response.QueryResponseTest
>    [junit] Tests run: 1, Failures: 0, Errors: 0, Time elapsed: 1.539 sec
>    [junit] Running org.apache.solr.client.solrj.response.TestSpellCheckResponse
>    [junit] Tests run: 2, Failures: 0, Errors: 0, Time elapsed: 12.459 sec
>    [junit] Running org.apache.solr.client.solrj.util.ClientUtilsTest
>    [junit] Tests run: 1, Failures: 0, Errors: 0, Time elapsed: 0.428 sec
>    [junit] Running org.apache.solr.common.SolrDocumentTest
>    [junit] Tests run: 5, Failures: 0, Errors: 0, Time elapsed: 0.38 sec
>    [junit] Running org.apache.solr.common.params.ModifiableSolrParamsTest
>    [junit] Tests run: 5, Failures: 0, Errors: 0, Time elapsed: 0.481 sec
>    [junit] Running org.apache.solr.common.params.SolrParamTest
>    [junit] Tests run: 1, Failures: 0, Errors: 0, Time elapsed: 0.48 sec
>    [junit] Running org.apache.solr.common.util.ContentStreamTest
>    [junit] Tests run: 3, Failures: 0, Errors: 0, Time elapsed: 0.599 sec
>    [junit] Running org.apache.solr.common.util.DOMUtilTest
>    [junit] Tests run: 1, Failures: 0, Errors: 0, Time elapsed: 0.652 sec
>    [junit] Running org.apache.solr.common.util.FileUtilsTest
>    [junit] Tests run: 1, Failures: 0, Errors: 0, Time elapsed: 0.484 sec
>    [junit] Running org.apache.solr.common.util.IteratorChainTest
>    [junit] Tests run: 7, Failures: 0, Errors: 0, Time elapsed: 0.511 sec
>    [junit] Running org.apache.solr.common.util.NamedListTest
>    [junit] Tests run: 1, Failures: 0, Errors: 0, Time elapsed: 0.466 sec
>    [junit] Running org.apache.solr.common.util.TestFastInputStream
>    [junit] Tests run: 1, Failures: 0, Errors: 0, Time elapsed: 0.443 sec
>    [junit] Running org.apache.solr.common.util.TestHash
>    [junit] Tests run: 2, Failures: 0, Errors: 0, Time elapsed: 0.716 sec
>    [junit] Running org.apache.solr.common.util.TestNamedListCodec
>    [junit] Tests run: 4, Failures: 0, Errors: 0, Time elapsed: 2.594 sec
>    [junit] Running org.apache.solr.common.util.TestXMLEscaping
>    [junit] Tests run: 7, Failures: 0, Errors: 0, Time elapsed: 0.485 sec
>    [junit] Running org.apache.solr.core.AlternateDirectoryTest
>    [junit] Tests run: 1, Failures: 0, Errors: 0, Time elapsed: 4.394 sec
>    [junit] Running org.apache.solr.core.AlternateIndexReaderTest
>    [junit] Tests run: 1, Failures: 0, Errors: 0, Time elapsed: 3.787 sec
>    [junit] Running org.apache.solr.core.RequestHandlersTest
>    [junit] Tests run: 2, Failures: 0, Errors: 0, Time elapsed: 5.82 sec
>    [junit] Running org.apache.solr.core.ResourceLoaderTest
>    [junit] Tests run: 2, Failures: 0, Errors: 0, Time elapsed: 0.49 sec
>    [junit] Running org.apache.solr.core.SOLR749Test
>    [junit] Tests run: 1, Failures: 0, Errors: 0, Time elapsed: 5.713 sec
>    [junit] Running org.apache.solr.core.SolrCoreTest
>    [junit] Tests run: 4, Failures: 0, Errors: 0, Time elapsed: 13.398 sec
>    [junit] Running org.apache.solr.core.TestArbitraryIndexDir
>    [junit] Tests run: 1, Failures: 0, Errors: 0, Time elapsed: 9.45 sec
>    [junit] Running org.apache.solr.core.TestBadConfig
>    [junit] Tests run: 1, Failures: 0, Errors: 0, Time elapsed: 0.495 sec
>    [junit] Running org.apache.solr.core.TestConfig
>    [junit] Tests run: 3, Failures: 0, Errors: 0, Time elapsed: 15.946 sec
>    [junit] Running org.apache.solr.core.TestJmxIntegration
>    [junit] Tests run: 2, Failures: 0, Errors: 0, Time elapsed: 7.35 sec
>    [junit] Running org.apache.solr.core.TestJmxMonitoredMap
>    [junit] Tests run: 1, Failures: 0, Errors: 0, Time elapsed: 1.598 sec
>    [junit] Running org.apache.solr.core.TestQuerySenderListener
>    [junit] Tests run: 1, Failures: 0, Errors: 0, Time elapsed: 2.388 sec
>    [junit] Running org.apache.solr.core.TestSolrDeletionPolicy1
>    [junit] Tests run: 3, Failures: 0, Errors: 0, Time elapsed: 16.019 sec
>    [junit] Running org.apache.solr.core.TestSolrDeletionPolicy2
>    [junit] Tests run: 1, Failures: 0, Errors: 0, Time elapsed: 5.558 sec
>    [junit] Running org.apache.solr.handler.AnalysisRequestHandlerTest
>    [junit] Tests run: 1, Failures: 0, Errors: 0, Time elapsed: 6.633 sec
>    [junit] Running org.apache.solr.handler.DocumentAnalysisRequestHandlerTest
>    [junit] Tests run: 2, Failures: 0, Errors: 0, Time elapsed: 8.017 sec
>    [junit] Running org.apache.solr.handler.FieldAnalysisRequestHandlerTest
>    [junit] Tests run: 2, Failures: 0, Errors: 0, Time elapsed: 7.277 sec
>    [junit] Running org.apache.solr.handler.MoreLikeThisHandlerTest
>    [junit] Tests run: 1, Failures: 0, Errors: 0, Time elapsed: 10.642 sec
>    [junit] Running org.apache.solr.handler.SpellCheckerRequestHandlerTest
>    [junit] Tests run: 5, Failures: 0, Errors: 0, Time elapsed: 9.229 sec
>    [junit] Running org.apache.solr.handler.StandardRequestHandlerTest
>    [junit] Tests run: 1, Failures: 0, Errors: 0, Time elapsed: 5.877 sec
>    [junit] Running org.apache.solr.handler.TestCSVLoader
>    [junit] Tests run: 4, Failures: 0, Errors: 0, Time elapsed: 16.356 sec
>    [junit] Running org.apache.solr.handler.TestReplicationHandler
>    [junit] Tests run: 5, Failures: 0, Errors: 0, Time elapsed: 65.831 sec
>    [junit] Running org.apache.solr.handler.XmlUpdateRequestHandlerTest
>    [junit] Tests run: 1, Failures: 0, Errors: 0, Time elapsed: 9.197 sec
>    [junit] Running org.apache.solr.handler.admin.LukeRequestHandlerTest
>    [junit] Tests run: 1, Failures: 0, Errors: 0, Time elapsed: 0.533 sec
>    [junit] Running org.apache.solr.handler.admin.SystemInfoHandlerTest
>    [junit] Tests run: 1, Failures: 0, Errors: 0, Time elapsed: 0.478 sec
>    [junit] Running org.apache.solr.handler.component.QueryElevationComponentTest
>    [junit] Tests run: 4, Failures: 0, Errors: 0, Time elapsed: 17.826 sec
>    [junit] Running org.apache.solr.handler.component.SearchHandlerTest
>    [junit] Tests run: 1, Failures: 0, Errors: 0, Time elapsed: 5.923 sec
>    [junit] Running org.apache.solr.handler.component.SpellCheckComponentTest
>    [junit] Tests run: 8, Failures: 0, Errors: 0, Time elapsed: 27.355 sec
>    [junit] Running org.apache.solr.handler.component.TermVectorComponentTest
>    [junit] Tests run: 4, Failures: 0, Errors: 0, Time elapsed: 15.96 sec
>    [junit] Running org.apache.solr.handler.component.TermsComponentTest
>    [junit] Tests run: 9, Failures: 0, Errors: 0, Time elapsed: 26.042 sec
>    [junit] Running org.apache.solr.highlight.HighlighterConfigTest
>    [junit] Tests run: 1, Failures: 0, Errors: 0, Time elapsed: 4.267 sec
>    [junit] Running org.apache.solr.highlight.HighlighterTest
>    [junit] Tests run: 22, Failures: 0, Errors: 0, Time elapsed: 35.461 sec
>    [junit] Running org.apache.solr.request.JSONWriterTest
>    [junit] Tests run: 3, Failures: 0, Errors: 0, Time elapsed: 12.489 sec
>    [junit] Running org.apache.solr.request.SimpleFacetsLegacySortTest
>    [junit] Tests run: 1, Failures: 0, Errors: 0, Time elapsed: 9.373 sec
>    [junit] Running org.apache.solr.request.SimpleFacetsTest
>    [junit] Tests run: 6, Failures: 0, Errors: 0, Time elapsed: 39.329 sec
>    [junit] Running org.apache.solr.request.TestBinaryResponseWriter
>    [junit] Tests run: 1, Failures: 0, Errors: 0, Time elapsed: 4.639 sec
>    [junit] Running org.apache.solr.request.TestFaceting
>    [junit] Tests run: 3, Failures: 0, Errors: 0, Time elapsed: 35.491 sec
>    [junit] Running org.apache.solr.request.TestWriterPerf
>    [junit] Tests run: 1, Failures: 0, Errors: 0, Time elapsed: 5.423 sec
>    [junit] Running org.apache.solr.schema.BadIndexSchemaTest
>    [junit] Tests run: 1, Failures: 0, Errors: 0, Time elapsed: 4.754 sec
>    [junit] Running org.apache.solr.schema.CopyFieldTest
>    [junit] Tests run: 6, Failures: 0, Errors: 0, Time elapsed: 17.597 sec
>    [junit] Running org.apache.solr.schema.DateFieldTest
>    [junit] Tests run: 6, Failures: 0, Errors: 0, Time elapsed: 0.469 sec
>    [junit] Running org.apache.solr.schema.IndexSchemaTest
>    [junit] Tests run: 4, Failures: 0, Errors: 0, Time elapsed: 15.722 sec
>    [junit] Running org.apache.solr.schema.LegacyDateFieldTest
>    [junit] Tests run: 4, Failures: 0, Errors: 0, Time elapsed: 0.41 sec
>    [junit] Running org.apache.solr.schema.NotRequiredUniqueKeyTest
>    [junit] Tests run: 1, Failures: 0, Errors: 0, Time elapsed: 2.373 sec
>    [junit] Running org.apache.solr.schema.RequiredFieldsTest
>    [junit] Tests run: 3, Failures: 0, Errors: 0, Time elapsed: 11.338 sec
>    [junit] Running org.apache.solr.schema.TestBinaryField
>    [junit] Tests run: 1, Failures: 0, Errors: 0, Time elapsed: 3.214 sec
>    [junit] Running org.apache.solr.schema.UUIDFieldTest
>    [junit] Tests run: 1, Failures: 0, Errors: 0, Time elapsed: 0.91 sec
>    [junit] Running org.apache.solr.search.TestDocSet
>    [junit] Tests run: 2, Failures: 0, Errors: 0, Time elapsed: 1.783 sec
>    [junit] Running org.apache.solr.search.TestFastLRUCache
>    [junit] Tests run: 2, Failures: 0, Errors: 0, Time elapsed: 0.717 sec
>    [junit] Running org.apache.solr.search.TestIndexSearcher
>    [junit] Tests run: 1, Failures: 0, Errors: 0, Time elapsed: 4.781 sec
>    [junit] Running org.apache.solr.search.TestQueryTypes
>    [junit] Tests run: 1, Failures: 0, Errors: 0, Time elapsed: 5.06 sec
>    [junit] Running org.apache.solr.search.TestQueryUtils
>    [junit] Tests run: 1, Failures: 0, Errors: 0, Time elapsed: 8.93 sec
>    [junit] Running org.apache.solr.search.TestRangeQuery
>    [junit] Tests run: 2, Failures: 0, Errors: 0, Time elapsed: 22.185 sec
>    [junit] Running org.apache.solr.search.TestSearchPerf
>    [junit] Tests run: 1, Failures: 0, Errors: 0, Time elapsed: 4.196 sec
>    [junit] Running org.apache.solr.search.function.TestFunctionQuery
>    [junit] Tests run: 3, Failures: 0, Errors: 0, Time elapsed: 15.51 sec
>    [junit] Running org.apache.solr.servlet.CacheHeaderTest
>    [junit] Tests run: 5, Failures: 0, Errors: 0, Time elapsed: 19.502 sec
>    [junit] Running org.apache.solr.servlet.DirectSolrConnectionTest
>    [junit] Tests run: 2, Failures: 0, Errors: 0, Time elapsed: 2.755 sec
>    [junit] Running org.apache.solr.servlet.NoCacheHeaderTest
>    [junit] Tests run: 3, Failures: 0, Errors: 0, Time elapsed: 8.416 sec
>    [junit] Running org.apache.solr.servlet.SolrRequestParserTest
>    [junit] Tests run: 4, Failures: 0, Errors: 0, Time elapsed: 7.835 sec
>    [junit] Running org.apache.solr.spelling.FileBasedSpellCheckerTest
>    [junit] Tests run: 3, Failures: 0, Errors: 0, Time elapsed: 8.512 sec
>    [junit] Running org.apache.solr.spelling.IndexBasedSpellCheckerTest
>    [junit] Tests run: 4, Failures: 0, Errors: 0, Time elapsed: 5.685 sec
>    [junit] Running org.apache.solr.spelling.SpellingQueryConverterTest
>    [junit] Tests run: 1, Failures: 0, Errors: 0, Time elapsed: 2.73 sec
>    [junit] Running org.apache.solr.update.AutoCommitTest
>    [junit] Tests run: 1, Failures: 0, Errors: 0, Time elapsed: 6.995 sec
>    [junit] Running org.apache.solr.update.DirectUpdateHandlerOptimizeTest
>    [junit] Tests run: 1, Failures: 0, Errors: 0, Time elapsed: 4.196 sec
>    [junit] Running org.apache.solr.update.DirectUpdateHandlerTest
>    [junit] Tests run: 6, Failures: 0, Errors: 0, Time elapsed: 15.227 sec
>    [junit] Running org.apache.solr.update.DocumentBuilderTest
>    [junit] Tests run: 2, Failures: 0, Errors: 0, Time elapsed: 6.122 sec
>    [junit] Running org.apache.solr.update.processor.SignatureUpdateProcessorFactoryTest
>    [junit] Tests run: 2, Failures: 0, Errors: 0, Time elapsed: 13.393 sec
>    [junit] Running org.apache.solr.update.processor.UpdateRequestProcessorFactoryTest
>    [junit] Tests run: 1, Failures: 0, Errors: 0, Time elapsed: 4.152 sec
>    [junit] Running org.apache.solr.util.ArraysUtilsTest
>    [junit] Tests run: 1, Failures: 0, Errors: 0, Time elapsed: 0.437 sec
>    [junit] Running org.apache.solr.util.DateMathParserTest
>    [junit] Tests run: 7, Failures: 0, Errors: 0, Time elapsed: 0.442 sec
>    [junit] Running org.apache.solr.util.SolrPluginUtilsTest
>    [junit] Tests run: 6, Failures: 0, Errors: 0, Time elapsed: 17.26 sec
>    [junit] Running org.apache.solr.util.TestCharArrayMap
>    [junit] Tests run: 2, Failures: 0, Errors: 0, Time elapsed: 0.646 sec
>    [junit] Running org.apache.solr.util.TestNumberUtils
>    [junit] Tests run: 1, Failures: 0, Errors: 0, Time elapsed: 1.908 sec
>    [junit] Running org.apache.solr.util.TestOpenBitSet
>    [junit] Tests run: 3, Failures: 0, Errors: 0, Time elapsed: 1.731 sec
>    [junit] Running org.apache.solr.util.TestUtils
>    [junit] Tests run: 3, Failures: 0, Errors: 0, Time elapsed: 0.399 sec
>
> BUILD FAILED
> /tmp/apache-solr-nightly/build.xml:386: Tests failed!
>
> Total time: 22 minutes 13 seconds
>
>
>

Mime
View raw message