lucene-solr-dev mailing list archives

Site index · List index
Message view « Date » · « Thread »
Top « Date » · « Thread »
From solr-...@lucene.apache.org
Subject Solr nightly build failure
Date Sun, 21 Jun 2009 08:19:15 GMT

init-forrest-entities:
    [mkdir] Created dir: /tmp/apache-solr-nightly/build
    [mkdir] Created dir: /tmp/apache-solr-nightly/build/web

compile-solrj:
    [mkdir] Created dir: /tmp/apache-solr-nightly/build/solrj
    [javac] Compiling 83 source files to /tmp/apache-solr-nightly/build/solrj
    [javac] Note: Some input files use or override a deprecated API.
    [javac] Note: Recompile with -Xlint:deprecation for details.
    [javac] Note: Some input files use unchecked or unsafe operations.
    [javac] Note: Recompile with -Xlint:unchecked for details.

compile:
    [mkdir] Created dir: /tmp/apache-solr-nightly/build/solr
    [javac] Compiling 375 source files to /tmp/apache-solr-nightly/build/solr
    [javac] Note: Some input files use or override a deprecated API.
    [javac] Note: Recompile with -Xlint:deprecation for details.
    [javac] Note: Some input files use unchecked or unsafe operations.
    [javac] Note: Recompile with -Xlint:unchecked for details.

compileTests:
    [mkdir] Created dir: /tmp/apache-solr-nightly/build/tests
    [javac] Compiling 162 source files to /tmp/apache-solr-nightly/build/tests
    [javac] Note: Some input files use or override a deprecated API.
    [javac] Note: Recompile with -Xlint:deprecation for details.
    [javac] Note: Some input files use unchecked or unsafe operations.
    [javac] Note: Recompile with -Xlint:unchecked for details.

junit:
    [mkdir] Created dir: /tmp/apache-solr-nightly/build/test-results
    [junit] Running org.apache.solr.BasicFunctionalityTest
    [junit] Tests run: 19, Failures: 0, Errors: 0, Time elapsed: 15.74 sec
    [junit] Running org.apache.solr.ConvertedLegacyTest
    [junit] Tests run: 1, Failures: 0, Errors: 0, Time elapsed: 7.519 sec
    [junit] Running org.apache.solr.DisMaxRequestHandlerTest
    [junit] Tests run: 3, Failures: 0, Errors: 0, Time elapsed: 5.103 sec
    [junit] Running org.apache.solr.EchoParamsTest
    [junit] Tests run: 4, Failures: 0, Errors: 0, Time elapsed: 2.417 sec
    [junit] Running org.apache.solr.OutputWriterTest
    [junit] Tests run: 3, Failures: 0, Errors: 0, Time elapsed: 2.547 sec
    [junit] Running org.apache.solr.SampleTest
    [junit] Tests run: 2, Failures: 0, Errors: 0, Time elapsed: 2.236 sec
    [junit] Running org.apache.solr.SolrInfoMBeanTest
    [junit] Tests run: 1, Failures: 0, Errors: 0, Time elapsed: 0.907 sec
    [junit] Running org.apache.solr.TestDistributedSearch
    [junit] Tests run: 1, Failures: 0, Errors: 0, Time elapsed: 25.015 sec
    [junit] Running org.apache.solr.TestTrie
    [junit] Tests run: 7, Failures: 0, Errors: 0, Time elapsed: 8.421 sec
    [junit] Running org.apache.solr.analysis.DoubleMetaphoneFilterFactoryTest
    [junit] Tests run: 2, Failures: 0, Errors: 0, Time elapsed: 0.42 sec
    [junit] Running org.apache.solr.analysis.DoubleMetaphoneFilterTest
    [junit] Tests run: 6, Failures: 0, Errors: 0, Time elapsed: 0.398 sec
    [junit] Running org.apache.solr.analysis.EnglishPorterFilterFactoryTest
    [junit] Tests run: 2, Failures: 0, Errors: 0, Time elapsed: 1.532 sec
    [junit] Running org.apache.solr.analysis.HTMLStripReaderTest
    [junit] Tests run: 9, Failures: 0, Errors: 0, Time elapsed: 1.531 sec
    [junit] Running org.apache.solr.analysis.LengthFilterTest
    [junit] Tests run: 1, Failures: 0, Errors: 0, Time elapsed: 1.298 sec
    [junit] Running org.apache.solr.analysis.SnowballPorterFilterFactoryTest
    [junit] Tests run: 2, Failures: 0, Errors: 0, Time elapsed: 1.362 sec
    [junit] Running org.apache.solr.analysis.TestBufferedTokenStream
    [junit] Tests run: 2, Failures: 0, Errors: 0, Time elapsed: 1.384 sec
    [junit] Running org.apache.solr.analysis.TestCapitalizationFilter
    [junit] Tests run: 2, Failures: 0, Errors: 0, Time elapsed: 1.476 sec
    [junit] Running org.apache.solr.analysis.TestCharFilter
    [junit] Tests run: 4, Failures: 0, Errors: 0, Time elapsed: 0.548 sec
    [junit] Running org.apache.solr.analysis.TestHyphenatedWordsFilter
    [junit] Tests run: 1, Failures: 0, Errors: 0, Time elapsed: 1.163 sec
    [junit] Running org.apache.solr.analysis.TestKeepFilterFactory
    [junit] Tests run: 1, Failures: 0, Errors: 0, Time elapsed: 2.193 sec
    [junit] Running org.apache.solr.analysis.TestKeepWordFilter
    [junit] Tests run: 1, Failures: 0, Errors: 0, Time elapsed: 1.257 sec
    [junit] Running org.apache.solr.analysis.TestMappingCharFilter
    [junit] Tests run: 11, Failures: 0, Errors: 0, Time elapsed: 0.434 sec
    [junit] Running org.apache.solr.analysis.TestMappingCharFilterFactory
    [junit] Tests run: 1, Failures: 0, Errors: 0, Time elapsed: 0.427 sec
    [junit] Running org.apache.solr.analysis.TestPatternReplaceFilter
    [junit] Tests run: 5, Failures: 0, Errors: 0, Time elapsed: 2.081 sec
    [junit] Running org.apache.solr.analysis.TestPatternTokenizerFactory
    [junit] Tests run: 1, Failures: 0, Errors: 0, Time elapsed: 1.184 sec
    [junit] Running org.apache.solr.analysis.TestPhoneticFilter
    [junit] Tests run: 2, Failures: 0, Errors: 0, Time elapsed: 1.532 sec
    [junit] Running org.apache.solr.analysis.TestRemoveDuplicatesTokenFilter
    [junit] Tests run: 3, Failures: 0, Errors: 0, Time elapsed: 1.584 sec
    [junit] Running org.apache.solr.analysis.TestStopFilterFactory
    [junit] Tests run: 1, Failures: 0, Errors: 0, Time elapsed: 2.581 sec
    [junit] Running org.apache.solr.analysis.TestSynonymFilter
    [junit] Tests run: 7, Failures: 0, Errors: 0, Time elapsed: 2.651 sec
    [junit] Running org.apache.solr.analysis.TestSynonymMap
    [junit] Tests run: 5, Failures: 0, Errors: 0, Time elapsed: 2.132 sec
    [junit] Running org.apache.solr.analysis.TestTrimFilter
    [junit] Tests run: 1, Failures: 0, Errors: 0, Time elapsed: 1.213 sec
    [junit] Running org.apache.solr.analysis.TestWordDelimiterFilter
    [junit] Tests run: 12, Failures: 0, Errors: 0, Time elapsed: 15.005 sec
    [junit] Running org.apache.solr.client.solrj.SolrExceptionTest
    [junit] Tests run: 1, Failures: 0, Errors: 0, Time elapsed: 1.393 sec
    [junit] Running org.apache.solr.client.solrj.SolrQueryTest
    [junit] Tests run: 5, Failures: 0, Errors: 0, Time elapsed: 0.404 sec
    [junit] Running org.apache.solr.client.solrj.TestBatchUpdate
    [junit] Tests run: 3, Failures: 0, Errors: 0, Time elapsed: 9.868 sec
    [junit] Running org.apache.solr.client.solrj.TestLBHttpSolrServer
    [junit] Tests run: 2, Failures: 0, Errors: 0, Time elapsed: 8.646 sec
    [junit] Running org.apache.solr.client.solrj.beans.TestDocumentObjectBinder
    [junit] Tests run: 3, Failures: 0, Errors: 0, Time elapsed: 0.639 sec
    [junit] Running org.apache.solr.client.solrj.embedded.JettyWebappTest
    [junit] Tests run: 1, Failures: 0, Errors: 0, Time elapsed: 7.233 sec
    [junit] Running org.apache.solr.client.solrj.embedded.LargeVolumeBinaryJettyTest
    [junit] Tests run: 1, Failures: 0, Errors: 0, Time elapsed: 5.56 sec
    [junit] Running org.apache.solr.client.solrj.embedded.LargeVolumeEmbeddedTest
    [junit] Tests run: 1, Failures: 0, Errors: 0, Time elapsed: 4.476 sec
    [junit] Running org.apache.solr.client.solrj.embedded.LargeVolumeJettyTest
    [junit] Tests run: 1, Failures: 0, Errors: 0, Time elapsed: 5.258 sec
    [junit] Running org.apache.solr.client.solrj.embedded.MergeIndexesEmbeddedTest
    [junit] Tests run: 1, Failures: 0, Errors: 1, Time elapsed: 1.619 sec
    [junit] Test org.apache.solr.client.solrj.embedded.MergeIndexesEmbeddedTest FAILED
    [junit] Running org.apache.solr.client.solrj.embedded.MultiCoreEmbeddedTest
    [junit] Tests run: 1, Failures: 0, Errors: 1, Time elapsed: 1.53 sec
    [junit] Test org.apache.solr.client.solrj.embedded.MultiCoreEmbeddedTest FAILED
    [junit] Running org.apache.solr.client.solrj.embedded.MultiCoreExampleJettyTest
    [junit] Tests run: 1, Failures: 0, Errors: 0, Time elapsed: 3.674 sec
    [junit] Running org.apache.solr.client.solrj.embedded.SolrExampleEmbeddedTest
    [junit] Tests run: 8, Failures: 0, Errors: 0, Time elapsed: 9.168 sec
    [junit] Running org.apache.solr.client.solrj.embedded.SolrExampleJettyTest
    [junit] Tests run: 9, Failures: 0, Errors: 0, Time elapsed: 16.851 sec
    [junit] Running org.apache.solr.client.solrj.embedded.SolrExampleStreamingTest
    [junit] Tests run: 8, Failures: 0, Errors: 0, Time elapsed: 21.649 sec
    [junit] Running org.apache.solr.client.solrj.embedded.TestSolrProperties
    [junit] Tests run: 1, Failures: 0, Errors: 0, Time elapsed: 2.659 sec
    [junit] Running org.apache.solr.client.solrj.request.TestUpdateRequestCodec
    [junit] Tests run: 1, Failures: 0, Errors: 0, Time elapsed: 0.386 sec
    [junit] Running org.apache.solr.client.solrj.response.AnlysisResponseBaseTest
    [junit] Tests run: 2, Failures: 0, Errors: 0, Time elapsed: 0.379 sec
    [junit] Running org.apache.solr.client.solrj.response.DocumentAnalysisResponseTest
    [junit] Tests run: 1, Failures: 0, Errors: 0, Time elapsed: 0.394 sec
    [junit] Running org.apache.solr.client.solrj.response.FieldAnalysisResponseTest
    [junit] Tests run: 1, Failures: 0, Errors: 0, Time elapsed: 0.426 sec
    [junit] Running org.apache.solr.client.solrj.response.QueryResponseTest
    [junit] Tests run: 1, Failures: 0, Errors: 0, Time elapsed: 0.615 sec
    [junit] Running org.apache.solr.client.solrj.response.TestSpellCheckResponse
    [junit] Tests run: 2, Failures: 0, Errors: 0, Time elapsed: 6.233 sec
    [junit] Running org.apache.solr.client.solrj.util.ClientUtilsTest
    [junit] Tests run: 1, Failures: 0, Errors: 0, Time elapsed: 0.393 sec
    [junit] Running org.apache.solr.common.SolrDocumentTest
    [junit] Tests run: 5, Failures: 0, Errors: 0, Time elapsed: 0.516 sec
    [junit] Running org.apache.solr.common.params.ModifiableSolrParamsTest
    [junit] Tests run: 5, Failures: 0, Errors: 0, Time elapsed: 0.541 sec
    [junit] Running org.apache.solr.common.params.SolrParamTest
    [junit] Tests run: 1, Failures: 0, Errors: 0, Time elapsed: 0.619 sec
    [junit] Running org.apache.solr.common.util.ContentStreamTest
    [junit] Tests run: 3, Failures: 0, Errors: 0, Time elapsed: 0.444 sec
    [junit] Running org.apache.solr.common.util.DOMUtilTest
    [junit] Tests run: 1, Failures: 0, Errors: 0, Time elapsed: 0.537 sec
    [junit] Running org.apache.solr.common.util.FileUtilsTest
    [junit] Tests run: 1, Failures: 0, Errors: 0, Time elapsed: 0.54 sec
    [junit] Running org.apache.solr.common.util.IteratorChainTest
    [junit] Tests run: 7, Failures: 0, Errors: 0, Time elapsed: 0.452 sec
    [junit] Running org.apache.solr.common.util.NamedListTest
    [junit] Tests run: 1, Failures: 0, Errors: 0, Time elapsed: 0.402 sec
    [junit] Running org.apache.solr.common.util.TestFastInputStream
    [junit] Tests run: 1, Failures: 0, Errors: 0, Time elapsed: 0.466 sec
    [junit] Running org.apache.solr.common.util.TestHash
    [junit] Tests run: 2, Failures: 0, Errors: 0, Time elapsed: 0.767 sec
    [junit] Running org.apache.solr.common.util.TestNamedListCodec
    [junit] Tests run: 4, Failures: 0, Errors: 0, Time elapsed: 2.178 sec
    [junit] Running org.apache.solr.common.util.TestXMLEscaping
    [junit] Tests run: 7, Failures: 0, Errors: 0, Time elapsed: 0.421 sec
    [junit] Running org.apache.solr.core.AlternateDirectoryTest
    [junit] Tests run: 1, Failures: 0, Errors: 0, Time elapsed: 3.974 sec
    [junit] Running org.apache.solr.core.AlternateIndexReaderTest
    [junit] Tests run: 1, Failures: 0, Errors: 0, Time elapsed: 3.857 sec
    [junit] Running org.apache.solr.core.RequestHandlersTest
    [junit] Tests run: 2, Failures: 0, Errors: 0, Time elapsed: 6.431 sec
    [junit] Running org.apache.solr.core.ResourceLoaderTest
    [junit] Tests run: 2, Failures: 0, Errors: 0, Time elapsed: 0.516 sec
    [junit] Running org.apache.solr.core.SOLR749Test
    [junit] Tests run: 1, Failures: 0, Errors: 0, Time elapsed: 3.739 sec
    [junit] Running org.apache.solr.core.SolrCoreTest
    [junit] Tests run: 4, Failures: 0, Errors: 0, Time elapsed: 14.076 sec
    [junit] Running org.apache.solr.core.TestArbitraryIndexDir
    [junit] Tests run: 1, Failures: 0, Errors: 0, Time elapsed: 3.714 sec
    [junit] Running org.apache.solr.core.TestBadConfig
    [junit] Tests run: 1, Failures: 0, Errors: 0, Time elapsed: 0.459 sec
    [junit] Running org.apache.solr.core.TestConfig
    [junit] Tests run: 3, Failures: 0, Errors: 0, Time elapsed: 5.462 sec
    [junit] Running org.apache.solr.core.TestJmxIntegration
    [junit] Tests run: 2, Failures: 0, Errors: 0, Time elapsed: 5.426 sec
    [junit] Running org.apache.solr.core.TestJmxMonitoredMap
    [junit] Tests run: 1, Failures: 0, Errors: 0, Time elapsed: 1.076 sec
    [junit] Running org.apache.solr.core.TestQuerySenderListener
    [junit] Tests run: 1, Failures: 0, Errors: 0, Time elapsed: 2.819 sec
    [junit] Running org.apache.solr.core.TestSolrDeletionPolicy1
    [junit] Tests run: 3, Failures: 0, Errors: 0, Time elapsed: 12.616 sec
    [junit] Running org.apache.solr.core.TestSolrDeletionPolicy2
    [junit] Tests run: 1, Failures: 0, Errors: 0, Time elapsed: 2.852 sec
    [junit] Running org.apache.solr.handler.AnalysisRequestHandlerTest
    [junit] Tests run: 1, Failures: 0, Errors: 0, Time elapsed: 2.839 sec
    [junit] Running org.apache.solr.handler.DocumentAnalysisRequestHandlerTest
    [junit] Tests run: 2, Failures: 0, Errors: 0, Time elapsed: 4.361 sec
    [junit] Running org.apache.solr.handler.FieldAnalysisRequestHandlerTest
    [junit] Tests run: 2, Failures: 0, Errors: 0, Time elapsed: 4.03 sec
    [junit] Running org.apache.solr.handler.MoreLikeThisHandlerTest
    [junit] Tests run: 1, Failures: 0, Errors: 0, Time elapsed: 3.113 sec
    [junit] Running org.apache.solr.handler.SpellCheckerRequestHandlerTest
    [junit] Tests run: 5, Failures: 0, Errors: 0, Time elapsed: 5.235 sec
    [junit] Running org.apache.solr.handler.StandardRequestHandlerTest
    [junit] Tests run: 1, Failures: 0, Errors: 0, Time elapsed: 3.677 sec
    [junit] Running org.apache.solr.handler.TestCSVLoader
    [junit] Tests run: 4, Failures: 0, Errors: 0, Time elapsed: 8.791 sec
    [junit] Running org.apache.solr.handler.TestReplicationHandler
    [junit] Tests run: 5, Failures: 0, Errors: 0, Time elapsed: 59.069 sec
    [junit] Running org.apache.solr.handler.XmlUpdateRequestHandlerTest
    [junit] Tests run: 1, Failures: 0, Errors: 0, Time elapsed: 2.759 sec
    [junit] Running org.apache.solr.handler.admin.LukeRequestHandlerTest
    [junit] Tests run: 1, Failures: 0, Errors: 0, Time elapsed: 0.357 sec
    [junit] Running org.apache.solr.handler.admin.SystemInfoHandlerTest
    [junit] Tests run: 1, Failures: 0, Errors: 0, Time elapsed: 0.386 sec
    [junit] Running org.apache.solr.handler.component.QueryElevationComponentTest
    [junit] Tests run: 4, Failures: 0, Errors: 0, Time elapsed: 6.219 sec
    [junit] Running org.apache.solr.handler.component.SearchHandlerTest
    [junit] Tests run: 1, Failures: 0, Errors: 0, Time elapsed: 2.728 sec
    [junit] Running org.apache.solr.handler.component.SpellCheckComponentTest
    [junit] Tests run: 8, Failures: 0, Errors: 0, Time elapsed: 10.42 sec
    [junit] Running org.apache.solr.handler.component.TermVectorComponentTest
    [junit] Tests run: 4, Failures: 0, Errors: 0, Time elapsed: 7.714 sec
    [junit] Running org.apache.solr.handler.component.TermsComponentTest
    [junit] Tests run: 9, Failures: 0, Errors: 0, Time elapsed: 10.916 sec
    [junit] Running org.apache.solr.highlight.HighlighterConfigTest
    [junit] Tests run: 1, Failures: 0, Errors: 0, Time elapsed: 2.758 sec
    [junit] Running org.apache.solr.highlight.HighlighterTest
    [junit] Tests run: 22, Failures: 0, Errors: 0, Time elapsed: 18.469 sec
    [junit] Running org.apache.solr.request.JSONWriterTest
    [junit] Tests run: 3, Failures: 0, Errors: 0, Time elapsed: 5.336 sec
    [junit] Running org.apache.solr.request.SimpleFacetsLegacySortTest
    [junit] Tests run: 1, Failures: 0, Errors: 0, Time elapsed: 3.588 sec
    [junit] Running org.apache.solr.request.SimpleFacetsTest
    [junit] Tests run: 6, Failures: 0, Errors: 0, Time elapsed: 12.238 sec
    [junit] Running org.apache.solr.request.TestBinaryResponseWriter
    [junit] Tests run: 1, Failures: 0, Errors: 0, Time elapsed: 2.993 sec
    [junit] Running org.apache.solr.request.TestFaceting
    [junit] Tests run: 3, Failures: 0, Errors: 0, Time elapsed: 15.058 sec
    [junit] Running org.apache.solr.request.TestWriterPerf
    [junit] Tests run: 1, Failures: 0, Errors: 0, Time elapsed: 2.998 sec
    [junit] Running org.apache.solr.schema.BadIndexSchemaTest
    [junit] Tests run: 1, Failures: 0, Errors: 0, Time elapsed: 2.105 sec
    [junit] Running org.apache.solr.schema.CopyFieldTest
    [junit] Tests run: 6, Failures: 0, Errors: 0, Time elapsed: 6.604 sec
    [junit] Running org.apache.solr.schema.DateFieldTest
    [junit] Tests run: 6, Failures: 0, Errors: 0, Time elapsed: 0.474 sec
    [junit] Running org.apache.solr.schema.IndexSchemaTest
    [junit] Tests run: 4, Failures: 0, Errors: 0, Time elapsed: 5.749 sec
    [junit] Running org.apache.solr.schema.LegacyDateFieldTest
    [junit] Tests run: 4, Failures: 0, Errors: 0, Time elapsed: 0.427 sec
    [junit] Running org.apache.solr.schema.NotRequiredUniqueKeyTest
    [junit] Tests run: 1, Failures: 0, Errors: 0, Time elapsed: 1.809 sec
    [junit] Running org.apache.solr.schema.RequiredFieldsTest
    [junit] Tests run: 3, Failures: 0, Errors: 0, Time elapsed: 4.93 sec
    [junit] Running org.apache.solr.schema.TestBinaryField
    [junit] Tests run: 1, Failures: 0, Errors: 0, Time elapsed: 3.078 sec
    [junit] Running org.apache.solr.schema.UUIDFieldTest
    [junit] Tests run: 1, Failures: 0, Errors: 0, Time elapsed: 0.656 sec
    [junit] Running org.apache.solr.search.TestDocSet
    [junit] Tests run: 2, Failures: 0, Errors: 0, Time elapsed: 1.378 sec
    [junit] Running org.apache.solr.search.TestFastLRUCache
    [junit] Tests run: 2, Failures: 0, Errors: 0, Time elapsed: 0.391 sec
    [junit] Running org.apache.solr.search.TestQueryTypes
    [junit] Tests run: 1, Failures: 0, Errors: 0, Time elapsed: 2.7 sec
    [junit] Running org.apache.solr.search.TestQueryUtils
    [junit] Tests run: 1, Failures: 0, Errors: 0, Time elapsed: 3.301 sec
    [junit] Running org.apache.solr.search.TestRangeQuery
    [junit] Tests run: 2, Failures: 0, Errors: 0, Time elapsed: 11.217 sec
    [junit] Running org.apache.solr.search.TestSearchPerf
    [junit] Tests run: 1, Failures: 0, Errors: 0, Time elapsed: 1.927 sec
    [junit] Running org.apache.solr.search.function.TestFunctionQuery
    [junit] Tests run: 3, Failures: 0, Errors: 0, Time elapsed: 5.566 sec
    [junit] Running org.apache.solr.servlet.CacheHeaderTest
    [junit] Tests run: 5, Failures: 0, Errors: 0, Time elapsed: 9.797 sec
    [junit] Running org.apache.solr.servlet.DirectSolrConnectionTest
    [junit] Tests run: 2, Failures: 0, Errors: 0, Time elapsed: 2.211 sec
    [junit] Running org.apache.solr.servlet.NoCacheHeaderTest
    [junit] Tests run: 3, Failures: 0, Errors: 0, Time elapsed: 7.843 sec
    [junit] Running org.apache.solr.servlet.SolrRequestParserTest
    [junit] Tests run: 4, Failures: 0, Errors: 0, Time elapsed: 6.174 sec
    [junit] Running org.apache.solr.spelling.FileBasedSpellCheckerTest
    [junit] Tests run: 3, Failures: 0, Errors: 0, Time elapsed: 6.201 sec
    [junit] Running org.apache.solr.spelling.IndexBasedSpellCheckerTest
    [junit] Tests run: 4, Failures: 0, Errors: 0, Time elapsed: 7.496 sec
    [junit] Running org.apache.solr.spelling.SpellingQueryConverterTest
    [junit] Tests run: 1, Failures: 0, Errors: 0, Time elapsed: 2.601 sec
    [junit] Running org.apache.solr.update.AutoCommitTest
    [junit] Tests run: 1, Failures: 0, Errors: 0, Time elapsed: 5.976 sec
    [junit] Running org.apache.solr.update.DirectUpdateHandlerOptimizeTest
    [junit] Tests run: 1, Failures: 0, Errors: 0, Time elapsed: 3.882 sec
    [junit] Running org.apache.solr.update.DirectUpdateHandlerTest
    [junit] Tests run: 6, Failures: 0, Errors: 0, Time elapsed: 8.619 sec
    [junit] Running org.apache.solr.update.DocumentBuilderTest
    [junit] Tests run: 2, Failures: 0, Errors: 0, Time elapsed: 4.001 sec
    [junit] Running org.apache.solr.update.processor.SignatureUpdateProcessorFactoryTest
    [junit] Tests run: 2, Failures: 0, Errors: 0, Time elapsed: 6.005 sec
    [junit] Running org.apache.solr.update.processor.UpdateRequestProcessorFactoryTest
    [junit] Tests run: 1, Failures: 0, Errors: 0, Time elapsed: 2.455 sec
    [junit] Running org.apache.solr.util.ArraysUtilsTest
    [junit] Tests run: 1, Failures: 0, Errors: 0, Time elapsed: 0.397 sec
    [junit] Running org.apache.solr.util.DateMathParserTest
    [junit] Tests run: 7, Failures: 0, Errors: 0, Time elapsed: 0.448 sec
    [junit] Running org.apache.solr.util.SolrPluginUtilsTest
    [junit] Tests run: 6, Failures: 0, Errors: 0, Time elapsed: 7.378 sec
    [junit] Running org.apache.solr.util.TestCharArrayMap
    [junit] Tests run: 2, Failures: 0, Errors: 0, Time elapsed: 0.589 sec
    [junit] Running org.apache.solr.util.TestNumberUtils
    [junit] Tests run: 1, Failures: 0, Errors: 0, Time elapsed: 1.414 sec
    [junit] Running org.apache.solr.util.TestOpenBitSet
    [junit] Tests run: 3, Failures: 0, Errors: 0, Time elapsed: 1.402 sec
    [junit] Running org.apache.solr.util.TestUtils
    [junit] Tests run: 3, Failures: 0, Errors: 0, Time elapsed: 0.404 sec

BUILD FAILED
/tmp/apache-solr-nightly/build.xml:386: Tests failed!

Total time: 13 minutes 34 seconds



Mime
View raw message