lucene-solr-dev mailing list archives

Site index · List index
Message view « Date » · « Thread »
Top « Date » · « Thread »
From solr-...@lucene.apache.org
Subject Solr nightly build failure
Date Sat, 20 Jun 2009 08:19:08 GMT

init-forrest-entities:
    [mkdir] Created dir: /tmp/apache-solr-nightly/build
    [mkdir] Created dir: /tmp/apache-solr-nightly/build/web

compile-solrj:
    [mkdir] Created dir: /tmp/apache-solr-nightly/build/solrj
    [javac] Compiling 83 source files to /tmp/apache-solr-nightly/build/solrj
    [javac] Note: Some input files use or override a deprecated API.
    [javac] Note: Recompile with -Xlint:deprecation for details.
    [javac] Note: Some input files use unchecked or unsafe operations.
    [javac] Note: Recompile with -Xlint:unchecked for details.

compile:
    [mkdir] Created dir: /tmp/apache-solr-nightly/build/solr
    [javac] Compiling 375 source files to /tmp/apache-solr-nightly/build/solr
    [javac] Note: Some input files use or override a deprecated API.
    [javac] Note: Recompile with -Xlint:deprecation for details.
    [javac] Note: Some input files use unchecked or unsafe operations.
    [javac] Note: Recompile with -Xlint:unchecked for details.

compileTests:
    [mkdir] Created dir: /tmp/apache-solr-nightly/build/tests
    [javac] Compiling 162 source files to /tmp/apache-solr-nightly/build/tests
    [javac] Note: Some input files use or override a deprecated API.
    [javac] Note: Recompile with -Xlint:deprecation for details.
    [javac] Note: Some input files use unchecked or unsafe operations.
    [javac] Note: Recompile with -Xlint:unchecked for details.

junit:
    [mkdir] Created dir: /tmp/apache-solr-nightly/build/test-results
    [junit] Running org.apache.solr.BasicFunctionalityTest
    [junit] Tests run: 19, Failures: 0, Errors: 0, Time elapsed: 15.878 sec
    [junit] Running org.apache.solr.ConvertedLegacyTest
    [junit] Tests run: 1, Failures: 0, Errors: 0, Time elapsed: 7.831 sec
    [junit] Running org.apache.solr.DisMaxRequestHandlerTest
    [junit] Tests run: 3, Failures: 0, Errors: 0, Time elapsed: 5.37 sec
    [junit] Running org.apache.solr.EchoParamsTest
    [junit] Tests run: 4, Failures: 0, Errors: 0, Time elapsed: 2.558 sec
    [junit] Running org.apache.solr.OutputWriterTest
    [junit] Tests run: 3, Failures: 0, Errors: 0, Time elapsed: 2.714 sec
    [junit] Running org.apache.solr.SampleTest
    [junit] Tests run: 2, Failures: 0, Errors: 0, Time elapsed: 2.428 sec
    [junit] Running org.apache.solr.SolrInfoMBeanTest
    [junit] Tests run: 1, Failures: 0, Errors: 0, Time elapsed: 0.948 sec
    [junit] Running org.apache.solr.TestDistributedSearch
    [junit] Tests run: 1, Failures: 0, Errors: 0, Time elapsed: 25.148 sec
    [junit] Running org.apache.solr.TestTrie
    [junit] Tests run: 7, Failures: 0, Errors: 0, Time elapsed: 7.567 sec
    [junit] Running org.apache.solr.analysis.DoubleMetaphoneFilterFactoryTest
    [junit] Tests run: 2, Failures: 0, Errors: 0, Time elapsed: 0.395 sec
    [junit] Running org.apache.solr.analysis.DoubleMetaphoneFilterTest
    [junit] Tests run: 6, Failures: 0, Errors: 0, Time elapsed: 0.41 sec
    [junit] Running org.apache.solr.analysis.EnglishPorterFilterFactoryTest
    [junit] Tests run: 2, Failures: 0, Errors: 0, Time elapsed: 1.579 sec
    [junit] Running org.apache.solr.analysis.HTMLStripReaderTest
    [junit] Tests run: 9, Failures: 0, Errors: 0, Time elapsed: 0.988 sec
    [junit] Running org.apache.solr.analysis.LengthFilterTest
    [junit] Tests run: 1, Failures: 0, Errors: 0, Time elapsed: 1.163 sec
    [junit] Running org.apache.solr.analysis.SnowballPorterFilterFactoryTest
    [junit] Tests run: 2, Failures: 0, Errors: 0, Time elapsed: 1.669 sec
    [junit] Running org.apache.solr.analysis.TestBufferedTokenStream
    [junit] Tests run: 2, Failures: 0, Errors: 0, Time elapsed: 1.512 sec
    [junit] Running org.apache.solr.analysis.TestCapitalizationFilter
    [junit] Tests run: 2, Failures: 0, Errors: 0, Time elapsed: 1.634 sec
    [junit] Running org.apache.solr.analysis.TestCharFilter
    [junit] Tests run: 4, Failures: 0, Errors: 0, Time elapsed: 0.501 sec
    [junit] Running org.apache.solr.analysis.TestHyphenatedWordsFilter
    [junit] Tests run: 1, Failures: 0, Errors: 0, Time elapsed: 1.214 sec
    [junit] Running org.apache.solr.analysis.TestKeepFilterFactory
    [junit] Tests run: 1, Failures: 0, Errors: 0, Time elapsed: 2.06 sec
    [junit] Running org.apache.solr.analysis.TestKeepWordFilter
    [junit] Tests run: 1, Failures: 0, Errors: 0, Time elapsed: 1.229 sec
    [junit] Running org.apache.solr.analysis.TestMappingCharFilter
    [junit] Tests run: 11, Failures: 0, Errors: 0, Time elapsed: 0.414 sec
    [junit] Running org.apache.solr.analysis.TestMappingCharFilterFactory
    [junit] Tests run: 1, Failures: 0, Errors: 0, Time elapsed: 0.429 sec
    [junit] Running org.apache.solr.analysis.TestPatternReplaceFilter
    [junit] Tests run: 5, Failures: 0, Errors: 0, Time elapsed: 2.276 sec
    [junit] Running org.apache.solr.analysis.TestPatternTokenizerFactory
    [junit] Tests run: 1, Failures: 0, Errors: 0, Time elapsed: 1.443 sec
    [junit] Running org.apache.solr.analysis.TestPhoneticFilter
    [junit] Tests run: 2, Failures: 0, Errors: 0, Time elapsed: 1.258 sec
    [junit] Running org.apache.solr.analysis.TestRemoveDuplicatesTokenFilter
    [junit] Tests run: 3, Failures: 0, Errors: 0, Time elapsed: 1.54 sec
    [junit] Running org.apache.solr.analysis.TestStopFilterFactory
    [junit] Tests run: 1, Failures: 0, Errors: 0, Time elapsed: 2.141 sec
    [junit] Running org.apache.solr.analysis.TestSynonymFilter
    [junit] Tests run: 7, Failures: 0, Errors: 0, Time elapsed: 2.535 sec
    [junit] Running org.apache.solr.analysis.TestSynonymMap
    [junit] Tests run: 5, Failures: 0, Errors: 0, Time elapsed: 2.066 sec
    [junit] Running org.apache.solr.analysis.TestTrimFilter
    [junit] Tests run: 1, Failures: 0, Errors: 0, Time elapsed: 1.255 sec
    [junit] Running org.apache.solr.analysis.TestWordDelimiterFilter
    [junit] Tests run: 12, Failures: 0, Errors: 0, Time elapsed: 12.258 sec
    [junit] Running org.apache.solr.client.solrj.SolrExceptionTest
    [junit] Tests run: 1, Failures: 0, Errors: 0, Time elapsed: 0.774 sec
    [junit] Running org.apache.solr.client.solrj.SolrQueryTest
    [junit] Tests run: 5, Failures: 0, Errors: 0, Time elapsed: 0.404 sec
    [junit] Running org.apache.solr.client.solrj.TestBatchUpdate
    [junit] Tests run: 3, Failures: 0, Errors: 0, Time elapsed: 9.708 sec
    [junit] Running org.apache.solr.client.solrj.TestLBHttpSolrServer
    [junit] Tests run: 2, Failures: 0, Errors: 0, Time elapsed: 8.54 sec
    [junit] Running org.apache.solr.client.solrj.beans.TestDocumentObjectBinder
    [junit] Tests run: 3, Failures: 0, Errors: 0, Time elapsed: 0.599 sec
    [junit] Running org.apache.solr.client.solrj.embedded.JettyWebappTest
    [junit] Tests run: 1, Failures: 0, Errors: 0, Time elapsed: 6.14 sec
    [junit] Running org.apache.solr.client.solrj.embedded.LargeVolumeBinaryJettyTest
    [junit] Tests run: 1, Failures: 0, Errors: 0, Time elapsed: 5.13 sec
    [junit] Running org.apache.solr.client.solrj.embedded.LargeVolumeEmbeddedTest
    [junit] Tests run: 1, Failures: 0, Errors: 0, Time elapsed: 4.106 sec
    [junit] Running org.apache.solr.client.solrj.embedded.LargeVolumeJettyTest
    [junit] Tests run: 1, Failures: 0, Errors: 0, Time elapsed: 6.527 sec
    [junit] Running org.apache.solr.client.solrj.embedded.MergeIndexesEmbeddedTest
    [junit] Tests run: 1, Failures: 0, Errors: 1, Time elapsed: 1.99 sec
    [junit] Test org.apache.solr.client.solrj.embedded.MergeIndexesEmbeddedTest FAILED
    [junit] Running org.apache.solr.client.solrj.embedded.MultiCoreEmbeddedTest
    [junit] Tests run: 1, Failures: 0, Errors: 1, Time elapsed: 1.855 sec
    [junit] Test org.apache.solr.client.solrj.embedded.MultiCoreEmbeddedTest FAILED
    [junit] Running org.apache.solr.client.solrj.embedded.MultiCoreExampleJettyTest
    [junit] Tests run: 1, Failures: 0, Errors: 0, Time elapsed: 3.946 sec
    [junit] Running org.apache.solr.client.solrj.embedded.SolrExampleEmbeddedTest
    [junit] Tests run: 8, Failures: 0, Errors: 0, Time elapsed: 7.672 sec
    [junit] Running org.apache.solr.client.solrj.embedded.SolrExampleJettyTest
    [junit] Tests run: 9, Failures: 0, Errors: 0, Time elapsed: 15.035 sec
    [junit] Running org.apache.solr.client.solrj.embedded.SolrExampleStreamingTest
    [junit] Tests run: 8, Failures: 0, Errors: 0, Time elapsed: 17.872 sec
    [junit] Running org.apache.solr.client.solrj.embedded.TestSolrProperties
    [junit] Tests run: 1, Failures: 0, Errors: 0, Time elapsed: 4.667 sec
    [junit] Running org.apache.solr.client.solrj.request.TestUpdateRequestCodec
    [junit] Tests run: 1, Failures: 0, Errors: 0, Time elapsed: 0.426 sec
    [junit] Running org.apache.solr.client.solrj.response.AnlysisResponseBaseTest
    [junit] Tests run: 2, Failures: 0, Errors: 0, Time elapsed: 0.486 sec
    [junit] Running org.apache.solr.client.solrj.response.DocumentAnalysisResponseTest
    [junit] Tests run: 1, Failures: 0, Errors: 0, Time elapsed: 0.491 sec
    [junit] Running org.apache.solr.client.solrj.response.FieldAnalysisResponseTest
    [junit] Tests run: 1, Failures: 0, Errors: 0, Time elapsed: 0.459 sec
    [junit] Running org.apache.solr.client.solrj.response.QueryResponseTest
    [junit] Tests run: 1, Failures: 0, Errors: 0, Time elapsed: 0.805 sec
    [junit] Running org.apache.solr.client.solrj.response.TestSpellCheckResponse
    [junit] Tests run: 2, Failures: 0, Errors: 0, Time elapsed: 6.183 sec
    [junit] Running org.apache.solr.client.solrj.util.ClientUtilsTest
    [junit] Tests run: 1, Failures: 0, Errors: 0, Time elapsed: 0.387 sec
    [junit] Running org.apache.solr.common.SolrDocumentTest
    [junit] Tests run: 5, Failures: 0, Errors: 0, Time elapsed: 0.387 sec
    [junit] Running org.apache.solr.common.params.ModifiableSolrParamsTest
    [junit] Tests run: 5, Failures: 0, Errors: 0, Time elapsed: 0.385 sec
    [junit] Running org.apache.solr.common.params.SolrParamTest
    [junit] Tests run: 1, Failures: 0, Errors: 0, Time elapsed: 0.39 sec
    [junit] Running org.apache.solr.common.util.ContentStreamTest
    [junit] Tests run: 3, Failures: 0, Errors: 0, Time elapsed: 0.518 sec
    [junit] Running org.apache.solr.common.util.DOMUtilTest
    [junit] Tests run: 1, Failures: 0, Errors: 0, Time elapsed: 0.521 sec
    [junit] Running org.apache.solr.common.util.FileUtilsTest
    [junit] Tests run: 1, Failures: 0, Errors: 0, Time elapsed: 0.432 sec
    [junit] Running org.apache.solr.common.util.IteratorChainTest
    [junit] Tests run: 7, Failures: 0, Errors: 0, Time elapsed: 0.418 sec
    [junit] Running org.apache.solr.common.util.NamedListTest
    [junit] Tests run: 1, Failures: 0, Errors: 0, Time elapsed: 0.443 sec
    [junit] Running org.apache.solr.common.util.TestFastInputStream
    [junit] Tests run: 1, Failures: 0, Errors: 0, Time elapsed: 0.473 sec
    [junit] Running org.apache.solr.common.util.TestHash
    [junit] Tests run: 2, Failures: 0, Errors: 0, Time elapsed: 0.633 sec
    [junit] Running org.apache.solr.common.util.TestNamedListCodec
    [junit] Tests run: 4, Failures: 0, Errors: 0, Time elapsed: 1.661 sec
    [junit] Running org.apache.solr.common.util.TestXMLEscaping
    [junit] Tests run: 7, Failures: 0, Errors: 0, Time elapsed: 0.416 sec
    [junit] Running org.apache.solr.core.AlternateDirectoryTest
    [junit] Tests run: 1, Failures: 0, Errors: 0, Time elapsed: 4.241 sec
    [junit] Running org.apache.solr.core.AlternateIndexReaderTest
    [junit] Tests run: 1, Failures: 0, Errors: 0, Time elapsed: 4.628 sec
    [junit] Running org.apache.solr.core.RequestHandlersTest
    [junit] Tests run: 2, Failures: 0, Errors: 0, Time elapsed: 4.932 sec
    [junit] Running org.apache.solr.core.ResourceLoaderTest
    [junit] Tests run: 2, Failures: 0, Errors: 0, Time elapsed: 0.574 sec
    [junit] Running org.apache.solr.core.SOLR749Test
    [junit] Tests run: 1, Failures: 0, Errors: 0, Time elapsed: 3.535 sec
    [junit] Running org.apache.solr.core.SolrCoreTest
    [junit] Tests run: 4, Failures: 0, Errors: 0, Time elapsed: 12.318 sec
    [junit] Running org.apache.solr.core.TestArbitraryIndexDir
    [junit] Tests run: 1, Failures: 0, Errors: 0, Time elapsed: 3.833 sec
    [junit] Running org.apache.solr.core.TestBadConfig
    [junit] Tests run: 1, Failures: 0, Errors: 0, Time elapsed: 0.483 sec
    [junit] Running org.apache.solr.core.TestConfig
    [junit] Tests run: 3, Failures: 0, Errors: 0, Time elapsed: 5.645 sec
    [junit] Running org.apache.solr.core.TestJmxIntegration
    [junit] Tests run: 2, Failures: 0, Errors: 0, Time elapsed: 5.802 sec
    [junit] Running org.apache.solr.core.TestJmxMonitoredMap
    [junit] Tests run: 1, Failures: 0, Errors: 0, Time elapsed: 1.28 sec
    [junit] Running org.apache.solr.core.TestQuerySenderListener
    [junit] Tests run: 1, Failures: 0, Errors: 0, Time elapsed: 2.828 sec
    [junit] Running org.apache.solr.core.TestSolrDeletionPolicy1
    [junit] Tests run: 3, Failures: 0, Errors: 0, Time elapsed: 13.023 sec
    [junit] Running org.apache.solr.core.TestSolrDeletionPolicy2
    [junit] Tests run: 1, Failures: 0, Errors: 0, Time elapsed: 3.587 sec
    [junit] Running org.apache.solr.handler.AnalysisRequestHandlerTest
    [junit] Tests run: 1, Failures: 0, Errors: 0, Time elapsed: 4.602 sec
    [junit] Running org.apache.solr.handler.DocumentAnalysisRequestHandlerTest
    [junit] Tests run: 2, Failures: 0, Errors: 0, Time elapsed: 4.312 sec
    [junit] Running org.apache.solr.handler.FieldAnalysisRequestHandlerTest
    [junit] Tests run: 2, Failures: 0, Errors: 0, Time elapsed: 4.816 sec
    [junit] Running org.apache.solr.handler.MoreLikeThisHandlerTest
    [junit] Tests run: 1, Failures: 0, Errors: 0, Time elapsed: 3.19 sec
    [junit] Running org.apache.solr.handler.SpellCheckerRequestHandlerTest
    [junit] Tests run: 5, Failures: 0, Errors: 0, Time elapsed: 3.983 sec
    [junit] Running org.apache.solr.handler.StandardRequestHandlerTest
    [junit] Tests run: 1, Failures: 0, Errors: 0, Time elapsed: 3.114 sec
    [junit] Running org.apache.solr.handler.TestCSVLoader
    [junit] Tests run: 4, Failures: 0, Errors: 0, Time elapsed: 8.792 sec
    [junit] Running org.apache.solr.handler.TestReplicationHandler
    [junit] Tests run: 5, Failures: 0, Errors: 0, Time elapsed: 60.26 sec
    [junit] Running org.apache.solr.handler.XmlUpdateRequestHandlerTest
    [junit] Tests run: 1, Failures: 0, Errors: 0, Time elapsed: 2.481 sec
    [junit] Running org.apache.solr.handler.admin.LukeRequestHandlerTest
    [junit] Tests run: 1, Failures: 0, Errors: 0, Time elapsed: 0.359 sec
    [junit] Running org.apache.solr.handler.admin.SystemInfoHandlerTest
    [junit] Tests run: 1, Failures: 0, Errors: 0, Time elapsed: 0.366 sec
    [junit] Running org.apache.solr.handler.component.QueryElevationComponentTest
    [junit] Tests run: 4, Failures: 0, Errors: 0, Time elapsed: 5.887 sec
    [junit] Running org.apache.solr.handler.component.SearchHandlerTest
    [junit] Tests run: 1, Failures: 0, Errors: 0, Time elapsed: 3.071 sec
    [junit] Running org.apache.solr.handler.component.SpellCheckComponentTest
    [junit] Tests run: 8, Failures: 0, Errors: 0, Time elapsed: 9.598 sec
    [junit] Running org.apache.solr.handler.component.TermVectorComponentTest
    [junit] Tests run: 4, Failures: 0, Errors: 0, Time elapsed: 6.158 sec
    [junit] Running org.apache.solr.handler.component.TermsComponentTest
    [junit] Tests run: 9, Failures: 0, Errors: 0, Time elapsed: 11.467 sec
    [junit] Running org.apache.solr.highlight.HighlighterConfigTest
    [junit] Tests run: 1, Failures: 0, Errors: 0, Time elapsed: 3.027 sec
    [junit] Running org.apache.solr.highlight.HighlighterTest
    [junit] Tests run: 22, Failures: 0, Errors: 0, Time elapsed: 18.546 sec
    [junit] Running org.apache.solr.request.JSONWriterTest
    [junit] Tests run: 3, Failures: 0, Errors: 0, Time elapsed: 4.995 sec
    [junit] Running org.apache.solr.request.SimpleFacetsLegacySortTest
    [junit] Tests run: 1, Failures: 0, Errors: 0, Time elapsed: 3.042 sec
    [junit] Running org.apache.solr.request.SimpleFacetsTest
    [junit] Tests run: 6, Failures: 0, Errors: 0, Time elapsed: 12.58 sec
    [junit] Running org.apache.solr.request.TestBinaryResponseWriter
    [junit] Tests run: 1, Failures: 0, Errors: 0, Time elapsed: 3.158 sec
    [junit] Running org.apache.solr.request.TestFaceting
    [junit] Tests run: 3, Failures: 0, Errors: 0, Time elapsed: 14.373 sec
    [junit] Running org.apache.solr.request.TestWriterPerf
    [junit] Tests run: 1, Failures: 0, Errors: 0, Time elapsed: 3.212 sec
    [junit] Running org.apache.solr.schema.BadIndexSchemaTest
    [junit] Tests run: 1, Failures: 0, Errors: 0, Time elapsed: 2.011 sec
    [junit] Running org.apache.solr.schema.CopyFieldTest
    [junit] Tests run: 6, Failures: 0, Errors: 0, Time elapsed: 8.284 sec
    [junit] Running org.apache.solr.schema.DateFieldTest
    [junit] Tests run: 6, Failures: 0, Errors: 0, Time elapsed: 0.444 sec
    [junit] Running org.apache.solr.schema.IndexSchemaTest
    [junit] Tests run: 4, Failures: 0, Errors: 0, Time elapsed: 6.143 sec
    [junit] Running org.apache.solr.schema.LegacyDateFieldTest
    [junit] Tests run: 4, Failures: 0, Errors: 0, Time elapsed: 0.429 sec
    [junit] Running org.apache.solr.schema.NotRequiredUniqueKeyTest
    [junit] Tests run: 1, Failures: 0, Errors: 0, Time elapsed: 2.092 sec
    [junit] Running org.apache.solr.schema.RequiredFieldsTest
    [junit] Tests run: 3, Failures: 0, Errors: 0, Time elapsed: 4.975 sec
    [junit] Running org.apache.solr.schema.TestBinaryField
    [junit] Tests run: 1, Failures: 0, Errors: 0, Time elapsed: 3.646 sec
    [junit] Running org.apache.solr.schema.UUIDFieldTest
    [junit] Tests run: 1, Failures: 0, Errors: 0, Time elapsed: 0.665 sec
    [junit] Running org.apache.solr.search.TestDocSet
    [junit] Tests run: 2, Failures: 0, Errors: 0, Time elapsed: 1.27 sec
    [junit] Running org.apache.solr.search.TestFastLRUCache
    [junit] Tests run: 2, Failures: 0, Errors: 0, Time elapsed: 0.409 sec
    [junit] Running org.apache.solr.search.TestQueryTypes
    [junit] Tests run: 1, Failures: 0, Errors: 0, Time elapsed: 2.614 sec
    [junit] Running org.apache.solr.search.TestQueryUtils
    [junit] Tests run: 1, Failures: 0, Errors: 0, Time elapsed: 3.25 sec
    [junit] Running org.apache.solr.search.TestRangeQuery
    [junit] Tests run: 2, Failures: 0, Errors: 0, Time elapsed: 11.595 sec
    [junit] Running org.apache.solr.search.TestSearchPerf
    [junit] Tests run: 1, Failures: 0, Errors: 0, Time elapsed: 2.035 sec
    [junit] Running org.apache.solr.search.function.TestFunctionQuery
    [junit] Tests run: 3, Failures: 0, Errors: 0, Time elapsed: 5.553 sec
    [junit] Running org.apache.solr.servlet.CacheHeaderTest
    [junit] Tests run: 5, Failures: 0, Errors: 0, Time elapsed: 10.247 sec
    [junit] Running org.apache.solr.servlet.DirectSolrConnectionTest
    [junit] Tests run: 2, Failures: 0, Errors: 0, Time elapsed: 2.341 sec
    [junit] Running org.apache.solr.servlet.NoCacheHeaderTest
    [junit] Tests run: 3, Failures: 0, Errors: 0, Time elapsed: 6.951 sec
    [junit] Running org.apache.solr.servlet.SolrRequestParserTest
    [junit] Tests run: 4, Failures: 0, Errors: 0, Time elapsed: 5.459 sec
    [junit] Running org.apache.solr.spelling.FileBasedSpellCheckerTest
    [junit] Tests run: 3, Failures: 0, Errors: 0, Time elapsed: 5.135 sec
    [junit] Running org.apache.solr.spelling.IndexBasedSpellCheckerTest
    [junit] Tests run: 4, Failures: 0, Errors: 0, Time elapsed: 6.482 sec
    [junit] Running org.apache.solr.spelling.SpellingQueryConverterTest
    [junit] Tests run: 1, Failures: 0, Errors: 0, Time elapsed: 2.493 sec
    [junit] Running org.apache.solr.update.AutoCommitTest
    [junit] Tests run: 1, Failures: 0, Errors: 0, Time elapsed: 6.972 sec
    [junit] Running org.apache.solr.update.DirectUpdateHandlerOptimizeTest
    [junit] Tests run: 1, Failures: 0, Errors: 0, Time elapsed: 4.841 sec
    [junit] Running org.apache.solr.update.DirectUpdateHandlerTest
    [junit] Tests run: 6, Failures: 0, Errors: 0, Time elapsed: 9.302 sec
    [junit] Running org.apache.solr.update.DocumentBuilderTest
    [junit] Tests run: 2, Failures: 0, Errors: 0, Time elapsed: 4.334 sec
    [junit] Running org.apache.solr.update.processor.SignatureUpdateProcessorFactoryTest
    [junit] Tests run: 2, Failures: 0, Errors: 0, Time elapsed: 6.776 sec
    [junit] Running org.apache.solr.update.processor.UpdateRequestProcessorFactoryTest
    [junit] Tests run: 1, Failures: 0, Errors: 0, Time elapsed: 2.596 sec
    [junit] Running org.apache.solr.util.ArraysUtilsTest
    [junit] Tests run: 1, Failures: 0, Errors: 0, Time elapsed: 0.364 sec
    [junit] Running org.apache.solr.util.DateMathParserTest
    [junit] Tests run: 7, Failures: 0, Errors: 0, Time elapsed: 0.459 sec
    [junit] Running org.apache.solr.util.SolrPluginUtilsTest
    [junit] Tests run: 6, Failures: 0, Errors: 0, Time elapsed: 7.377 sec
    [junit] Running org.apache.solr.util.TestCharArrayMap
    [junit] Tests run: 2, Failures: 0, Errors: 0, Time elapsed: 0.595 sec
    [junit] Running org.apache.solr.util.TestNumberUtils
    [junit] Tests run: 1, Failures: 0, Errors: 0, Time elapsed: 1.52 sec
    [junit] Running org.apache.solr.util.TestOpenBitSet
    [junit] Tests run: 3, Failures: 0, Errors: 0, Time elapsed: 1.19 sec
    [junit] Running org.apache.solr.util.TestUtils
    [junit] Tests run: 3, Failures: 0, Errors: 0, Time elapsed: 0.381 sec

BUILD FAILED
/tmp/apache-solr-nightly/build.xml:386: Tests failed!

Total time: 13 minutes 26 seconds



Mime
View raw message