lucene-solr-dev mailing list archives

Site index · List index
Message view « Date » · « Thread »
Top « Date » · « Thread »
From solr-...@lucene.apache.org
Subject Solr nightly build failure
Date Tue, 07 Apr 2009 08:18:57 GMT

init-forrest-entities:
    [mkdir] Created dir: /tmp/apache-solr-nightly/build
    [mkdir] Created dir: /tmp/apache-solr-nightly/build/web

compile-solrj:
    [mkdir] Created dir: /tmp/apache-solr-nightly/build/solrj
    [javac] Compiling 76 source files to /tmp/apache-solr-nightly/build/solrj
    [javac] Note: Some input files use or override a deprecated API.
    [javac] Note: Recompile with -Xlint:deprecation for details.
    [javac] Note: Some input files use unchecked or unsafe operations.
    [javac] Note: Recompile with -Xlint:unchecked for details.

compile:
    [mkdir] Created dir: /tmp/apache-solr-nightly/build/solr
    [javac] Compiling 364 source files to /tmp/apache-solr-nightly/build/solr
    [javac] Note: Some input files use or override a deprecated API.
    [javac] Note: Recompile with -Xlint:deprecation for details.
    [javac] Note: Some input files use unchecked or unsafe operations.
    [javac] Note: Recompile with -Xlint:unchecked for details.

compileTests:
    [mkdir] Created dir: /tmp/apache-solr-nightly/build/tests
    [javac] Compiling 149 source files to /tmp/apache-solr-nightly/build/tests
    [javac] Note: Some input files use or override a deprecated API.
    [javac] Note: Recompile with -Xlint:deprecation for details.
    [javac] Note: Some input files use unchecked or unsafe operations.
    [javac] Note: Recompile with -Xlint:unchecked for details.

junit:
    [mkdir] Created dir: /tmp/apache-solr-nightly/build/test-results
    [junit] Running org.apache.solr.BasicFunctionalityTest
    [junit] Tests run: 19, Failures: 0, Errors: 0, Time elapsed: 16.119 sec
    [junit] Running org.apache.solr.ConvertedLegacyTest
    [junit] Tests run: 1, Failures: 0, Errors: 0, Time elapsed: 8.122 sec
    [junit] Running org.apache.solr.DisMaxRequestHandlerTest
    [junit] Tests run: 3, Failures: 0, Errors: 0, Time elapsed: 5.485 sec
    [junit] Running org.apache.solr.EchoParamsTest
    [junit] Tests run: 4, Failures: 0, Errors: 0, Time elapsed: 2.579 sec
    [junit] Running org.apache.solr.OutputWriterTest
    [junit] Tests run: 3, Failures: 0, Errors: 0, Time elapsed: 3.286 sec
    [junit] Running org.apache.solr.SampleTest
    [junit] Tests run: 2, Failures: 0, Errors: 0, Time elapsed: 2.779 sec
    [junit] Running org.apache.solr.SolrInfoMBeanTest
    [junit] Tests run: 1, Failures: 0, Errors: 0, Time elapsed: 0.963 sec
    [junit] Running org.apache.solr.TestDistributedSearch
    [junit] Tests run: 1, Failures: 0, Errors: 0, Time elapsed: 27.975 sec
    [junit] Running org.apache.solr.TestTrie
    [junit] Tests run: 7, Failures: 0, Errors: 0, Time elapsed: 7.422 sec
    [junit] Running org.apache.solr.analysis.DoubleMetaphoneFilterFactoryTest
    [junit] Tests run: 2, Failures: 0, Errors: 0, Time elapsed: 0.419 sec
    [junit] Running org.apache.solr.analysis.DoubleMetaphoneFilterTest
    [junit] Tests run: 6, Failures: 0, Errors: 0, Time elapsed: 0.406 sec
    [junit] Running org.apache.solr.analysis.EnglishPorterFilterFactoryTest
    [junit] Tests run: 2, Failures: 0, Errors: 0, Time elapsed: 1.102 sec
    [junit] Running org.apache.solr.analysis.HTMLStripReaderTest
    [junit] Tests run: 9, Failures: 0, Errors: 0, Time elapsed: 0.954 sec
    [junit] Running org.apache.solr.analysis.LengthFilterTest
    [junit] Tests run: 1, Failures: 0, Errors: 0, Time elapsed: 1.172 sec
    [junit] Running org.apache.solr.analysis.SnowballPorterFilterFactoryTest
    [junit] Tests run: 2, Failures: 0, Errors: 0, Time elapsed: 1.265 sec
    [junit] Running org.apache.solr.analysis.TestBufferedTokenStream
    [junit] Tests run: 2, Failures: 0, Errors: 0, Time elapsed: 1.227 sec
    [junit] Running org.apache.solr.analysis.TestCapitalizationFilter
    [junit] Tests run: 2, Failures: 0, Errors: 0, Time elapsed: 1.229 sec
    [junit] Running org.apache.solr.analysis.TestCharFilter
    [junit] Tests run: 4, Failures: 0, Errors: 0, Time elapsed: 0.396 sec
    [junit] Running org.apache.solr.analysis.TestHyphenatedWordsFilter
    [junit] Tests run: 1, Failures: 0, Errors: 0, Time elapsed: 1.038 sec
    [junit] Running org.apache.solr.analysis.TestKeepFilterFactory
    [junit] Tests run: 1, Failures: 0, Errors: 0, Time elapsed: 2.282 sec
    [junit] Running org.apache.solr.analysis.TestKeepWordFilter
    [junit] Tests run: 1, Failures: 0, Errors: 0, Time elapsed: 0.983 sec
    [junit] Running org.apache.solr.analysis.TestMappingCharFilter
    [junit] Tests run: 11, Failures: 0, Errors: 0, Time elapsed: 0.414 sec
    [junit] Running org.apache.solr.analysis.TestMappingCharFilterFactory
    [junit] Tests run: 1, Failures: 0, Errors: 0, Time elapsed: 0.391 sec
    [junit] Running org.apache.solr.analysis.TestPatternReplaceFilter
    [junit] Tests run: 5, Failures: 0, Errors: 0, Time elapsed: 1.596 sec
    [junit] Running org.apache.solr.analysis.TestPatternTokenizerFactory
    [junit] Tests run: 1, Failures: 0, Errors: 0, Time elapsed: 1.137 sec
    [junit] Running org.apache.solr.analysis.TestPhoneticFilter
    [junit] Tests run: 2, Failures: 0, Errors: 0, Time elapsed: 1.419 sec
    [junit] Running org.apache.solr.analysis.TestRemoveDuplicatesTokenFilter
    [junit] Tests run: 3, Failures: 0, Errors: 0, Time elapsed: 1.278 sec
    [junit] Running org.apache.solr.analysis.TestStopFilterFactory
    [junit] Tests run: 1, Failures: 0, Errors: 0, Time elapsed: 2.117 sec
    [junit] Running org.apache.solr.analysis.TestSynonymFilter
    [junit] Tests run: 7, Failures: 0, Errors: 0, Time elapsed: 2.096 sec
    [junit] Running org.apache.solr.analysis.TestSynonymMap
    [junit] Tests run: 5, Failures: 0, Errors: 0, Time elapsed: 1.677 sec
    [junit] Running org.apache.solr.analysis.TestTrimFilter
    [junit] Tests run: 1, Failures: 0, Errors: 0, Time elapsed: 1.062 sec
    [junit] Running org.apache.solr.analysis.TestWordDelimiterFilter
    [junit] Tests run: 11, Failures: 0, Errors: 0, Time elapsed: 12.748 sec
    [junit] Running org.apache.solr.client.solrj.SolrExceptionTest
    [junit] Tests run: 1, Failures: 0, Errors: 0, Time elapsed: 0.821 sec
    [junit] Running org.apache.solr.client.solrj.SolrQueryTest
    [junit] Tests run: 5, Failures: 0, Errors: 0, Time elapsed: 0.384 sec
    [junit] Running org.apache.solr.client.solrj.TestBatchUpdate
    [junit] Tests run: 3, Failures: 0, Errors: 0, Time elapsed: 8.21 sec
    [junit] Running org.apache.solr.client.solrj.TestLBHttpSolrServer
    [junit] Tests run: 1, Failures: 0, Errors: 0, Time elapsed: 4.899 sec
    [junit] Running org.apache.solr.client.solrj.beans.TestDocumentObjectBinder
    [junit] Tests run: 3, Failures: 0, Errors: 0, Time elapsed: 0.713 sec
    [junit] Running org.apache.solr.client.solrj.embedded.JettyWebappTest
    [junit] Tests run: 1, Failures: 0, Errors: 0, Time elapsed: 7.004 sec
    [junit] Running org.apache.solr.client.solrj.embedded.LargeVolumeBinaryJettyTest
    [junit] Tests run: 1, Failures: 1, Errors: 0, Time elapsed: 4.574 sec
    [junit] Test org.apache.solr.client.solrj.embedded.LargeVolumeBinaryJettyTest FAILED
    [junit] Running org.apache.solr.client.solrj.embedded.LargeVolumeEmbeddedTest
    [junit] Tests run: 1, Failures: 0, Errors: 0, Time elapsed: 3.604 sec
    [junit] Running org.apache.solr.client.solrj.embedded.LargeVolumeJettyTest
    [junit] Tests run: 1, Failures: 0, Errors: 0, Time elapsed: 4.66 sec
    [junit] Running org.apache.solr.client.solrj.embedded.MultiCoreEmbeddedTest
    [junit] Tests run: 1, Failures: 0, Errors: 0, Time elapsed: 3.543 sec
    [junit] Running org.apache.solr.client.solrj.embedded.MultiCoreExampleJettyTest
    [junit] Tests run: 1, Failures: 0, Errors: 0, Time elapsed: 4.055 sec
    [junit] Running org.apache.solr.client.solrj.embedded.SolrExampleEmbeddedTest
    [junit] Tests run: 8, Failures: 0, Errors: 0, Time elapsed: 9.047 sec
    [junit] Running org.apache.solr.client.solrj.embedded.SolrExampleJettyTest
    [junit] Tests run: 9, Failures: 0, Errors: 0, Time elapsed: 18.87 sec
    [junit] Running org.apache.solr.client.solrj.embedded.SolrExampleStreamingTest
    [junit] Tests run: 8, Failures: 1, Errors: 0, Time elapsed: 19.038 sec
    [junit] Test org.apache.solr.client.solrj.embedded.SolrExampleStreamingTest FAILED
    [junit] Running org.apache.solr.client.solrj.embedded.TestSolrProperties
    [junit] Tests run: 1, Failures: 0, Errors: 0, Time elapsed: 3.871 sec
    [junit] Running org.apache.solr.client.solrj.request.TestUpdateRequestCodec
    [junit] Tests run: 1, Failures: 0, Errors: 0, Time elapsed: 0.433 sec
    [junit] Running org.apache.solr.client.solrj.response.QueryResponseTest
    [junit] Tests run: 1, Failures: 0, Errors: 0, Time elapsed: 0.519 sec
    [junit] Running org.apache.solr.client.solrj.response.TestSpellCheckResponse
    [junit] Tests run: 2, Failures: 0, Errors: 0, Time elapsed: 8.126 sec
    [junit] Running org.apache.solr.client.solrj.util.ClientUtilsTest
    [junit] Tests run: 1, Failures: 0, Errors: 0, Time elapsed: 0.513 sec
    [junit] Running org.apache.solr.common.SolrDocumentTest
    [junit] Tests run: 5, Failures: 0, Errors: 0, Time elapsed: 0.456 sec
    [junit] Running org.apache.solr.common.params.ModifiableSolrParamsTest
    [junit] Tests run: 5, Failures: 0, Errors: 0, Time elapsed: 0.472 sec
    [junit] Running org.apache.solr.common.params.SolrParamTest
    [junit] Tests run: 1, Failures: 0, Errors: 0, Time elapsed: 0.542 sec
    [junit] Running org.apache.solr.common.util.ContentStreamTest
    [junit] Tests run: 3, Failures: 0, Errors: 0, Time elapsed: 0.48 sec
    [junit] Running org.apache.solr.common.util.FileUtilsTest
    [junit] Tests run: 1, Failures: 0, Errors: 0, Time elapsed: 0.485 sec
    [junit] Running org.apache.solr.common.util.IteratorChainTest
    [junit] Tests run: 7, Failures: 0, Errors: 0, Time elapsed: 0.37 sec
    [junit] Running org.apache.solr.common.util.NamedListTest
    [junit] Tests run: 1, Failures: 0, Errors: 0, Time elapsed: 0.436 sec
    [junit] Running org.apache.solr.common.util.TestFastInputStream
    [junit] Tests run: 1, Failures: 0, Errors: 0, Time elapsed: 0.42 sec
    [junit] Running org.apache.solr.common.util.TestHash
    [junit] Tests run: 2, Failures: 0, Errors: 0, Time elapsed: 0.626 sec
    [junit] Running org.apache.solr.common.util.TestNamedListCodec
    [junit] Tests run: 4, Failures: 0, Errors: 0, Time elapsed: 2.441 sec
    [junit] Running org.apache.solr.common.util.TestXMLEscaping
    [junit] Tests run: 7, Failures: 0, Errors: 0, Time elapsed: 0.412 sec
    [junit] Running org.apache.solr.core.AlternateDirectoryTest
    [junit] Tests run: 1, Failures: 0, Errors: 0, Time elapsed: 3.283 sec
    [junit] Running org.apache.solr.core.RequestHandlersTest
    [junit] Tests run: 2, Failures: 0, Errors: 0, Time elapsed: 5.678 sec
    [junit] Running org.apache.solr.core.ResourceLoaderTest
    [junit] Tests run: 2, Failures: 0, Errors: 0, Time elapsed: 0.547 sec
    [junit] Running org.apache.solr.core.SOLR749Test
    [junit] Tests run: 1, Failures: 0, Errors: 0, Time elapsed: 4.286 sec
    [junit] Running org.apache.solr.core.SolrCoreTest
    [junit] Tests run: 4, Failures: 0, Errors: 0, Time elapsed: 13.329 sec
    [junit] Running org.apache.solr.core.TestArbitraryIndexDir
    [junit] Tests run: 1, Failures: 0, Errors: 0, Time elapsed: 3.532 sec
    [junit] Running org.apache.solr.core.TestBadConfig
    [junit] Tests run: 1, Failures: 0, Errors: 0, Time elapsed: 0.515 sec
    [junit] Running org.apache.solr.core.TestConfig
    [junit] Tests run: 3, Failures: 0, Errors: 0, Time elapsed: 7.822 sec
    [junit] Running org.apache.solr.core.TestJmxIntegration
    [junit] Tests run: 2, Failures: 0, Errors: 0, Time elapsed: 5.977 sec
    [junit] Running org.apache.solr.core.TestJmxMonitoredMap
    [junit] Tests run: 1, Failures: 0, Errors: 0, Time elapsed: 1.407 sec
    [junit] Running org.apache.solr.core.TestQuerySenderListener
    [junit] Tests run: 1, Failures: 0, Errors: 0, Time elapsed: 2.673 sec
    [junit] Running org.apache.solr.core.TestSolrDeletionPolicy1
    [junit] Tests run: 3, Failures: 0, Errors: 0, Time elapsed: 10.772 sec
    [junit] Running org.apache.solr.core.TestSolrDeletionPolicy2
    [junit] Tests run: 1, Failures: 0, Errors: 0, Time elapsed: 3.349 sec
    [junit] Running org.apache.solr.handler.AnalysisRequestHandlerTest
    [junit] Tests run: 1, Failures: 0, Errors: 0, Time elapsed: 2.826 sec
    [junit] Running org.apache.solr.handler.MoreLikeThisHandlerTest
    [junit] Tests run: 1, Failures: 0, Errors: 0, Time elapsed: 3.373 sec
    [junit] Running org.apache.solr.handler.SpellCheckerRequestHandlerTest
    [junit] Tests run: 5, Failures: 0, Errors: 0, Time elapsed: 4.309 sec
    [junit] Running org.apache.solr.handler.StandardRequestHandlerTest
    [junit] Tests run: 1, Failures: 0, Errors: 0, Time elapsed: 3.591 sec
    [junit] Running org.apache.solr.handler.TestCSVLoader
    [junit] Tests run: 4, Failures: 0, Errors: 0, Time elapsed: 8.453 sec
    [junit] Running org.apache.solr.handler.TestReplicationHandler
    [junit] Tests run: 5, Failures: 0, Errors: 0, Time elapsed: 59.297 sec
    [junit] Running org.apache.solr.handler.XmlUpdateRequestHandlerTest
    [junit] Tests run: 1, Failures: 0, Errors: 0, Time elapsed: 2.808 sec
    [junit] Running org.apache.solr.handler.admin.SystemInfoHandlerTest
    [junit] Tests run: 1, Failures: 0, Errors: 0, Time elapsed: 0.39 sec
    [junit] Running org.apache.solr.handler.component.QueryElevationComponentTest
    [junit] Tests run: 3, Failures: 0, Errors: 0, Time elapsed: 5.547 sec
    [junit] Running org.apache.solr.handler.component.SearchHandlerTest
    [junit] Tests run: 1, Failures: 0, Errors: 0, Time elapsed: 2.931 sec
    [junit] Running org.apache.solr.handler.component.SpellCheckComponentTest
    [junit] Tests run: 8, Failures: 0, Errors: 0, Time elapsed: 11.028 sec
    [junit] Running org.apache.solr.handler.component.TermVectorComponentTest
    [junit] Tests run: 4, Failures: 0, Errors: 0, Time elapsed: 5.679 sec
    [junit] Running org.apache.solr.handler.component.TermsComponentTest
    [junit] Tests run: 9, Failures: 0, Errors: 0, Time elapsed: 11.299 sec
    [junit] Running org.apache.solr.highlight.HighlighterConfigTest
    [junit] Tests run: 1, Failures: 0, Errors: 0, Time elapsed: 2.995 sec
    [junit] Running org.apache.solr.highlight.HighlighterTest
    [junit] Tests run: 20, Failures: 0, Errors: 0, Time elapsed: 17.284 sec
    [junit] Running org.apache.solr.request.JSONWriterTest
    [junit] Tests run: 3, Failures: 0, Errors: 0, Time elapsed: 5.779 sec
    [junit] Running org.apache.solr.request.SimpleFacetsLegacySortTest
    [junit] Tests run: 1, Failures: 0, Errors: 0, Time elapsed: 3.754 sec
    [junit] Running org.apache.solr.request.SimpleFacetsTest
    [junit] Tests run: 6, Failures: 0, Errors: 0, Time elapsed: 11.011 sec
    [junit] Running org.apache.solr.request.TestBinaryResponseWriter
    [junit] Tests run: 1, Failures: 0, Errors: 0, Time elapsed: 3.33 sec
    [junit] Running org.apache.solr.request.TestFaceting
    [junit] Tests run: 3, Failures: 0, Errors: 0, Time elapsed: 11.905 sec
    [junit] Running org.apache.solr.request.TestWriterPerf
    [junit] Tests run: 1, Failures: 0, Errors: 0, Time elapsed: 2.754 sec
    [junit] Running org.apache.solr.schema.BadIndexSchemaTest
    [junit] Tests run: 1, Failures: 0, Errors: 0, Time elapsed: 1.811 sec
    [junit] Running org.apache.solr.schema.CopyFieldTest
    [junit] Tests run: 6, Failures: 0, Errors: 0, Time elapsed: 6.423 sec
    [junit] Running org.apache.solr.schema.DateFieldTest
    [junit] Tests run: 6, Failures: 0, Errors: 0, Time elapsed: 0.412 sec
    [junit] Running org.apache.solr.schema.IndexSchemaTest
    [junit] Tests run: 3, Failures: 0, Errors: 0, Time elapsed: 4.734 sec
    [junit] Running org.apache.solr.schema.LegacyDateFieldTest
    [junit] Tests run: 4, Failures: 0, Errors: 0, Time elapsed: 0.405 sec
    [junit] Running org.apache.solr.schema.NotRequiredUniqueKeyTest
    [junit] Tests run: 1, Failures: 0, Errors: 0, Time elapsed: 1.92 sec
    [junit] Running org.apache.solr.schema.RequiredFieldsTest
    [junit] Tests run: 3, Failures: 0, Errors: 0, Time elapsed: 4.503 sec
    [junit] Running org.apache.solr.schema.UUIDFieldTest
    [junit] Tests run: 1, Failures: 0, Errors: 0, Time elapsed: 0.657 sec
    [junit] Running org.apache.solr.search.TestDocSet
    [junit] Tests run: 1, Failures: 0, Errors: 0, Time elapsed: 0.848 sec
    [junit] Running org.apache.solr.search.TestFastLRUCache
    [junit] Tests run: 2, Failures: 0, Errors: 0, Time elapsed: 0.39 sec
    [junit] Running org.apache.solr.search.TestQueryTypes
    [junit] Tests run: 1, Failures: 0, Errors: 0, Time elapsed: 2.764 sec
    [junit] Running org.apache.solr.search.TestQueryUtils
    [junit] Tests run: 1, Failures: 0, Errors: 0, Time elapsed: 3.086 sec
    [junit] Running org.apache.solr.search.TestRangeQuery
    [junit] Tests run: 2, Failures: 0, Errors: 0, Time elapsed: 10.347 sec
    [junit] Running org.apache.solr.search.function.TestFunctionQuery
    [junit] Tests run: 2, Failures: 0, Errors: 0, Time elapsed: 4.696 sec
    [junit] Running org.apache.solr.servlet.CacheHeaderTest
    [junit] Tests run: 5, Failures: 0, Errors: 0, Time elapsed: 10.055 sec
    [junit] Running org.apache.solr.servlet.DirectSolrConnectionTest
    [junit] Tests run: 2, Failures: 0, Errors: 0, Time elapsed: 2.388 sec
    [junit] Running org.apache.solr.servlet.NoCacheHeaderTest
    [junit] Tests run: 3, Failures: 0, Errors: 0, Time elapsed: 8.292 sec
    [junit] Running org.apache.solr.servlet.SolrRequestParserTest
    [junit] Tests run: 4, Failures: 0, Errors: 0, Time elapsed: 6.779 sec
    [junit] Running org.apache.solr.spelling.FileBasedSpellCheckerTest
    [junit] Tests run: 3, Failures: 0, Errors: 0, Time elapsed: 5.343 sec
    [junit] Running org.apache.solr.spelling.IndexBasedSpellCheckerTest
    [junit] Tests run: 4, Failures: 0, Errors: 0, Time elapsed: 6.653 sec
    [junit] Running org.apache.solr.spelling.SpellingQueryConverterTest
    [junit] Tests run: 1, Failures: 0, Errors: 0, Time elapsed: 3.243 sec
    [junit] Running org.apache.solr.update.AutoCommitTest
    [junit] Tests run: 1, Failures: 0, Errors: 0, Time elapsed: 6.204 sec
    [junit] Running org.apache.solr.update.DirectUpdateHandlerOptimizeTest
    [junit] Tests run: 1, Failures: 0, Errors: 0, Time elapsed: 3.31 sec
    [junit] Running org.apache.solr.update.DirectUpdateHandlerTest
    [junit] Tests run: 6, Failures: 0, Errors: 0, Time elapsed: 7.273 sec
    [junit] Running org.apache.solr.update.DocumentBuilderTest
    [junit] Tests run: 2, Failures: 0, Errors: 0, Time elapsed: 4.555 sec
    [junit] Running org.apache.solr.update.processor.SignatureUpdateProcessorFactoryTest
    [junit] Tests run: 2, Failures: 0, Errors: 0, Time elapsed: 6.671 sec
    [junit] Running org.apache.solr.update.processor.UpdateRequestProcessorFactoryTest
    [junit] Tests run: 1, Failures: 0, Errors: 0, Time elapsed: 2.756 sec
    [junit] Running org.apache.solr.util.ArraysUtilsTest
    [junit] Tests run: 1, Failures: 0, Errors: 0, Time elapsed: 0.343 sec
    [junit] Running org.apache.solr.util.DateMathParserTest
    [junit] Tests run: 7, Failures: 0, Errors: 0, Time elapsed: 0.489 sec
    [junit] Running org.apache.solr.util.SolrPluginUtilsTest
    [junit] Tests run: 6, Failures: 0, Errors: 0, Time elapsed: 6.924 sec
    [junit] Running org.apache.solr.util.TestCharArrayMap
    [junit] Tests run: 2, Failures: 0, Errors: 0, Time elapsed: 0.598 sec
    [junit] Running org.apache.solr.util.TestNumberUtils
    [junit] Tests run: 1, Failures: 0, Errors: 0, Time elapsed: 1.126 sec
    [junit] Running org.apache.solr.util.TestOpenBitSet
    [junit] Tests run: 3, Failures: 0, Errors: 0, Time elapsed: 1.47 sec
    [junit] Running org.apache.solr.util.TestUtils
    [junit] Tests run: 3, Failures: 0, Errors: 0, Time elapsed: 0.406 sec

BUILD FAILED
/tmp/apache-solr-nightly/build.xml:374: Tests failed!

Total time: 12 minutes 39 seconds



Mime
View raw message