lucene-solr-dev mailing list archives

Site index · List index
Message view « Date » · « Thread »
Top « Date » · « Thread »
From "Yonik Seeley" <yo...@apache.org>
Subject Re: Solr nightly build failure
Date Fri, 05 Dec 2008 19:30:33 GMT
Here's the test failure:

  <testcase classname="org.apache.solr.client.solrj.embedded.SolrExampleJettyTest"
name="testCommitWithin" time="1.193">
    <failure message="expected:&lt;0&gt; but was:&lt;1&gt;"
type="junit.framework.AssertionFailedError">junit.framework.AssertionFailedError:
expected:&lt;0&gt; but was:&lt;1&gt;
        at org.apache.solr.client.solrj.SolrExampleTests.testCommitWithin(SolrExampleTests.java:226)
</failure>
  </testcase>


On Fri, Dec 5, 2008 at 3:15 AM,  <solr-dev@lucene.apache.org> wrote:
>
> init-forrest-entities:
>    [mkdir] Created dir: /tmp/apache-solr-nightly/build
>    [mkdir] Created dir: /tmp/apache-solr-nightly/build/web
>
> compile-common:
>    [mkdir] Created dir: /tmp/apache-solr-nightly/build/common
>    [javac] Compiling 40 source files to /tmp/apache-solr-nightly/build/common
>    [javac] Note: /tmp/apache-solr-nightly/src/java/org/apache/solr/common/util/FastInputStream.java
uses or overrides a deprecated API.
>    [javac] Note: Recompile with -Xlint:deprecation for details.
>    [javac] Note: Some input files use unchecked or unsafe operations.
>    [javac] Note: Recompile with -Xlint:unchecked for details.
>
> compile:
>    [mkdir] Created dir: /tmp/apache-solr-nightly/build/core
>    [javac] Compiling 373 source files to /tmp/apache-solr-nightly/build/core
>    [javac] Note: Some input files use or override a deprecated API.
>    [javac] Note: Recompile with -Xlint:deprecation for details.
>    [javac] Note: Some input files use unchecked or unsafe operations.
>    [javac] Note: Recompile with -Xlint:unchecked for details.
>
> compile-solrj-core:
>    [mkdir] Created dir: /tmp/apache-solr-nightly/build/client/solrj
>    [javac] Compiling 27 source files to /tmp/apache-solr-nightly/build/client/solrj
>    [javac] Note: /tmp/apache-solr-nightly/client/java/solrj/src/org/apache/solr/client/solrj/impl/CommonsHttpSolrServer.java
uses or overrides a deprecated API.
>    [javac] Note: Recompile with -Xlint:deprecation for details.
>    [javac] Note: Some input files use unchecked or unsafe operations.
>    [javac] Note: Recompile with -Xlint:unchecked for details.
>
> compile-solrj:
>    [javac] Compiling 2 source files to /tmp/apache-solr-nightly/build/client/solrj
>
> compileTests:
>    [mkdir] Created dir: /tmp/apache-solr-nightly/build/tests
>    [javac] Compiling 132 source files to /tmp/apache-solr-nightly/build/tests
>    [javac] Note: Some input files use or override a deprecated API.
>    [javac] Note: Recompile with -Xlint:deprecation for details.
>    [javac] Note: Some input files use unchecked or unsafe operations.
>    [javac] Note: Recompile with -Xlint:unchecked for details.
>
> junit:
>    [mkdir] Created dir: /tmp/apache-solr-nightly/build/test-results
>    [junit] Running org.apache.solr.BasicFunctionalityTest
>    [junit] Tests run: 19, Failures: 0, Errors: 0, Time elapsed: 17.486 sec
>    [junit] Running org.apache.solr.ConvertedLegacyTest
>    [junit] Tests run: 1, Failures: 0, Errors: 0, Time elapsed: 7.36 sec
>    [junit] Running org.apache.solr.DisMaxRequestHandlerTest
>    [junit] Tests run: 3, Failures: 0, Errors: 0, Time elapsed: 5.187 sec
>    [junit] Running org.apache.solr.EchoParamsTest
>    [junit] Tests run: 4, Failures: 0, Errors: 0, Time elapsed: 2.417 sec
>    [junit] Running org.apache.solr.OutputWriterTest
>    [junit] Tests run: 3, Failures: 0, Errors: 0, Time elapsed: 2.523 sec
>    [junit] Running org.apache.solr.SampleTest
>    [junit] Tests run: 2, Failures: 0, Errors: 0, Time elapsed: 2.17 sec
>    [junit] Running org.apache.solr.SolrInfoMBeanTest
>    [junit] Tests run: 1, Failures: 0, Errors: 0, Time elapsed: 0.831 sec
>    [junit] Running org.apache.solr.TestDistributedSearch
>    [junit] Tests run: 1, Failures: 0, Errors: 0, Time elapsed: 22.763 sec
>    [junit] Running org.apache.solr.analysis.DoubleMetaphoneFilterFactoryTest
>    [junit] Tests run: 2, Failures: 0, Errors: 0, Time elapsed: 0.419 sec
>    [junit] Running org.apache.solr.analysis.DoubleMetaphoneFilterTest
>    [junit] Tests run: 6, Failures: 0, Errors: 0, Time elapsed: 0.413 sec
>    [junit] Running org.apache.solr.analysis.EnglishPorterFilterFactoryTest
>    [junit] Tests run: 2, Failures: 0, Errors: 0, Time elapsed: 1.223 sec
>    [junit] Running org.apache.solr.analysis.HTMLStripReaderTest
>    [junit] Tests run: 9, Failures: 0, Errors: 0, Time elapsed: 0.963 sec
>    [junit] Running org.apache.solr.analysis.LengthFilterTest
>    [junit] Tests run: 1, Failures: 0, Errors: 0, Time elapsed: 1.038 sec
>    [junit] Running org.apache.solr.analysis.TestBufferedTokenStream
>    [junit] Tests run: 2, Failures: 0, Errors: 0, Time elapsed: 1.222 sec
>    [junit] Running org.apache.solr.analysis.TestCapitalizationFilter
>    [junit] Tests run: 2, Failures: 0, Errors: 0, Time elapsed: 1.322 sec
>    [junit] Running org.apache.solr.analysis.TestCharFilter
>    [junit] Tests run: 4, Failures: 0, Errors: 0, Time elapsed: 0.434 sec
>    [junit] Running org.apache.solr.analysis.TestHyphenatedWordsFilter
>    [junit] Tests run: 1, Failures: 0, Errors: 0, Time elapsed: 1.157 sec
>    [junit] Running org.apache.solr.analysis.TestKeepWordFilter
>    [junit] Tests run: 1, Failures: 0, Errors: 0, Time elapsed: 0.963 sec
>    [junit] Running org.apache.solr.analysis.TestMappingCharFilter
>    [junit] Tests run: 11, Failures: 0, Errors: 0, Time elapsed: 0.403 sec
>    [junit] Running org.apache.solr.analysis.TestMappingCharFilterFactory
>    [junit] Tests run: 1, Failures: 0, Errors: 0, Time elapsed: 0.407 sec
>    [junit] Running org.apache.solr.analysis.TestPatternReplaceFilter
>    [junit] Tests run: 5, Failures: 0, Errors: 0, Time elapsed: 1.55 sec
>    [junit] Running org.apache.solr.analysis.TestPatternTokenizerFactory
>    [junit] Tests run: 1, Failures: 0, Errors: 0, Time elapsed: 0.968 sec
>    [junit] Running org.apache.solr.analysis.TestPhoneticFilter
>    [junit] Tests run: 2, Failures: 0, Errors: 0, Time elapsed: 1.131 sec
>    [junit] Running org.apache.solr.analysis.TestRemoveDuplicatesTokenFilter
>    [junit] Tests run: 3, Failures: 0, Errors: 0, Time elapsed: 1.321 sec
>    [junit] Running org.apache.solr.analysis.TestSynonymFilter
>    [junit] Tests run: 7, Failures: 0, Errors: 0, Time elapsed: 2.333 sec
>    [junit] Running org.apache.solr.analysis.TestSynonymMap
>    [junit] Tests run: 5, Failures: 0, Errors: 0, Time elapsed: 1.688 sec
>    [junit] Running org.apache.solr.analysis.TestTrimFilter
>    [junit] Tests run: 1, Failures: 0, Errors: 0, Time elapsed: 1.143 sec
>    [junit] Running org.apache.solr.analysis.TestWordDelimiterFilter
>    [junit] Tests run: 9, Failures: 0, Errors: 0, Time elapsed: 13.337 sec
>    [junit] Running org.apache.solr.common.SolrDocumentTest
>    [junit] Tests run: 4, Failures: 0, Errors: 0, Time elapsed: 0.414 sec
>    [junit] Running org.apache.solr.common.params.SolrParamTest
>    [junit] Tests run: 1, Failures: 0, Errors: 0, Time elapsed: 0.38 sec
>    [junit] Running org.apache.solr.common.util.ContentStreamTest
>    [junit] Tests run: 3, Failures: 0, Errors: 0, Time elapsed: 0.457 sec
>    [junit] Running org.apache.solr.common.util.IteratorChainTest
>    [junit] Tests run: 7, Failures: 0, Errors: 0, Time elapsed: 0.385 sec
>    [junit] Running org.apache.solr.common.util.NamedListTest
>    [junit] Tests run: 1, Failures: 0, Errors: 0, Time elapsed: 0.38 sec
>    [junit] Running org.apache.solr.common.util.TestNamedListCodec
>    [junit] Tests run: 4, Failures: 0, Errors: 0, Time elapsed: 1.779 sec
>    [junit] Running org.apache.solr.common.util.TestXMLEscaping
>    [junit] Tests run: 7, Failures: 0, Errors: 0, Time elapsed: 0.394 sec
>    [junit] Running org.apache.solr.core.AlternateDirectoryTest
>    [junit] Tests run: 1, Failures: 0, Errors: 0, Time elapsed: 2.805 sec
>    [junit] Running org.apache.solr.core.RequestHandlersTest
>    [junit] Tests run: 2, Failures: 0, Errors: 0, Time elapsed: 4.18 sec
>    [junit] Running org.apache.solr.core.ResourceLoaderTest
>    [junit] Tests run: 2, Failures: 0, Errors: 0, Time elapsed: 0.453 sec
>    [junit] Running org.apache.solr.core.SOLR749Test
>    [junit] Tests run: 1, Failures: 0, Errors: 0, Time elapsed: 2.805 sec
>    [junit] Running org.apache.solr.core.SolrCoreTest
>    [junit] Tests run: 4, Failures: 0, Errors: 0, Time elapsed: 10.674 sec
>    [junit] Running org.apache.solr.core.TestArbitraryIndexDir
>    [junit] Tests run: 1, Failures: 0, Errors: 0, Time elapsed: 3.357 sec
>    [junit] Running org.apache.solr.core.TestBadConfig
>    [junit] Tests run: 1, Failures: 0, Errors: 0, Time elapsed: 0.485 sec
>    [junit] Running org.apache.solr.core.TestConfig
>    [junit] Tests run: 3, Failures: 0, Errors: 0, Time elapsed: 4.729 sec
>    [junit] Running org.apache.solr.core.TestJmxIntegration
>    [junit] Tests run: 2, Failures: 0, Errors: 0, Time elapsed: 4.193 sec
>    [junit] Running org.apache.solr.core.TestJmxMonitoredMap
>    [junit] Tests run: 1, Failures: 0, Errors: 0, Time elapsed: 1.031 sec
>    [junit] Running org.apache.solr.core.TestQuerySenderListener
>    [junit] Tests run: 1, Failures: 0, Errors: 0, Time elapsed: 2.358 sec
>    [junit] Running org.apache.solr.core.TestSolrDeletionPolicy1
>    [junit] Tests run: 3, Failures: 0, Errors: 0, Time elapsed: 10.411 sec
>    [junit] Running org.apache.solr.core.TestSolrDeletionPolicy2
>    [junit] Tests run: 1, Failures: 0, Errors: 0, Time elapsed: 2.768 sec
>    [junit] Running org.apache.solr.handler.AnalysisRequestHandlerTest
>    [junit] Tests run: 1, Failures: 0, Errors: 0, Time elapsed: 2.669 sec
>    [junit] Running org.apache.solr.handler.MoreLikeThisHandlerTest
>    [junit] Tests run: 1, Failures: 0, Errors: 0, Time elapsed: 2.994 sec
>    [junit] Running org.apache.solr.handler.SpellCheckerRequestHandlerTest
>    [junit] Tests run: 5, Failures: 0, Errors: 0, Time elapsed: 4.051 sec
>    [junit] Running org.apache.solr.handler.StandardRequestHandlerTest
>    [junit] Tests run: 1, Failures: 0, Errors: 0, Time elapsed: 3.154 sec
>    [junit] Running org.apache.solr.handler.TestCSVLoader
>    [junit] Tests run: 4, Failures: 0, Errors: 0, Time elapsed: 6.81 sec
>    [junit] Running org.apache.solr.handler.TestReplicationHandler
>    [junit] Tests run: 1, Failures: 0, Errors: 0, Time elapsed: 18.882 sec
>    [junit] Running org.apache.solr.handler.XmlUpdateRequestHandlerTest
>    [junit] Tests run: 1, Failures: 0, Errors: 0, Time elapsed: 2.672 sec
>    [junit] Running org.apache.solr.handler.admin.SystemInfoHandlerTest
>    [junit] Tests run: 1, Failures: 0, Errors: 0, Time elapsed: 0.381 sec
>    [junit] Running org.apache.solr.handler.component.QueryElevationComponentTest
>    [junit] Tests run: 3, Failures: 0, Errors: 0, Time elapsed: 4.828 sec
>    [junit] Running org.apache.solr.handler.component.SearchHandlerTest
>    [junit] Tests run: 1, Failures: 0, Errors: 0, Time elapsed: 2.578 sec
>    [junit] Running org.apache.solr.handler.component.SpellCheckComponentTest
>    [junit] Tests run: 8, Failures: 0, Errors: 0, Time elapsed: 11.977 sec
>    [junit] Running org.apache.solr.handler.component.TermVectorComponentTest
>    [junit] Tests run: 4, Failures: 0, Errors: 0, Time elapsed: 7.205 sec
>    [junit] Running org.apache.solr.handler.component.TermsComponentTest
>    [junit] Tests run: 8, Failures: 0, Errors: 0, Time elapsed: 13.096 sec
>    [junit] Running org.apache.solr.highlight.HighlighterConfigTest
>    [junit] Tests run: 1, Failures: 0, Errors: 0, Time elapsed: 3.031 sec
>    [junit] Running org.apache.solr.highlight.HighlighterTest
>    [junit] Tests run: 17, Failures: 0, Errors: 0, Time elapsed: 16.921 sec
>    [junit] Running org.apache.solr.request.JSONWriterTest
>    [junit] Tests run: 2, Failures: 0, Errors: 0, Time elapsed: 6.451 sec
>    [junit] Running org.apache.solr.request.SimpleFacetsTest
>    [junit] Tests run: 6, Failures: 0, Errors: 0, Time elapsed: 13.487 sec
>    [junit] Running org.apache.solr.request.TestFaceting
>    [junit] Tests run: 3, Failures: 0, Errors: 0, Time elapsed: 18.358 sec
>    [junit] Running org.apache.solr.request.TestWriterPerf
>    [junit] Tests run: 1, Failures: 0, Errors: 0, Time elapsed: 3.829 sec
>    [junit] Running org.apache.solr.schema.BadIndexSchemaTest
>    [junit] Tests run: 1, Failures: 0, Errors: 0, Time elapsed: 2.01 sec
>    [junit] Running org.apache.solr.schema.CopyFieldTest
>    [junit] Tests run: 6, Failures: 0, Errors: 0, Time elapsed: 11.248 sec
>    [junit] Running org.apache.solr.schema.DateFieldTest
>    [junit] Tests run: 6, Failures: 0, Errors: 0, Time elapsed: 0.439 sec
>    [junit] Running org.apache.solr.schema.IndexSchemaTest
>    [junit] Tests run: 3, Failures: 0, Errors: 0, Time elapsed: 6.858 sec
>    [junit] Running org.apache.solr.schema.LegacyDateFieldTest
>    [junit] Tests run: 4, Failures: 0, Errors: 0, Time elapsed: 0.401 sec
>    [junit] Running org.apache.solr.schema.NotRequiredUniqueKeyTest
>    [junit] Tests run: 1, Failures: 0, Errors: 0, Time elapsed: 1.723 sec
>    [junit] Running org.apache.solr.schema.RequiredFieldsTest
>    [junit] Tests run: 3, Failures: 0, Errors: 0, Time elapsed: 4.85 sec
>    [junit] Running org.apache.solr.schema.UUIDFieldTest
>    [junit] Tests run: 1, Failures: 0, Errors: 0, Time elapsed: 0.735 sec
>    [junit] Running org.apache.solr.search.TestDocSet
>    [junit] Tests run: 1, Failures: 0, Errors: 0, Time elapsed: 1.05 sec
>    [junit] Running org.apache.solr.search.TestFastLRUCache
>    [junit] Tests run: 1, Failures: 0, Errors: 0, Time elapsed: 0.445 sec
>    [junit] Running org.apache.solr.search.TestQueryTypes
>    [junit] Tests run: 1, Failures: 0, Errors: 0, Time elapsed: 3.572 sec
>    [junit] Running org.apache.solr.search.TestQueryUtils
>    [junit] Tests run: 1, Failures: 0, Errors: 0, Time elapsed: 4.285 sec
>    [junit] Running org.apache.solr.search.function.TestFunctionQuery
>    [junit] Tests run: 2, Failures: 0, Errors: 0, Time elapsed: 6.858 sec
>    [junit] Running org.apache.solr.servlet.CacheHeaderTest
>    [junit] Tests run: 5, Failures: 0, Errors: 0, Time elapsed: 13.146 sec
>    [junit] Running org.apache.solr.servlet.DirectSolrConnectionTest
>    [junit] Tests run: 2, Failures: 0, Errors: 0, Time elapsed: 2.545 sec
>    [junit] Running org.apache.solr.servlet.NoCacheHeaderTest
>    [junit] Tests run: 3, Failures: 0, Errors: 0, Time elapsed: 9.089 sec
>    [junit] Running org.apache.solr.servlet.SolrRequestParserTest
>    [junit] Tests run: 4, Failures: 0, Errors: 0, Time elapsed: 7.052 sec
>    [junit] Running org.apache.solr.spelling.FileBasedSpellCheckerTest
>    [junit] Tests run: 3, Failures: 0, Errors: 0, Time elapsed: 5.449 sec
>    [junit] Running org.apache.solr.spelling.IndexBasedSpellCheckerTest
>    [junit] Tests run: 4, Failures: 0, Errors: 0, Time elapsed: 6.037 sec
>    [junit] Running org.apache.solr.spelling.SpellingQueryConverterTest
>    [junit] Tests run: 1, Failures: 0, Errors: 0, Time elapsed: 2.53 sec
>    [junit] Running org.apache.solr.update.AutoCommitTest
>    [junit] Tests run: 1, Failures: 0, Errors: 0, Time elapsed: 6.264 sec
>    [junit] Running org.apache.solr.update.DirectUpdateHandlerOptimizeTest
>    [junit] Tests run: 1, Failures: 0, Errors: 0, Time elapsed: 3.491 sec
>    [junit] Running org.apache.solr.update.DirectUpdateHandlerTest
>    [junit] Tests run: 6, Failures: 0, Errors: 0, Time elapsed: 8.427 sec
>    [junit] Running org.apache.solr.update.DocumentBuilderTest
>    [junit] Tests run: 2, Failures: 0, Errors: 0, Time elapsed: 4.253 sec
>    [junit] Running org.apache.solr.update.processor.UpdateRequestProcessorFactoryTest
>    [junit] Tests run: 1, Failures: 0, Errors: 0, Time elapsed: 2.537 sec
>    [junit] Running org.apache.solr.util.ArraysUtilsTest
>    [junit] Tests run: 1, Failures: 0, Errors: 0, Time elapsed: 0.378 sec
>    [junit] Running org.apache.solr.util.DateMathParserTest
>    [junit] Tests run: 7, Failures: 0, Errors: 0, Time elapsed: 0.43 sec
>    [junit] Running org.apache.solr.util.SolrPluginUtilsTest
>    [junit] Tests run: 6, Failures: 0, Errors: 0, Time elapsed: 6.744 sec
>    [junit] Running org.apache.solr.util.TestCharArrayMap
>    [junit] Tests run: 2, Failures: 0, Errors: 0, Time elapsed: 0.689 sec
>    [junit] Running org.apache.solr.util.TestNumberUtils
>    [junit] Tests run: 1, Failures: 0, Errors: 0, Time elapsed: 1.688 sec
>    [junit] Running org.apache.solr.util.TestOpenBitSet
>    [junit] Tests run: 3, Failures: 0, Errors: 0, Time elapsed: 1.428 sec
>    [junit] Running org.apache.solr.util.TestUtils
>    [junit] Tests run: 4, Failures: 0, Errors: 0, Time elapsed: 0.468 sec
>    [junit] Running org.apache.solr.client.solrj.SolrExceptionTest
>    [junit] Tests run: 1, Failures: 0, Errors: 0, Time elapsed: 1.114 sec
>    [junit] Running org.apache.solr.client.solrj.SolrQueryTest
>    [junit] Tests run: 4, Failures: 0, Errors: 0, Time elapsed: 0.401 sec
>    [junit] Running org.apache.solr.client.solrj.beans.TestDocumentObjectBinder
>    [junit] Tests run: 3, Failures: 0, Errors: 0, Time elapsed: 0.632 sec
>    [junit] Running org.apache.solr.client.solrj.embedded.JettyWebappTest
>    [junit] Tests run: 1, Failures: 0, Errors: 0, Time elapsed: 5.608 sec
>    [junit] Running org.apache.solr.client.solrj.embedded.LargeVolumeEmbeddedTest
>    [junit] Tests run: 1, Failures: 0, Errors: 0, Time elapsed: 4.231 sec
>    [junit] Running org.apache.solr.client.solrj.embedded.LargeVolumeJettyTest
>    [junit] Tests run: 1, Failures: 0, Errors: 0, Time elapsed: 4.489 sec
>    [junit] Running org.apache.solr.client.solrj.embedded.MultiCoreEmbeddedTest
>    [junit] Tests run: 1, Failures: 0, Errors: 0, Time elapsed: 3.619 sec
>    [junit] Running org.apache.solr.client.solrj.embedded.MultiCoreExampleJettyTest
>    [junit] Tests run: 1, Failures: 0, Errors: 0, Time elapsed: 3.872 sec
>    [junit] Running org.apache.solr.client.solrj.embedded.SolrExampleEmbeddedTest
>    [junit] Tests run: 8, Failures: 0, Errors: 0, Time elapsed: 7.341 sec
>    [junit] Running org.apache.solr.client.solrj.embedded.SolrExampleJettyTest
>    [junit] Tests run: 9, Failures: 1, Errors: 0, Time elapsed: 14.144 sec
>    [junit] Test org.apache.solr.client.solrj.embedded.SolrExampleJettyTest FAILED
>    [junit] Running org.apache.solr.client.solrj.embedded.TestSolrProperties
>    [junit] Tests run: 1, Failures: 0, Errors: 0, Time elapsed: 3.013 sec
>    [junit] Running org.apache.solr.client.solrj.response.QueryResponseTest
>    [junit] Tests run: 1, Failures: 0, Errors: 0, Time elapsed: 0.674 sec
>    [junit] Running org.apache.solr.client.solrj.response.TestSpellCheckResponse
>    [junit] Tests run: 2, Failures: 0, Errors: 0, Time elapsed: 5.23 sec
>    [junit] Running org.apache.solr.client.solrj.util.ClientUtilsTest
>    [junit] Tests run: 1, Failures: 0, Errors: 0, Time elapsed: 0.384 sec
>
> BUILD FAILED
> /tmp/apache-solr-nightly/build.xml:446: Tests failed!
>
> Total time: 9 minutes 55 seconds
>
>
>

Mime
View raw message