lucene-solr-dev mailing list archives

Site index · List index
Message view « Date » · « Thread »
Top « Date » · « Thread »
From solr-...@lucene.apache.org
Subject Solr nightly build failure
Date Sat, 23 Aug 2008 08:15:47 GMT

init-forrest-entities:
    [mkdir] Created dir: /tmp/apache-solr-nightly/build
    [mkdir] Created dir: /tmp/apache-solr-nightly/build/web

compile-common:
    [mkdir] Created dir: /tmp/apache-solr-nightly/build/common
    [javac] Compiling 36 source files to /tmp/apache-solr-nightly/build/common
    [javac] Note: /tmp/apache-solr-nightly/src/java/org/apache/solr/common/util/FastInputStream.java
uses or overrides a deprecated API.
    [javac] Note: Recompile with -Xlint:deprecation for details.
    [javac] Note: Some input files use unchecked or unsafe operations.
    [javac] Note: Recompile with -Xlint:unchecked for details.

compile:
    [mkdir] Created dir: /tmp/apache-solr-nightly/build/core
    [javac] Compiling 338 source files to /tmp/apache-solr-nightly/build/core
    [javac] Note: Some input files use or override a deprecated API.
    [javac] Note: Recompile with -Xlint:deprecation for details.
    [javac] Note: Some input files use unchecked or unsafe operations.
    [javac] Note: Recompile with -Xlint:unchecked for details.

compile-solrj-core:
    [mkdir] Created dir: /tmp/apache-solr-nightly/build/client/solrj
    [javac] Compiling 26 source files to /tmp/apache-solr-nightly/build/client/solrj
    [javac] Note: /tmp/apache-solr-nightly/client/java/solrj/src/org/apache/solr/client/solrj/impl/CommonsHttpSolrServer.java
uses or overrides a deprecated API.
    [javac] Note: Recompile with -Xlint:deprecation for details.
    [javac] Note: Some input files use unchecked or unsafe operations.
    [javac] Note: Recompile with -Xlint:unchecked for details.

compile-solrj:
    [javac] Compiling 2 source files to /tmp/apache-solr-nightly/build/client/solrj

compileTests:
    [mkdir] Created dir: /tmp/apache-solr-nightly/build/tests
    [javac] Compiling 112 source files to /tmp/apache-solr-nightly/build/tests
    [javac] Note: Some input files use or override a deprecated API.
    [javac] Note: Recompile with -Xlint:deprecation for details.
    [javac] Note: Some input files use unchecked or unsafe operations.
    [javac] Note: Recompile with -Xlint:unchecked for details.

junit:
    [mkdir] Created dir: /tmp/apache-solr-nightly/build/test-results
    [junit] Running org.apache.solr.BasicFunctionalityTest
    [junit] Tests run: 19, Failures: 0, Errors: 0, Time elapsed: 17.432 sec
    [junit] Running org.apache.solr.ConvertedLegacyTest
    [junit] Tests run: 1, Failures: 0, Errors: 0, Time elapsed: 9.36 sec
    [junit] Running org.apache.solr.DisMaxRequestHandlerTest
    [junit] Tests run: 3, Failures: 0, Errors: 0, Time elapsed: 6.203 sec
    [junit] Running org.apache.solr.EchoParamsTest
    [junit] Tests run: 4, Failures: 0, Errors: 0, Time elapsed: 2.623 sec
    [junit] Running org.apache.solr.OutputWriterTest
    [junit] Tests run: 3, Failures: 0, Errors: 0, Time elapsed: 3.997 sec
    [junit] Running org.apache.solr.SampleTest
    [junit] Tests run: 2, Failures: 0, Errors: 0, Time elapsed: 2.393 sec
    [junit] Running org.apache.solr.SolrInfoMBeanTest
    [junit] Tests run: 1, Failures: 0, Errors: 0, Time elapsed: 0.953 sec
    [junit] Running org.apache.solr.TestDistributedSearch
    [junit] Tests run: 1, Failures: 0, Errors: 0, Time elapsed: 26.968 sec
    [junit] 2008-08-23 08:08:05.992::INFO:  Shutdown hook executing
    [junit] 2008-08-23 08:08:05.993::INFO:  Shutdown hook complete
    [junit] 2008-08-23 08:08:07.001::INFO:  Shutdown hook complete
    [junit] 2008-08-23 08:08:08.010::INFO:  Shutdown hook complete
    [junit] 2008-08-23 08:08:09.019::INFO:  Shutdown hook complete
    [junit] 2008-08-23 08:08:10.029::INFO:  Shutdown hook complete
    [junit] 2008-08-23 08:08:11.039::INFO:  Shutdown hook complete
    [junit] 2008-08-23 08:08:12.049::INFO:  Shutdown hook complete
    [junit] 2008-08-23 08:08:13.059::INFO:  Shutdown hook complete
    [junit] 2008-08-23 08:08:14.068::INFO:  Shutdown hook complete
    [junit] Running org.apache.solr.analysis.EnglishPorterFilterFactoryTest
    [junit] Tests run: 2, Failures: 0, Errors: 0, Time elapsed: 1.46 sec
    [junit] Running org.apache.solr.analysis.HTMLStripReaderTest
    [junit] Tests run: 9, Failures: 0, Errors: 0, Time elapsed: 1.053 sec
    [junit] Running org.apache.solr.analysis.LengthFilterTest
    [junit] Tests run: 1, Failures: 0, Errors: 0, Time elapsed: 1.114 sec
    [junit] Running org.apache.solr.analysis.TestBufferedTokenStream
    [junit] Tests run: 2, Failures: 0, Errors: 0, Time elapsed: 1.341 sec
    [junit] Running org.apache.solr.analysis.TestCapitalizationFilter
    [junit] Tests run: 2, Failures: 0, Errors: 0, Time elapsed: 1.586 sec
    [junit] Running org.apache.solr.analysis.TestHyphenatedWordsFilter
    [junit] Tests run: 1, Failures: 0, Errors: 0, Time elapsed: 1.176 sec
    [junit] Running org.apache.solr.analysis.TestKeepWordFilter
    [junit] Tests run: 1, Failures: 0, Errors: 0, Time elapsed: 1.284 sec
    [junit] Running org.apache.solr.analysis.TestPatternReplaceFilter
    [junit] Tests run: 5, Failures: 0, Errors: 0, Time elapsed: 2.137 sec
    [junit] Running org.apache.solr.analysis.TestPatternTokenizerFactory
    [junit] Tests run: 1, Failures: 0, Errors: 0, Time elapsed: 1.265 sec
    [junit] Running org.apache.solr.analysis.TestPhoneticFilter
    [junit] Tests run: 2, Failures: 0, Errors: 0, Time elapsed: 1.49 sec
    [junit] Running org.apache.solr.analysis.TestRemoveDuplicatesTokenFilter
    [junit] Tests run: 3, Failures: 0, Errors: 0, Time elapsed: 1.638 sec
    [junit] Running org.apache.solr.analysis.TestSynonymFilter
    [junit] Tests run: 7, Failures: 0, Errors: 0, Time elapsed: 2.08 sec
    [junit] Running org.apache.solr.analysis.TestSynonymMap
    [junit] Tests run: 5, Failures: 0, Errors: 0, Time elapsed: 1.854 sec
    [junit] Running org.apache.solr.analysis.TestTrimFilter
    [junit] Tests run: 1, Failures: 0, Errors: 0, Time elapsed: 1.136 sec
    [junit] Running org.apache.solr.analysis.TestWordDelimiterFilter
    [junit] Tests run: 5, Failures: 0, Errors: 0, Time elapsed: 8.458 sec
    [junit] Running org.apache.solr.common.SolrDocumentTest
    [junit] Tests run: 4, Failures: 0, Errors: 0, Time elapsed: 0.41 sec
    [junit] Running org.apache.solr.common.params.SolrParamTest
    [junit] Tests run: 1, Failures: 0, Errors: 0, Time elapsed: 0.413 sec
    [junit] Running org.apache.solr.common.util.ContentStreamTest
    [junit] Tests run: 3, Failures: 0, Errors: 0, Time elapsed: 0.578 sec
    [junit] Running org.apache.solr.common.util.IteratorChainTest
    [junit] Tests run: 7, Failures: 0, Errors: 0, Time elapsed: 0.464 sec
    [junit] Running org.apache.solr.common.util.NamedListTest
    [junit] Tests run: 1, Failures: 0, Errors: 0, Time elapsed: 0.428 sec
    [junit] Running org.apache.solr.common.util.TestNamedListCodec
    [junit] Tests run: 4, Failures: 0, Errors: 0, Time elapsed: 1.876 sec
    [junit] Running org.apache.solr.common.util.TestXMLEscaping
    [junit] Tests run: 7, Failures: 0, Errors: 0, Time elapsed: 0.432 sec
    [junit] Running org.apache.solr.core.RequestHandlersTest
    [junit] Tests run: 2, Failures: 0, Errors: 0, Time elapsed: 4.587 sec
    [junit] Running org.apache.solr.core.ResourceLoaderTest
    [junit] Tests run: 2, Failures: 0, Errors: 0, Time elapsed: 0.506 sec
    [junit] Running org.apache.solr.core.SolrCoreTest
    [junit] Tests run: 4, Failures: 0, Errors: 0, Time elapsed: 12.563 sec
    [junit] Running org.apache.solr.core.TestBadConfig
    [junit] Tests run: 1, Failures: 0, Errors: 0, Time elapsed: 0.515 sec
    [junit] Running org.apache.solr.core.TestConfig
    [junit] Tests run: 3, Failures: 0, Errors: 0, Time elapsed: 4.812 sec
    [junit] Running org.apache.solr.core.TestJmxIntegration
    [junit] Tests run: 2, Failures: 0, Errors: 0, Time elapsed: 4.223 sec
    [junit] Running org.apache.solr.core.TestJmxMonitoredMap
    [junit] Tests run: 1, Failures: 0, Errors: 0, Time elapsed: 1.44 sec
    [junit] Running org.apache.solr.core.TestQuerySenderListener
    [junit] Tests run: 1, Failures: 0, Errors: 0, Time elapsed: 2.649 sec
    [junit] Running org.apache.solr.handler.AnalysisRequestHandlerTest
    [junit] Tests run: 1, Failures: 0, Errors: 0, Time elapsed: 3.683 sec
    [junit] Running org.apache.solr.handler.MoreLikeThisHandlerTest
    [junit] Tests run: 1, Failures: 0, Errors: 0, Time elapsed: 3.063 sec
    [junit] Running org.apache.solr.handler.SpellCheckerRequestHandlerTest
    [junit] Tests run: 5, Failures: 0, Errors: 0, Time elapsed: 4.389 sec
    [junit] Running org.apache.solr.handler.StandardRequestHandlerTest
    [junit] Tests run: 1, Failures: 0, Errors: 0, Time elapsed: 2.862 sec
    [junit] Running org.apache.solr.handler.TestCSVLoader
    [junit] Tests run: 4, Failures: 0, Errors: 0, Time elapsed: 7.186 sec
    [junit] Running org.apache.solr.handler.XmlUpdateRequestHandlerTest
    [junit] Tests run: 1, Failures: 0, Errors: 0, Time elapsed: 3.329 sec
    [junit] Running org.apache.solr.handler.admin.SystemInfoHandlerTest
    [junit] Tests run: 1, Failures: 0, Errors: 0, Time elapsed: 0.422 sec
    [junit] Running org.apache.solr.handler.component.QueryElevationComponentTest
    [junit] Tests run: 3, Failures: 0, Errors: 0, Time elapsed: 6.227 sec
    [junit] Running org.apache.solr.handler.component.SearchHandlerTest
    [junit] Tests run: 1, Failures: 0, Errors: 0, Time elapsed: 2.697 sec
    [junit] Running org.apache.solr.handler.component.SpellCheckComponentTest
    [junit] Tests run: 8, Failures: 0, Errors: 0, Time elapsed: 12.719 sec
    [junit] Running org.apache.solr.highlight.HighlighterConfigTest
    [junit] Tests run: 1, Failures: 0, Errors: 0, Time elapsed: 3.298 sec
    [junit] Running org.apache.solr.highlight.HighlighterTest
    [junit] Tests run: 17, Failures: 0, Errors: 0, Time elapsed: 19.866 sec
    [junit] Running org.apache.solr.request.JSONWriterTest
    [junit] Tests run: 1, Failures: 0, Errors: 0, Time elapsed: 3.505 sec
    [junit] Running org.apache.solr.request.SimpleFacetsTest
    [junit] Tests run: 6, Failures: 0, Errors: 0, Time elapsed: 10.892 sec
    [junit] Running org.apache.solr.request.TestWriterPerf
    [junit] Tests run: 1, Failures: 0, Errors: 0, Time elapsed: 2.932 sec
    [junit] Running org.apache.solr.schema.BadIndexSchemaTest
    [junit] Tests run: 1, Failures: 0, Errors: 0, Time elapsed: 2.053 sec
    [junit] Running org.apache.solr.schema.DateFieldTest
    [junit] Tests run: 6, Failures: 0, Errors: 0, Time elapsed: 0.413 sec
    [junit] Running org.apache.solr.schema.IndexSchemaTest
    [junit] Tests run: 3, Failures: 0, Errors: 0, Time elapsed: 5.277 sec
    [junit] Running org.apache.solr.schema.LegacyDateFieldTest
    [junit] Tests run: 4, Failures: 0, Errors: 0, Time elapsed: 0.48 sec
    [junit] Running org.apache.solr.schema.NotRequiredUniqueKeyTest
    [junit] Tests run: 1, Failures: 0, Errors: 0, Time elapsed: 2.235 sec
    [junit] Running org.apache.solr.schema.RequiredFieldsTest
    [junit] Tests run: 3, Failures: 0, Errors: 0, Time elapsed: 4.927 sec
    [junit] Running org.apache.solr.schema.UUIDFieldTest
    [junit] Tests run: 1, Failures: 0, Errors: 0, Time elapsed: 0.673 sec
    [junit] Running org.apache.solr.search.TestDocSet
    [junit] Tests run: 1, Failures: 0, Errors: 0, Time elapsed: 0.917 sec
    [junit] Running org.apache.solr.search.TestQueryTypes
    [junit] Tests run: 1, Failures: 0, Errors: 0, Time elapsed: 2.556 sec
    [junit] Running org.apache.solr.search.TestQueryUtils
    [junit] Tests run: 1, Failures: 0, Errors: 0, Time elapsed: 4.104 sec
    [junit] Running org.apache.solr.search.function.TestFunctionQuery
    [junit] Tests run: 2, Failures: 0, Errors: 0, Time elapsed: 6.222 sec
    [junit] Running org.apache.solr.servlet.CacheHeaderTest
    [junit] Tests run: 5, Failures: 0, Errors: 0, Time elapsed: 15.836 sec
    [junit] 2008-08-23 08:12:11.642::INFO:  Shutdown hook executing
    [junit] 2008-08-23 08:12:11.643::INFO:  Shutdown hook complete
    [junit] 2008-08-23 08:12:12.648::INFO:  Shutdown hook complete
    [junit] 2008-08-23 08:12:13.657::INFO:  Shutdown hook complete
    [junit] 2008-08-23 08:12:14.667::INFO:  Shutdown hook complete
    [junit] 2008-08-23 08:12:15.677::INFO:  Shutdown hook complete
    [junit] Running org.apache.solr.servlet.DirectSolrConnectionTest
    [junit] Tests run: 2, Failures: 0, Errors: 0, Time elapsed: 2.56 sec
    [junit] Running org.apache.solr.servlet.NoCacheHeaderTest
    [junit] Tests run: 3, Failures: 0, Errors: 0, Time elapsed: 13.054 sec
    [junit] 2008-08-23 08:12:34.077::INFO:  Shutdown hook executing
    [junit] 2008-08-23 08:12:34.085::INFO:  Shutdown hook complete
    [junit] 2008-08-23 08:12:35.092::INFO:  Shutdown hook complete
    [junit] 2008-08-23 08:12:36.102::INFO:  Shutdown hook complete
    [junit] Running org.apache.solr.servlet.SolrRequestParserTest
    [junit] Tests run: 4, Failures: 0, Errors: 0, Time elapsed: 5.866 sec
    [junit] Running org.apache.solr.spelling.FileBasedSpellCheckerTest
    [junit] Tests run: 3, Failures: 0, Errors: 0, Time elapsed: 4.87 sec
    [junit] Running org.apache.solr.spelling.IndexBasedSpellCheckerTest
    [junit] Tests run: 4, Failures: 0, Errors: 0, Time elapsed: 7.466 sec
    [junit] Running org.apache.solr.spelling.SpellingQueryConverterTest
    [junit] Tests run: 1, Failures: 0, Errors: 0, Time elapsed: 3.125 sec
    [junit] Running org.apache.solr.update.AutoCommitTest
    [junit] Tests run: 1, Failures: 0, Errors: 0, Time elapsed: 6.238 sec
    [junit] Running org.apache.solr.update.DirectUpdateHandlerOptimizeTest
    [junit] Tests run: 1, Failures: 0, Errors: 0, Time elapsed: 4.59 sec
    [junit] Running org.apache.solr.update.DirectUpdateHandlerTest
    [junit] Tests run: 1, Failures: 0, Errors: 0, Time elapsed: 3.077 sec
    [junit] Running org.apache.solr.update.DocumentBuilderTest
    [junit] Tests run: 2, Failures: 0, Errors: 0, Time elapsed: 3.683 sec
    [junit] Running org.apache.solr.update.processor.UpdateRequestProcessorFactoryTest
    [junit] Tests run: 1, Failures: 0, Errors: 0, Time elapsed: 2.802 sec
    [junit] Running org.apache.solr.util.ArraysUtilsTest
    [junit] Tests run: 1, Failures: 0, Errors: 0, Time elapsed: 0.454 sec
    [junit] Running org.apache.solr.util.DateMathParserTest
    [junit] Tests run: 7, Failures: 0, Errors: 0, Time elapsed: 0.526 sec
    [junit] Running org.apache.solr.util.SolrPluginUtilsTest
    [junit] Tests run: 6, Failures: 0, Errors: 0, Time elapsed: 7.926 sec
    [junit] Running org.apache.solr.util.TestCharArrayMap
    [junit] Tests run: 2, Failures: 0, Errors: 0, Time elapsed: 0.641 sec
    [junit] Running org.apache.solr.util.TestNumberUtils
    [junit] Tests run: 1, Failures: 0, Errors: 0, Time elapsed: 1.674 sec
    [junit] Running org.apache.solr.util.TestOpenBitSet
    [junit] Tests run: 3, Failures: 0, Errors: 0, Time elapsed: 2.94 sec
    [junit] Running org.apache.solr.util.TestUtils
    [junit] Tests run: 4, Failures: 0, Errors: 0, Time elapsed: 0.495 sec
    [junit] Running org.apache.solr.client.solrj.SolrExceptionTest
    [junit] Tests run: 1, Failures: 0, Errors: 0, Time elapsed: 1.088 sec
    [junit] Running org.apache.solr.client.solrj.SolrQueryTest
    [junit] Tests run: 2, Failures: 0, Errors: 0, Time elapsed: 0.457 sec
    [junit] Running org.apache.solr.client.solrj.beans.TestDocumentObjectBinder
    [junit] Tests run: 3, Failures: 0, Errors: 0, Time elapsed: 0.755 sec
    [junit] Running org.apache.solr.client.solrj.embedded.JettyWebappTest
    [junit] Tests run: 1, Failures: 0, Errors: 0, Time elapsed: 7.932 sec
    [junit] 2008-08-23 08:13:56.909::INFO:  Shutdown hook executing
    [junit] 2008-08-23 08:13:56.909::INFO:  Shutdown hook complete
    [junit] Running org.apache.solr.client.solrj.embedded.LargeVolumeEmbeddedTest
    [junit] Tests run: 1, Failures: 0, Errors: 0, Time elapsed: 7.086 sec
    [junit] Running org.apache.solr.client.solrj.embedded.LargeVolumeJettyTest
    [junit] Tests run: 1, Failures: 0, Errors: 0, Time elapsed: 7.798 sec
    [junit] 2008-08-23 08:14:14.776::INFO:  Shutdown hook executing
    [junit] 2008-08-23 08:14:14.776::INFO:  Shutdown hook complete
    [junit] Running org.apache.solr.client.solrj.embedded.MultiCoreEmbeddedTest
    [junit] Tests run: 1, Failures: 0, Errors: 0, Time elapsed: 3.744 sec
    [junit] Running org.apache.solr.client.solrj.embedded.MultiCoreExampleJettyTest
    [junit] Tests run: 1, Failures: 0, Errors: 0, Time elapsed: 4.999 sec
    [junit] 2008-08-23 08:14:26.374::INFO:  Shutdown hook executing
    [junit] 2008-08-23 08:14:26.383::INFO:  Shutdown hook complete
    [junit] Running org.apache.solr.client.solrj.embedded.SolrExampleEmbeddedTest
    [junit] Tests run: 6, Failures: 0, Errors: 0, Time elapsed: 10.218 sec
    [junit] Running org.apache.solr.client.solrj.embedded.SolrExampleJettyTest
    [junit] Tests run: 7, Failures: 0, Errors: 0, Time elapsed: 17.308 sec
    [junit] 2008-08-23 08:14:56.743::INFO:  Shutdown hook executing
    [junit] 2008-08-23 08:14:56.743::INFO:  Shutdown hook complete
    [junit] 2008-08-23 08:14:57.747::INFO:  Shutdown hook complete
    [junit] 2008-08-23 08:14:58.757::INFO:  Shutdown hook complete
    [junit] 2008-08-23 08:14:59.770::INFO:  Shutdown hook complete
    [junit] 2008-08-23 08:15:00.776::INFO:  Shutdown hook complete
    [junit] 2008-08-23 08:15:01.786::INFO:  Shutdown hook complete
    [junit] 2008-08-23 08:15:02.796::INFO:  Shutdown hook complete
    [junit] Running org.apache.solr.client.solrj.response.QueryResponseTest
    [junit] Tests run: 1, Failures: 0, Errors: 0, Time elapsed: 0.676 sec
    [junit] Running org.apache.solr.client.solrj.response.TestSpellCheckResponse
    [junit] Tests run: 2, Failures: 0, Errors: 0, Time elapsed: 5.722 sec
    [junit] 2008-08-23 08:15:11.555::INFO:  Shutdown hook executing
    [junit] 2008-08-23 08:15:11.674::INFO:  Shutdown hook complete
    [junit] 2008-08-23 08:15:12.686::INFO:  Shutdown hook complete
    [junit] Running org.apache.solr.client.solrj.util.ClientUtilsTest
    [junit] Tests run: 1, Failures: 0, Errors: 0, Time elapsed: 0.445 sec

test-core:

build-contrib:

init:
    [mkdir] Created dir: /tmp/apache-solr-nightly/contrib/dataimporthandler/target/classes
    [mkdir] Created dir: /tmp/apache-solr-nightly/build/docs/api

init-forrest-entities:

compile-common:

compile:

make-manifest:
     [exec] Execute failed: java.io.IOException: svnversion: not found
    [mkdir] Created dir: /tmp/apache-solr-nightly/build/META-INF

compile:
    [javac] Compiling 33 source files to /tmp/apache-solr-nightly/contrib/dataimporthandler/target/classes
    [javac] Note: Some input files use unchecked or unsafe operations.
    [javac] Note: Recompile with -Xlint:unchecked for details.

build:
      [jar] Building jar: /tmp/apache-solr-nightly/contrib/dataimporthandler/target/apache-solr-dataimporthandler-nightly.jar

test-contrib:

init:

init-forrest-entities:

compile-common:

compile:

make-manifest:
     [exec] Execute failed: java.io.IOException: svnversion: not found

compile:

compileTests:
    [mkdir] Created dir: /tmp/apache-solr-nightly/contrib/dataimporthandler/target/test-classes
    [javac] Compiling 19 source files to /tmp/apache-solr-nightly/contrib/dataimporthandler/target/test-classes
    [javac] Note: Some input files use unchecked or unsafe operations.
    [javac] Note: Recompile with -Xlint:unchecked for details.

test:
    [junit] Running org.apache.solr.handler.dataimport.TestCachedSqlEntityProcessor
    [junit] Tests run: 4, Failures: 0, Errors: 0, Time elapsed: 0.488 sec
    [junit] Running org.apache.solr.handler.dataimport.TestDataConfig
    [junit] Tests run: 1, Failures: 0, Errors: 0, Time elapsed: 3.015 sec
    [junit] Running org.apache.solr.handler.dataimport.TestDateFormatTransformer
    [junit] Tests run: 2, Failures: 0, Errors: 0, Time elapsed: 0.5 sec
    [junit] Running org.apache.solr.handler.dataimport.TestDocBuilder
    [junit] Tests run: 4, Failures: 0, Errors: 0, Time elapsed: 0.709 sec
    [junit] Running org.apache.solr.handler.dataimport.TestDocBuilder2
    [junit] Tests run: 1, Failures: 0, Errors: 0, Time elapsed: 2.631 sec
    [junit] Running org.apache.solr.handler.dataimport.TestEntityProcessorBase
    [junit] Tests run: 1, Failures: 0, Errors: 0, Time elapsed: 0.464 sec
    [junit] Running org.apache.solr.handler.dataimport.TestEvaluatorBag
    [junit] Tests run: 2, Failures: 0, Errors: 0, Time elapsed: 0.491 sec
    [junit] Running org.apache.solr.handler.dataimport.TestFileListEntityProcessor
    [junit] Tests run: 2, Failures: 0, Errors: 0, Time elapsed: 0.473 sec
    [junit] Running org.apache.solr.handler.dataimport.TestJdbcDataSource
    [junit] Tests run: 0, Failures: 0, Errors: 0, Time elapsed: 0.582 sec
    [junit] Running org.apache.solr.handler.dataimport.TestNumberFormatTransformer
    [junit] Tests run: 9, Failures: 0, Errors: 0, Time elapsed: 0.518 sec
    [junit] Running org.apache.solr.handler.dataimport.TestRegexTransformer
    [junit] Tests run: 3, Failures: 0, Errors: 0, Time elapsed: 0.439 sec
    [junit] Running org.apache.solr.handler.dataimport.TestScriptTransformer
    [junit] Tests run: 0, Failures: 0, Errors: 0, Time elapsed: 0.346 sec
    [junit] Running org.apache.solr.handler.dataimport.TestSqlEntityProcessor
    [junit] Tests run: 4, Failures: 0, Errors: 0, Time elapsed: 0.532 sec
    [junit] Running org.apache.solr.handler.dataimport.TestSqlEntityProcessor2
    [junit] Tests run: 2, Failures: 0, Errors: 0, Time elapsed: 2.996 sec
    [junit] Running org.apache.solr.handler.dataimport.TestTemplateString
    [junit] Tests run: 1, Failures: 0, Errors: 0, Time elapsed: 0.485 sec
    [junit] Running org.apache.solr.handler.dataimport.TestTemplateTransformer
    [junit] Tests run: 1, Failures: 0, Errors: 0, Time elapsed: 0.54 sec
    [junit] Running org.apache.solr.handler.dataimport.TestVariableResolver
    [junit] Tests run: 8, Failures: 0, Errors: 0, Time elapsed: 0.643 sec
    [junit] Running org.apache.solr.handler.dataimport.TestXPathEntityProcessor
    [junit] Tests run: 3, Failures: 0, Errors: 0, Time elapsed: 1.028 sec
    [junit] Running org.apache.solr.handler.dataimport.TestXPathRecordReader
    [junit] Tests run: 10, Failures: 0, Errors: 0, Time elapsed: 0.568 sec

test:

maven.ant.tasks-check:

BUILD FAILED
/tmp/apache-solr-nightly/common-build.xml:334: ##################################################################
      Maven ant tasks not found.
      Please make sure the maven-ant-tasks jar is in ANT_HOME/lib, or made
      available to Ant using other mechanisms like -lib or CLASSPATH.
      ##################################################################

Total time: 9 minutes 17 seconds



Mime
View raw message