lucene-solr-dev mailing list archives

Site index · List index
Message view « Date » · « Thread »
Top « Date » · « Thread »
From solr-...@lucene.apache.org
Subject Solr nightly build failure
Date Fri, 21 Mar 2008 12:26:32 GMT

init-forrest-entities:
    [mkdir] Created dir: /tmp/apache-solr-nightly/build

compile-common:
    [mkdir] Created dir: /tmp/apache-solr-nightly/build/common
    [javac] Compiling 31 source files to /tmp/apache-solr-nightly/build/common
    [javac] Note: Some input files use unchecked or unsafe operations.
    [javac] Note: Recompile with -Xlint:unchecked for details.

compile:
    [mkdir] Created dir: /tmp/apache-solr-nightly/build/core
    [javac] Compiling 311 source files to /tmp/apache-solr-nightly/build/core
    [javac] Note: Some input files use or override a deprecated API.
    [javac] Note: Recompile with -Xlint:deprecation for details.
    [javac] Note: Some input files use unchecked or unsafe operations.
    [javac] Note: Recompile with -Xlint:unchecked for details.

compile-solrj-core:
    [mkdir] Created dir: /tmp/apache-solr-nightly/build/client/solrj
    [javac] Compiling 22 source files to /tmp/apache-solr-nightly/build/client/solrj
    [javac] Note: /tmp/apache-solr-nightly/client/java/solrj/src/org/apache/solr/client/solrj/impl/CommonsHttpSolrServer.java
uses or overrides a deprecated API.
    [javac] Note: Recompile with -Xlint:deprecation for details.

compile-solrj:
    [javac] Compiling 2 source files to /tmp/apache-solr-nightly/build/client/solrj

compileTests:
    [mkdir] Created dir: /tmp/apache-solr-nightly/build/tests
    [javac] Compiling 87 source files to /tmp/apache-solr-nightly/build/tests
    [javac] Note: Some input files use or override a deprecated API.
    [javac] Note: Recompile with -Xlint:deprecation for details.
    [javac] Note: Some input files use unchecked or unsafe operations.
    [javac] Note: Recompile with -Xlint:unchecked for details.

junit:
    [mkdir] Created dir: /tmp/apache-solr-nightly/build/test-results
    [junit] Running org.apache.solr.BasicFunctionalityTest
    [junit] Tests run: 25, Failures: 0, Errors: 0, Time elapsed: 31.602 sec
    [junit] Running org.apache.solr.ConvertedLegacyTest
    [junit] Tests run: 1, Failures: 0, Errors: 0, Time elapsed: 9.908 sec
    [junit] Running org.apache.solr.DisMaxRequestHandlerTest
    [junit] Tests run: 3, Failures: 0, Errors: 0, Time elapsed: 5.359 sec
    [junit] Running org.apache.solr.EchoParamsTest
    [junit] Tests run: 4, Failures: 0, Errors: 0, Time elapsed: 2.475 sec
    [junit] Running org.apache.solr.OutputWriterTest
    [junit] Tests run: 3, Failures: 0, Errors: 0, Time elapsed: 2.665 sec
    [junit] Running org.apache.solr.SampleTest
    [junit] Tests run: 2, Failures: 0, Errors: 0, Time elapsed: 2.173 sec
    [junit] Running org.apache.solr.TestDistributedSearch
    [junit] Tests run: 1, Failures: 0, Errors: 0, Time elapsed: 23.493 sec
    [junit] 2008-03-21 08:11:01.237::INFO:  Shutdown hook executing
    [junit] 2008-03-21 08:11:01.238::INFO:  Shutdown hook complete
    [junit] 2008-03-21 08:11:02.241::INFO:  Shutdown hook complete
    [junit] 2008-03-21 08:11:03.251::INFO:  Shutdown hook complete
    [junit] 2008-03-21 08:11:04.261::INFO:  Shutdown hook complete
    [junit] 2008-03-21 08:11:05.271::INFO:  Shutdown hook complete
    [junit] 2008-03-21 08:11:06.281::INFO:  Shutdown hook complete
    [junit] 2008-03-21 08:11:07.290::INFO:  Shutdown hook complete
    [junit] 2008-03-21 08:11:08.300::INFO:  Shutdown hook complete
    [junit] 2008-03-21 08:11:09.310::INFO:  Shutdown hook complete
    [junit] Running org.apache.solr.analysis.HTMLStripReaderTest
    [junit] Tests run: 9, Failures: 0, Errors: 0, Time elapsed: 0.552 sec
    [junit] Running org.apache.solr.analysis.TestBufferedTokenStream
    [junit] Tests run: 2, Failures: 0, Errors: 0, Time elapsed: 0.862 sec
    [junit] Running org.apache.solr.analysis.TestCapitalizationFilter
    [junit] Tests run: 2, Failures: 0, Errors: 0, Time elapsed: 0.953 sec
    [junit] Running org.apache.solr.analysis.TestHyphenatedWordsFilter
    [junit] Tests run: 1, Failures: 0, Errors: 0, Time elapsed: 0.611 sec
    [junit] Running org.apache.solr.analysis.TestKeepWordFilter
    [junit] Tests run: 1, Failures: 0, Errors: 0, Time elapsed: 0.588 sec
    [junit] Running org.apache.solr.analysis.TestPatternReplaceFilter
    [junit] Tests run: 5, Failures: 0, Errors: 0, Time elapsed: 1.638 sec
    [junit] Running org.apache.solr.analysis.TestPatternTokenizerFactory
    [junit] Tests run: 1, Failures: 0, Errors: 0, Time elapsed: 0.579 sec
    [junit] Running org.apache.solr.analysis.TestPhoneticFilter
    [junit] Tests run: 2, Failures: 0, Errors: 0, Time elapsed: 0.748 sec
    [junit] Running org.apache.solr.analysis.TestRemoveDuplicatesTokenFilter
    [junit] Tests run: 3, Failures: 0, Errors: 0, Time elapsed: 1.618 sec
    [junit] Running org.apache.solr.analysis.TestSynonymFilter
    [junit] Tests run: 7, Failures: 0, Errors: 0, Time elapsed: 2.093 sec
    [junit] Running org.apache.solr.analysis.TestTrimFilter
    [junit] Tests run: 1, Failures: 0, Errors: 0, Time elapsed: 1.095 sec
    [junit] Running org.apache.solr.analysis.TestWordDelimiterFilter
    [junit] Tests run: 4, Failures: 0, Errors: 0, Time elapsed: 12.317 sec
    [junit] Running org.apache.solr.common.SolrDocumentTest
    [junit] Tests run: 4, Failures: 0, Errors: 0, Time elapsed: 0.259 sec
    [junit] Running org.apache.solr.common.params.SolrParamTest
    [junit] Tests run: 1, Failures: 0, Errors: 0, Time elapsed: 0.332 sec
    [junit] Running org.apache.solr.common.util.ContentStreamTest
    [junit] Tests run: 3, Failures: 0, Errors: 0, Time elapsed: 0.36 sec
    [junit] Running org.apache.solr.common.util.IteratorChainTest
    [junit] Tests run: 7, Failures: 0, Errors: 0, Time elapsed: 0.233 sec
    [junit] Running org.apache.solr.common.util.TestXMLEscaping
    [junit] Tests run: 7, Failures: 0, Errors: 0, Time elapsed: 0.238 sec
    [junit] Running org.apache.solr.core.RequestHandlersTest
    [junit] Tests run: 2, Failures: 0, Errors: 0, Time elapsed: 8.45 sec
    [junit] Running org.apache.solr.core.ResourceLoaderTest
    [junit] Tests run: 2, Failures: 0, Errors: 0, Time elapsed: 0.294 sec
    [junit] Running org.apache.solr.core.SolrCoreTest
    [junit] Tests run: 1, Failures: 0, Errors: 0, Time elapsed: 9.353 sec
    [junit] Running org.apache.solr.core.TestBadConfig
    [junit] Tests run: 1, Failures: 0, Errors: 0, Time elapsed: 0.326 sec
    [junit] Running org.apache.solr.core.TestConfig
    [junit] Tests run: 2, Failures: 0, Errors: 0, Time elapsed: 4.621 sec
    [junit] Running org.apache.solr.core.TestQuerySenderListener
    [junit] Tests run: 1, Failures: 0, Errors: 0, Time elapsed: 3.455 sec
    [junit] Running org.apache.solr.handler.AnalysisRequestHandlerTest
    [junit] Tests run: 1, Failures: 0, Errors: 0, Time elapsed: 5.879 sec
    [junit] Running org.apache.solr.handler.MoreLikeThisHandlerTest
    [junit] Tests run: 1, Failures: 0, Errors: 0, Time elapsed: 3.749 sec
    [junit] Running org.apache.solr.handler.SpellCheckerRequestHandlerTest
    [junit] Tests run: 5, Failures: 0, Errors: 0, Time elapsed: 7.592 sec
    [junit] Running org.apache.solr.handler.StandardRequestHandlerTest
    [junit] Tests run: 1, Failures: 0, Errors: 0, Time elapsed: 13.364 sec
    [junit] Running org.apache.solr.handler.TestCSVLoader
    [junit] Tests run: 4, Failures: 0, Errors: 0, Time elapsed: 24.584 sec
    [junit] Running org.apache.solr.handler.XmlUpdateRequestHandlerTest
    [junit] Tests run: 1, Failures: 0, Errors: 0, Time elapsed: 6.233 sec
    [junit] Running org.apache.solr.handler.admin.SystemInfoHandlerTest
    [junit] Tests run: 1, Failures: 0, Errors: 0, Time elapsed: 0.33 sec
    [junit] Running org.apache.solr.handler.component.QueryElevationComponentTest
    [junit] Tests run: 3, Failures: 0, Errors: 0, Time elapsed: 14.082 sec
    [junit] Running org.apache.solr.handler.component.SearchHandlerTest
    [junit] Tests run: 1, Failures: 0, Errors: 0, Time elapsed: 3.491 sec
    [junit] Running org.apache.solr.highlight.HighlighterConfigTest
    [junit] Tests run: 1, Failures: 0, Errors: 0, Time elapsed: 6.915 sec
    [junit] Running org.apache.solr.highlight.HighlighterTest
    [junit] Tests run: 15, Failures: 0, Errors: 0, Time elapsed: 63.472 sec
    [junit] Running org.apache.solr.request.JSONWriterTest
    [junit] Tests run: 1, Failures: 0, Errors: 0, Time elapsed: 2.684 sec
    [junit] Running org.apache.solr.schema.BadIndexSchemaTest
    [junit] Tests run: 1, Failures: 0, Errors: 0, Time elapsed: 4.425 sec
    [junit] Running org.apache.solr.schema.IndexSchemaTest
    [junit] Tests run: 1, Failures: 0, Errors: 0, Time elapsed: 6.21 sec
    [junit] Running org.apache.solr.schema.NotRequiredUniqueKeyTest
    [junit] Tests run: 1, Failures: 0, Errors: 0, Time elapsed: 1.764 sec
    [junit] Running org.apache.solr.schema.RequiredFieldsTest
    [junit] Tests run: 3, Failures: 0, Errors: 0, Time elapsed: 13.506 sec
    [junit] Running org.apache.solr.schema.UUIDFieldTest
    [junit] Tests run: 1, Failures: 0, Errors: 0, Time elapsed: 1.015 sec
    [junit] Running org.apache.solr.search.TestDocSet
    [junit] Tests run: 1, Failures: 0, Errors: 0, Time elapsed: 6.245 sec
    [junit] Running org.apache.solr.search.TestQueryTypes
    [junit] Tests run: 1, Failures: 0, Errors: 0, Time elapsed: 4.721 sec
    [junit] Running org.apache.solr.search.TestQueryUtils
    [junit] Tests run: 1, Failures: 0, Errors: 0, Time elapsed: 11.53 sec
    [junit] Running org.apache.solr.search.function.TestFunctionQuery
    [junit] Tests run: 2, Failures: 0, Errors: 0, Time elapsed: 32.205 sec
    [junit] Running org.apache.solr.servlet.CacheHeaderTest
    [junit] Tests run: 3, Failures: 0, Errors: 0, Time elapsed: 23.501 sec
    [junit] 2008-03-21 12:10:24.770::INFO:  Shutdown hook executing
    [junit] 2008-03-21 12:10:24.770::INFO:  Shutdown hook complete
    [junit] 2008-03-21 12:10:26.192::INFO:  Shutdown hook complete
    [junit] 2008-03-21 12:10:27.200::INFO:  Shutdown hook complete
    [junit] Running org.apache.solr.servlet.DirectSolrConnectionTest
    [junit] Tests run: 2, Failures: 0, Errors: 0, Time elapsed: 2.245 sec
    [junit] Running org.apache.solr.servlet.NoCacheHeaderTest
    [junit] Tests run: 3, Failures: 0, Errors: 0, Time elapsed: 22.911 sec
    [junit] 2008-03-21 12:10:56.297::INFO:  Shutdown hook executing
    [junit] 2008-03-21 12:10:56.297::INFO:  Shutdown hook complete
    [junit] 2008-03-21 12:10:57.306::INFO:  Shutdown hook complete
    [junit] 2008-03-21 12:10:58.315::INFO:  Shutdown hook complete
    [junit] Running org.apache.solr.servlet.SolrRequestParserTest
    [junit] Tests run: 4, Failures: 0, Errors: 0, Time elapsed: 29.135 sec
    [junit] Running org.apache.solr.update.AutoCommitTest
    [junit] Tests run: 3, Failures: 1, Errors: 0, Time elapsed: 13.715 sec
    [junit] java.lang.RuntimeException: java.io.FileNotFoundException: no segments* file found
in org.apache.lucene.store.FSDirectory@/var/tmp/org.apache.solr.update.AutoCommitTest-1206101502050/index:
files:
    [junit] 	at org.apache.solr.core.SolrCore.getSearcher(SolrCore.java:726)
    [junit] 	at org.apache.solr.update.DirectUpdateHandler2.commit(DirectUpdateHandler2.java:557)
    [junit] 	at org.apache.solr.update.DirectUpdateHandler2$CommitTracker.run(DirectUpdateHandler2.java:706)
    [junit] 	at java.util.concurrent.Executors$RunnableAdapter.call(Executors.java:417)
    [junit] 	at java.util.concurrent.FutureTask$Sync.innerRun(FutureTask.java:269)
    [junit] 	at java.util.concurrent.FutureTask.run(FutureTask.java:123)
    [junit] 	at java.util.concurrent.ScheduledThreadPoolExecutor$ScheduledFutureTask.access$301(ScheduledThreadPoolExecutor.java:65)
    [junit] 	at java.util.concurrent.ScheduledThreadPoolExecutor$ScheduledFutureTask.run(ScheduledThreadPoolExecutor.java:168)
    [junit] 	at java.util.concurrent.ThreadPoolExecutor$Worker.runTask(ThreadPoolExecutor.java:650)
    [junit] 	at java.util.concurrent.ThreadPoolExecutor$Worker.run(ThreadPoolExecutor.java:675)
    [junit] 	at java.lang.Thread.run(Thread.java:595)
    [junit] Caused by: java.io.FileNotFoundException: no segments* file found in org.apache.lucene.store.FSDirectory@/var/tmp/org.apache.solr.update.AutoCommitTest-1206101502050/index:
files:
    [junit] 	at org.apache.lucene.index.SegmentInfos$FindSegmentsFile.run(SegmentInfos.java:587)
    [junit] 	at org.apache.lucene.index.DirectoryIndexReader.open(DirectoryIndexReader.java:63)
    [junit] 	at org.apache.lucene.index.IndexReader.open(IndexReader.java:209)
    [junit] 	at org.apache.lucene.index.IndexReader.open(IndexReader.java:173)
    [junit] 	at org.apache.solr.search.SolrIndexSearcher.<init>(SolrIndexSearcher.java:93)
    [junit] 	at org.apache.solr.core.SolrCore.getSearcher(SolrCore.java:717)
    [junit] 	... 10 more
    [junit] Test org.apache.solr.update.AutoCommitTest FAILED
    [junit] Running org.apache.solr.update.DirectUpdateHandlerTest
    [junit] Tests run: 1, Failures: 0, Errors: 0, Time elapsed: 10.036 sec
    [junit] Running org.apache.solr.update.DocumentBuilderTest
    [junit] Tests run: 2, Failures: 0, Errors: 0, Time elapsed: 3.252 sec
    [junit] Running org.apache.solr.update.processor.UpdateRequestProcessorFactoryTest
    [junit] Tests run: 1, Failures: 0, Errors: 0, Time elapsed: 2.083 sec
    [junit] Running org.apache.solr.util.DateMathParserTest
    [junit] Tests run: 7, Failures: 0, Errors: 0, Time elapsed: 0.328 sec
    [junit] Running org.apache.solr.util.SolrPluginUtilsTest
    [junit] Tests run: 5, Failures: 0, Errors: 0, Time elapsed: 11.661 sec
    [junit] Running org.apache.solr.util.TestCharArrayMap
    [junit] Tests run: 2, Failures: 0, Errors: 0, Time elapsed: 0.969 sec
    [junit] Running org.apache.solr.util.TestOpenBitSet
    [junit] Tests run: 3, Failures: 0, Errors: 0, Time elapsed: 1.292 sec
    [junit] Running org.apache.solr.util.TestUtils
    [junit] Tests run: 1, Failures: 0, Errors: 0, Time elapsed: 1.114 sec
    [junit] Running org.apache.solr.client.solrj.SolrExceptionTest
    [junit] Tests run: 1, Failures: 0, Errors: 0, Time elapsed: 1.533 sec
    [junit] Running org.apache.solr.client.solrj.SolrQueryTest
    [junit] Tests run: 1, Failures: 0, Errors: 0, Time elapsed: 3.327 sec
    [junit] Running org.apache.solr.client.solrj.embedded.LargeVolumeEmbeddedTest
    [junit] Tests run: 1, Failures: 0, Errors: 0, Time elapsed: 3.212 sec
    [junit] Running org.apache.solr.client.solrj.embedded.LargeVolumeJettyTest
    [junit] Tests run: 1, Failures: 0, Errors: 0, Time elapsed: 10.455 sec
    [junit] 2008-03-21 12:15:27.541::INFO:  Shutdown hook executing
    [junit] 2008-03-21 12:15:27.557::INFO:  Shutdown hook complete
    [junit] Running org.apache.solr.client.solrj.embedded.MultiCoreEmbeddedTest
    [junit] Tests run: 1, Failures: 0, Errors: 0, Time elapsed: 9.635 sec
    [junit] Running org.apache.solr.client.solrj.embedded.MultiCoreExampleJettyTest
    [junit] Tests run: 1, Failures: 0, Errors: 0, Time elapsed: 6.435 sec
    [junit] 2008-03-21 12:15:46.221::INFO:  Shutdown hook executing
    [junit] 2008-03-21 12:15:46.221::INFO:  Shutdown hook complete
    [junit] Running org.apache.solr.client.solrj.embedded.SolrExampleEmbeddedTest
    [junit] Tests run: 6, Failures: 0, Errors: 0, Time elapsed: 18.893 sec
    [junit] Running org.apache.solr.client.solrj.embedded.SolrExampleJettyTest
    [junit] Tests run: 6, Failures: 0, Errors: 0, Time elapsed: 24.236 sec
    [junit] 2008-03-21 12:26:24.830::INFO:  Shutdown hook executing
    [junit] 2008-03-21 12:26:24.830::INFO:  Shutdown hook complete
    [junit] 2008-03-21 12:26:25.837::INFO:  Shutdown hook complete
    [junit] 2008-03-21 12:26:26.845::INFO:  Shutdown hook complete
    [junit] 2008-03-21 12:26:27.854::INFO:  Shutdown hook complete
    [junit] 2008-03-21 12:26:28.864::INFO:  Shutdown hook complete
    [junit] 2008-03-21 12:26:29.874::INFO:  Shutdown hook complete
    [junit] Running org.apache.solr.client.solrj.response.QueryResponseTest
    [junit] Tests run: 1, Failures: 1, Errors: 0, Time elapsed: 0.242 sec
    [junit] Test org.apache.solr.client.solrj.response.QueryResponseTest FAILED
    [junit] Running org.apache.solr.client.solrj.util.ClientUtilsTest
    [junit] Tests run: 1, Failures: 0, Errors: 0, Time elapsed: 0.28 sec

BUILD FAILED
/tmp/apache-solr-nightly/build.xml:498: Tests failed!

Total time: 257 minutes 55 seconds



Mime
View raw message